SHARE
TWEET

Untitled

a guest Jan 9th, 2013 15 Never
Not a member of Pastebin yet? Sign Up, it unlocks many cool features!
  1. Test Summary
  2. Sims Not Finishing: 0
  3. Tests Passed: 937
  4. Tests Failed: 55
  5. Tests Errored: 0
  6.  
  7. Relative error tolerance: 1e-3
  8. Bitwise tests not included
  9.  
  10.  
  11. Tests that passed:
  12. OneZoneFreefallTest__test_freefall.test_freefall: PASS
  13. OneZoneFreefallTest__test_freefall.test_freefall: PASS
  14. OneZoneFreefallTest__test_standard.test_exist: PASS
  15. OneZoneFreefallTest__test_standard.test_standard: PASS
  16. OneZoneFreefallTest__test_standard.test_standard: PASS
  17. OneZoneFreefallTest__test_standard.test_standard: PASS
  18. OneZoneFreefallTest__test_standard.test_standard: PASS
  19. OneZoneFreefallTest__test_standard.test_standard: PASS
  20. OneZoneFreefallTest__test_standard.test_standard: PASS
  21. OneZoneFreefallTest__test_standard.test_standard: PASS
  22. OneZoneFreefallTest__test_standard.test_standard: PASS
  23. OneZoneFreefallTest__test_standard.test_standard: PASS
  24. OneZoneFreefallTest__test_standard.test_standard: PASS
  25. OneZoneFreefallTest__test_standard.test_standard: PASS
  26. OneZoneFreefallTest__test_standard.test_standard: PASS
  27. OneZoneFreefallTest__test_standard.test_standard: PASS
  28. OneZoneFreefallTest__test_standard.test_standard: PASS
  29. OneZoneFreefallTest__test_standard.test_standard: PASS
  30. OneZoneFreefallTest__test_standard.test_standard: PASS
  31. OneZoneFreefallTest__test_standard.test_standard: PASS
  32. OneZoneFreefallTest__test_standard.test_standard: PASS
  33. OneZoneFreefallTest__test_standard.test_standard: PASS
  34. OneZoneFreefallTest__test_standard.test_standard: PASS
  35. OneZoneFreefallTest__test_standard.test_standard: PASS
  36. OneZoneFreefallTest__test_standard.test_standard: PASS
  37. AMRZeldovichPancake__test_almost_standard.test_exist: PASS
  38. AMRZeldovichPancake__test_almost_standard.test_standard: PASS
  39. AMRZeldovichPancake__test_almost_standard.test_standard: PASS
  40. AMRZeldovichPancake__test_almost_standard.test_standard: PASS
  41. AMRZeldovichPancake__test_almost_standard.test_standard: PASS
  42. AMRZeldovichPancake__test_almost_standard.test_standard: PASS
  43. AMRZeldovichPancake__test_almost_standard.test_standard: PASS
  44. AMRZeldovichPancake__test_almost_standard.test_standard: PASS
  45. AMRZeldovichPancake__test_almost_standard.test_standard: PASS
  46. AdiabaticExpansion__test_standard.test_exist: PASS
  47. AdiabaticExpansion__test_standard.test_standard: PASS
  48. MHDZeldovichPancake__test_standard.test_exist: PASS
  49. MHDZeldovichPancake__test_standard.test_standard: PASS
  50. MHDZeldovichPancake__test_standard.test_standard: PASS
  51. MHDZeldovichPancake__test_standard.test_standard: PASS
  52. MHDZeldovichPancake__test_standard.test_standard: PASS
  53. MHDZeldovichPancake__test_standard.test_standard: PASS
  54. MHDZeldovichPancake__test_standard.test_standard: PASS
  55. MHDZeldovichPancake__test_standard.test_standard: PASS
  56. MHDZeldovichPancake__test_standard.test_standard: PASS
  57. MHDZeldovichPancake__test_standard.test_standard: PASS
  58. MHDZeldovichPancake__test_standard.test_standard: PASS
  59. MHDZeldovichPancake__test_standard.test_standard: PASS
  60. MHDZeldovichPancake__test_standard.test_standard: PASS
  61. MHDZeldovichPancake__test_standard.test_standard: PASS
  62. MHDZeldovichPancake__test_standard.test_standard: PASS
  63. MHDZeldovichPancake__test_standard.test_standard: PASS
  64. MHDZeldovichPancake__test_standard.test_standard: PASS
  65. MHDZeldovichPancake__test_standard.test_standard: PASS
  66. MHDZeldovichPancake__test_standard.test_standard: PASS
  67. MHDZeldovichPancake__test_standard.test_standard: PASS
  68. MHDZeldovichPancake__test_standard.test_standard: PASS
  69. MHDZeldovichPancake__test_standard.test_standard: PASS
  70. MHDZeldovichPancake__test_standard.test_standard: PASS
  71. MHDZeldovichPancake__test_standard.test_standard: PASS
  72. MHDZeldovichPancake__test_standard.test_standard: PASS
  73. MHDZeldovichPancake__test_standard.test_standard: PASS
  74. ZeldovichPancake__test_almost_standard.test_exist: PASS
  75. ZeldovichPancake__test_almost_standard.test_almost_standard: PASS
  76. ZeldovichPancake__test_almost_standard.test_almost_standard: PASS
  77. ZeldovichPancake__test_almost_standard.test_almost_standard: PASS
  78. ZeldovichPancake__test_almost_standard.test_almost_standard: PASS
  79. ZeldovichPancake__test_almost_standard.test_almost_standard: PASS
  80. ZeldovichPancake__test_almost_standard.test_almost_standard: PASS
  81. ZeldovichPancake__test_almost_standard.test_almost_standard: PASS
  82. ZeldovichPancake__test_almost_standard.test_almost_standard: PASS
  83. GravityTestSphere__test_standard.test_exist: PASS
  84. GravityTestSphere__test_standard.test_standard: PASS
  85. GravityTestSphere__test_standard.test_standard: PASS
  86. GravityTestSphere__test_standard.test_standard: PASS
  87. GravityTestSphere__test_standard.test_standard: PASS
  88. GravityTestSphere__test_standard.test_standard: PASS
  89. GravityTestSphere__test_standard.test_standard: PASS
  90. GravityTestSphere__test_standard.test_standard: PASS
  91. GravityTestSphere__test_standard.test_standard: PASS
  92. TestOrbit__test_orbit.test_orbit: PASS
  93. TestOrbit__test_orbit.test_orbit: PASS
  94. TestOrbit__test_standard.test_exist: PASS
  95. TestOrbit__test_standard.test_standard: PASS
  96. FreeExpansion__test_free_expansion.test_collapse_max_value: PASS
  97. FreeExpansion__test_standard.test_exist: PASS
  98. FreeExpansion__test_standard.test_standard: PASS
  99. FreeExpansion__test_standard.test_standard: PASS
  100. FreeExpansion__test_standard.test_standard: PASS
  101. FreeExpansion__test_standard.test_standard: PASS
  102. FreeExpansion__test_standard.test_standard: PASS
  103. FreeExpansion__test_standard.test_standard: PASS
  104. FreeExpansion__test_standard.test_standard: PASS
  105. FreeExpansion__test_standard.test_standard: PASS
  106. FreeExpansion__test_standard.test_standard: PASS
  107. FreeExpansion__test_standard.test_standard: PASS
  108. FreeExpansion__test_standard.test_standard: PASS
  109. FreeExpansion__test_standard.test_standard: PASS
  110. FreeExpansion__test_standard.test_standard: PASS
  111. FreeExpansion__test_standard.test_standard: PASS
  112. FreeExpansion__test_standard.test_standard: PASS
  113. FreeExpansion__test_standard.test_standard: PASS
  114. FreeExpansion__test_standard.test_standard: PASS
  115. FreeExpansion__test_standard.test_standard: PASS
  116. FreeExpansion__test_standard.test_standard: PASS
  117. FreeExpansion__test_standard.test_standard: PASS
  118. FreeExpansion__test_standard.test_standard: PASS
  119. FreeExpansion__test_standard.test_standard: PASS
  120. FreeExpansion__test_standard.test_standard: PASS
  121. FreeExpansion__test_standard.test_standard: PASS
  122. FreeExpansion__test_standard.test_standard: PASS
  123. FreeExpansion__test_standard.test_standard: PASS
  124. FreeExpansion__test_standard.test_standard: PASS
  125. FreeExpansion__test_standard.test_standard: PASS
  126. FreeExpansion__test_standard.test_standard: PASS
  127. InteractingBlastWaves__test_standard.test_exist: PASS
  128. InteractingBlastWaves__test_standard.test_standard: PASS
  129. InteractingBlastWaves__test_standard.test_standard: PASS
  130. InteractingBlastWaves__test_standard.test_standard: PASS
  131. InteractingBlastWaves__test_standard.test_standard: PASS
  132. InteractingBlastWaves__test_standard.test_standard: PASS
  133. InteractingBlastWaves__test_standard.test_standard: PASS
  134. InteractingBlastWaves__test_standard.test_standard: PASS
  135. InteractingBlastWaves__test_standard.test_standard: PASS
  136. InteractingBlastWaves__test_standard.test_standard: PASS
  137. InteractingBlastWaves__test_standard.test_standard: PASS
  138. InteractingBlastWaves__test_standard.test_standard: PASS
  139. InteractingBlastWaves__test_standard.test_standard: PASS
  140. InteractingBlastWaves__test_standard.test_standard: PASS
  141. InteractingBlastWaves__test_standard.test_standard: PASS
  142. InteractingBlastWaves__test_standard.test_standard: PASS
  143. InteractingBlastWaves__test_standard.test_standard: PASS
  144. InteractingBlastWaves__test_standard.test_standard: PASS
  145. InteractingBlastWaves__test_standard.test_standard: PASS
  146. InteractingBlastWaves__test_standard.test_standard: PASS
  147. InteractingBlastWaves__test_standard.test_standard: PASS
  148. InteractingBlastWaves__test_standard.test_standard: PASS
  149. InteractingBlastWaves__test_standard.test_standard: PASS
  150. InteractingBlastWaves__test_standard.test_standard: PASS
  151. InteractingBlastWaves__test_standard.test_standard: PASS
  152. InteractingBlastWaves__test_standard.test_standard: PASS
  153. InteractingBlastWaves__test_standard.test_standard: PASS
  154. InteractingBlastWaves__test_standard.test_standard: PASS
  155. InteractingBlastWaves__test_standard.test_standard: PASS
  156. InteractingBlastWaves__test_standard.test_standard: PASS
  157. PressurelessCollapse__test_standard.test_exist: PASS
  158. PressurelessCollapse__test_standard.test_standard: PASS
  159. PressurelessCollapse__test_standard.test_standard: PASS
  160. PressurelessCollapse__test_standard.test_standard: PASS
  161. PressurelessCollapse__test_standard.test_standard: PASS
  162. PressurelessCollapse__test_standard.test_standard: PASS
  163. PressurelessCollapse__test_standard.test_standard: PASS
  164. PressurelessCollapse__test_standard.test_standard: PASS
  165. PressurelessCollapse__test_standard.test_standard: PASS
  166. PressurelessCollapse__test_standard.test_standard: PASS
  167. PressurelessCollapse__test_standard.test_standard: PASS
  168. PressurelessCollapse__test_standard.test_standard: PASS
  169. PressurelessCollapse__test_standard.test_standard: PASS
  170. PressurelessCollapse__test_standard.test_standard: PASS
  171. PressurelessCollapse__test_standard.test_standard: PASS
  172. PressurelessCollapse__test_standard.test_standard: PASS
  173. SodShockTube__test_sod.test_sod: PASS
  174. SodShockTube__test_sod.test_sod: PASS
  175. SodShockTube__test_sod.test_sod: PASS
  176. SodShockTube__test_sod.test_sod: PASS
  177. SodShockTube__test_standard.test_exist: PASS
  178. SodShockTube__test_standard.test_standard: PASS
  179. SodShockTube__test_standard.test_standard: PASS
  180. SodShockTube__test_standard.test_standard: PASS
  181. SodShockTube__test_standard.test_standard: PASS
  182. SodShockTube__test_standard.test_standard: PASS
  183. SodShockTube__test_standard.test_standard: PASS
  184. SodShockTube__test_standard.test_standard: PASS
  185. SodShockTube__test_standard.test_standard: PASS
  186. SodShockTube__test_standard.test_standard: PASS
  187. SodShockTube__test_standard.test_standard: PASS
  188. SodShockTube__test_standard.test_standard: PASS
  189. SodShockTube__test_standard.test_standard: PASS
  190. SodShockTube__test_standard.test_standard: PASS
  191. SodShockTube__test_standard.test_standard: PASS
  192. SodShockTube__test_standard.test_standard: PASS
  193. SodShockTube__test_standard.test_standard: PASS
  194. SodShockTube__test_standard.test_standard: PASS
  195. SodShockTube__test_standard.test_standard: PASS
  196. SodShockTube__test_standard.test_standard: PASS
  197. SodShockTube__test_standard.test_standard: PASS
  198. SodShockTube__test_standard.test_standard: PASS
  199. SodShockTube__test_standard.test_standard: PASS
  200. SodShockTube__test_standard.test_standard: PASS
  201. SodShockTube__test_standard.test_standard: PASS
  202. SodShockTube__test_standard.test_standard: PASS
  203. SodShockTube__test_standard.test_standard: PASS
  204. SodShockTube__test_standard.test_standard: PASS
  205. SodShockTube__test_standard.test_standard: PASS
  206. SodShockTube__test_standard.test_standard: PASS
  207. Toro-1-ShockTube__test_standard.test_exist: PASS
  208. Toro-1-ShockTube__test_standard.test_standard: PASS
  209. Toro-1-ShockTube__test_standard.test_standard: PASS
  210. Toro-1-ShockTube__test_standard.test_standard: PASS
  211. Toro-1-ShockTube__test_standard.test_standard: PASS
  212. Toro-1-ShockTube__test_standard.test_standard: PASS
  213. Toro-1-ShockTube__test_standard.test_standard: PASS
  214. Toro-1-ShockTube__test_standard.test_standard: PASS
  215. Toro-1-ShockTube__test_standard.test_standard: PASS
  216. Toro-1-ShockTube__test_standard.test_standard: PASS
  217. Toro-1-ShockTube__test_standard.test_standard: PASS
  218. Toro-1-ShockTube__test_standard.test_standard: PASS
  219. Toro-1-ShockTube__test_standard.test_standard: PASS
  220. Toro-1-ShockTube__test_standard.test_standard: PASS
  221. Toro-1-ShockTube__test_standard.test_standard: PASS
  222. Toro-1-ShockTube__test_standard.test_standard: PASS
  223. Toro-1-ShockTube__test_standard.test_standard: PASS
  224. Toro-1-ShockTube__test_standard.test_standard: PASS
  225. Toro-1-ShockTube__test_standard.test_standard: PASS
  226. Toro-1-ShockTube__test_standard.test_standard: PASS
  227. Toro-1-ShockTube__test_standard.test_standard: PASS
  228. Toro-1-ShockTube__test_standard.test_standard: PASS
  229. Toro-1-ShockTube__test_standard.test_standard: PASS
  230. Toro-1-ShockTube__test_standard.test_standard: PASS
  231. Toro-1-ShockTube__test_standard.test_standard: PASS
  232. Toro-1-ShockTube__test_standard.test_standard: PASS
  233. Toro-1-ShockTube__test_standard.test_standard: PASS
  234. Toro-1-ShockTube__test_standard.test_standard: PASS
  235. Toro-1-ShockTube__test_standard.test_standard: PASS
  236. Toro-1-ShockTube__test_standard.test_standard: PASS
  237. Toro-1-ShockTube__test_toro1.test_toro1: PASS
  238. Toro-1-ShockTube__test_toro1.test_toro1: PASS
  239. Toro-1-ShockTube__test_toro1.test_toro1: PASS
  240. Toro-1-ShockTube__test_toro1.test_toro1: PASS
  241. Toro-1-ShockTube__test_toro1.test_toro1: PASS
  242. Toro-1-ShockTube__test_toro1.test_toro1: PASS
  243. Toro-1-ShockTube__test_toro1.test_toro1: PASS
  244. Toro-1-ShockTube__test_toro1.test_toro1: PASS
  245. Toro-1-ShockTubeAMR__test_standard.test_exist: PASS
  246. Toro-1-ShockTubeAMR__test_standard.test_standard: PASS
  247. Toro-1-ShockTubeAMR__test_standard.test_standard: PASS
  248. Toro-1-ShockTubeAMR__test_standard.test_standard: PASS
  249. Toro-1-ShockTubeAMR__test_standard.test_standard: PASS
  250. Toro-1-ShockTubeAMR__test_standard.test_standard: PASS
  251. Toro-1-ShockTubeAMR__test_standard.test_standard: PASS
  252. Toro-1-ShockTubeAMR__test_standard.test_standard: PASS
  253. Toro-1-ShockTubeAMR__test_standard.test_standard: PASS
  254. Toro-1-ShockTubeAMR__test_standard.test_standard: PASS
  255. Toro-1-ShockTubeAMR__test_standard.test_standard: PASS
  256. Toro-1-ShockTubeAMR__test_standard.test_standard: PASS
  257. Toro-1-ShockTubeAMR__test_standard.test_standard: PASS
  258. Toro-1-ShockTubeAMR__test_standard.test_standard: PASS
  259. Toro-1-ShockTubeAMR__test_standard.test_standard: PASS
  260. Toro-1-ShockTubeAMR__test_standard.test_standard: PASS
  261. Toro-1-ShockTubeAMR__test_standard.test_standard: PASS
  262. Toro-1-ShockTubeAMR__test_standard.test_standard: PASS
  263. Toro-1-ShockTubeAMR__test_standard.test_standard: PASS
  264. Toro-1-ShockTubeAMR__test_standard.test_standard: PASS
  265. Toro-1-ShockTubeAMR__test_standard.test_standard: PASS
  266. Toro-1-ShockTubeAMR__test_standard.test_standard: PASS
  267. Toro-1-ShockTubeAMR__test_standard.test_standard: PASS
  268. Toro-1-ShockTubeAMR__test_standard.test_standard: PASS
  269. Toro-1-ShockTubeAMR__test_standard.test_standard: PASS
  270. Toro-1-ShockTubeAMR__test_standard.test_standard: PASS
  271. Toro-1-ShockTubeAMR__test_standard.test_standard: PASS
  272. Toro-1-ShockTubeAMR__test_standard.test_standard: PASS
  273. Toro-1-ShockTubeAMR__test_standard.test_standard: PASS
  274. Toro-1-ShockTubeAMR__test_standard.test_standard: PASS
  275. Toro-1-ShockTubeAMR__test_toro1_amr.test_toro1_amr: PASS
  276. Toro-1-ShockTubeAMR__test_toro1_amr.test_toro1_amr: PASS
  277. Toro-1-ShockTubeAMR__test_toro1_amr.test_toro1_amr: PASS
  278. Toro-1-ShockTubeAMR__test_toro1_amr.test_toro1_amr: PASS
  279. Toro-1-ShockTubeAMR__test_toro1_amr.test_toro1_amr: PASS
  280. Toro-1-ShockTubeAMR__test_toro1_amr.test_toro1_amr: PASS
  281. Toro-1-ShockTubeAMR__test_toro1_amr.test_toro1_amr: PASS
  282. Toro-1-ShockTubeAMR__test_toro1_amr.test_toro1_amr: PASS
  283. Toro-2-ShockTube__test_standard.test_exist: PASS
  284. Toro-2-ShockTube__test_standard.test_standard: PASS
  285. Toro-2-ShockTube__test_standard.test_standard: PASS
  286. Toro-2-ShockTube__test_standard.test_standard: PASS
  287. Toro-2-ShockTube__test_standard.test_standard: PASS
  288. Toro-2-ShockTube__test_standard.test_standard: PASS
  289. Toro-2-ShockTube__test_standard.test_standard: PASS
  290. Toro-2-ShockTube__test_standard.test_standard: PASS
  291. Toro-2-ShockTube__test_standard.test_standard: PASS
  292. Toro-2-ShockTube__test_standard.test_standard: PASS
  293. Toro-2-ShockTube__test_standard.test_standard: PASS
  294. Toro-2-ShockTube__test_standard.test_standard: PASS
  295. Toro-2-ShockTube__test_standard.test_standard: PASS
  296. Toro-2-ShockTube__test_standard.test_standard: PASS
  297. Toro-2-ShockTube__test_standard.test_standard: PASS
  298. Toro-2-ShockTube__test_standard.test_standard: PASS
  299. Toro-2-ShockTube__test_standard.test_standard: PASS
  300. Toro-2-ShockTube__test_standard.test_standard: PASS
  301. Toro-2-ShockTube__test_standard.test_standard: PASS
  302. Toro-2-ShockTube__test_standard.test_standard: PASS
  303. Toro-2-ShockTube__test_standard.test_standard: PASS
  304. Toro-2-ShockTube__test_standard.test_standard: PASS
  305. Toro-2-ShockTube__test_standard.test_standard: PASS
  306. Toro-2-ShockTube__test_standard.test_standard: PASS
  307. Toro-2-ShockTube__test_standard.test_standard: PASS
  308. Toro-2-ShockTube__test_standard.test_standard: PASS
  309. Toro-2-ShockTube__test_standard.test_standard: PASS
  310. Toro-2-ShockTube__test_standard.test_standard: PASS
  311. Toro-2-ShockTube__test_standard.test_standard: PASS
  312. Toro-2-ShockTube__test_standard.test_standard: PASS
  313. Toro-2-ShockTube__test_toro2.test_toro2: PASS
  314. Toro-2-ShockTube__test_toro2.test_toro2: PASS
  315. Toro-2-ShockTube__test_toro2.test_toro2: PASS
  316. Toro-2-ShockTube__test_toro2.test_toro2: PASS
  317. Toro-2-ShockTubeAMR__test_standard.test_exist: PASS
  318. Toro-2-ShockTubeAMR__test_standard.test_standard: PASS
  319. Toro-2-ShockTubeAMR__test_standard.test_standard: PASS
  320. Toro-2-ShockTubeAMR__test_standard.test_standard: PASS
  321. Toro-2-ShockTubeAMR__test_standard.test_standard: PASS
  322. Toro-2-ShockTubeAMR__test_standard.test_standard: PASS
  323. Toro-2-ShockTubeAMR__test_standard.test_standard: PASS
  324. Toro-2-ShockTubeAMR__test_standard.test_standard: PASS
  325. Toro-2-ShockTubeAMR__test_standard.test_standard: PASS
  326. Toro-2-ShockTubeAMR__test_standard.test_standard: PASS
  327. Toro-2-ShockTubeAMR__test_standard.test_standard: PASS
  328. Toro-2-ShockTubeAMR__test_standard.test_standard: PASS
  329. Toro-2-ShockTubeAMR__test_standard.test_standard: PASS
  330. Toro-2-ShockTubeAMR__test_standard.test_standard: PASS
  331. Toro-2-ShockTubeAMR__test_standard.test_standard: PASS
  332. Toro-2-ShockTubeAMR__test_standard.test_standard: PASS
  333. Toro-2-ShockTubeAMR__test_standard.test_standard: PASS
  334. Toro-2-ShockTubeAMR__test_standard.test_standard: PASS
  335. Toro-2-ShockTubeAMR__test_standard.test_standard: PASS
  336. Toro-2-ShockTubeAMR__test_standard.test_standard: PASS
  337. Toro-2-ShockTubeAMR__test_standard.test_standard: PASS
  338. Toro-2-ShockTubeAMR__test_standard.test_standard: PASS
  339. Toro-2-ShockTubeAMR__test_standard.test_standard: PASS
  340. Toro-2-ShockTubeAMR__test_standard.test_standard: PASS
  341. Toro-2-ShockTubeAMR__test_standard.test_standard: PASS
  342. Toro-2-ShockTubeAMR__test_standard.test_standard: PASS
  343. Toro-2-ShockTubeAMR__test_standard.test_standard: PASS
  344. Toro-2-ShockTubeAMR__test_standard.test_standard: PASS
  345. Toro-2-ShockTubeAMR__test_standard.test_standard: PASS
  346. Toro-2-ShockTubeAMR__test_standard.test_standard: PASS
  347. Toro-2-ShockTubeAMR__test_toro2_amr.test_toro2_amr: PASS
  348. Toro-2-ShockTubeAMR__test_toro2_amr.test_toro2_amr: PASS
  349. Toro-2-ShockTubeAMR__test_toro2_amr.test_toro2_amr: PASS
  350. Toro-2-ShockTubeAMR__test_toro2_amr.test_toro2_amr: PASS
  351. Toro-2-ShockTubeAMR__test_toro2_amr.test_toro2_amr: PASS
  352. Toro-2-ShockTubeAMR__test_toro2_amr.test_toro2_amr: PASS
  353. Toro-2-ShockTubeAMR__test_toro2_amr.test_toro2_amr: PASS
  354. Toro-2-ShockTubeAMR__test_toro2_amr.test_toro2_amr: PASS
  355. Toro-3-ShockTube__test_standard.test_exist: PASS
  356. Toro-3-ShockTube__test_standard.test_standard: PASS
  357. Toro-3-ShockTube__test_standard.test_standard: PASS
  358. Toro-3-ShockTube__test_standard.test_standard: PASS
  359. Toro-3-ShockTube__test_standard.test_standard: PASS
  360. Toro-3-ShockTube__test_standard.test_standard: PASS
  361. Toro-3-ShockTube__test_standard.test_standard: PASS
  362. Toro-3-ShockTube__test_standard.test_standard: PASS
  363. Toro-3-ShockTube__test_standard.test_standard: PASS
  364. Toro-3-ShockTube__test_standard.test_standard: PASS
  365. Toro-3-ShockTube__test_standard.test_standard: PASS
  366. Toro-3-ShockTube__test_standard.test_standard: PASS
  367. Toro-3-ShockTube__test_standard.test_standard: PASS
  368. Toro-3-ShockTube__test_standard.test_standard: PASS
  369. Toro-3-ShockTube__test_standard.test_standard: PASS
  370. Toro-3-ShockTube__test_standard.test_standard: PASS
  371. Toro-3-ShockTube__test_standard.test_standard: PASS
  372. Toro-3-ShockTube__test_standard.test_standard: PASS
  373. Toro-3-ShockTube__test_standard.test_standard: PASS
  374. Toro-3-ShockTube__test_standard.test_standard: PASS
  375. Toro-3-ShockTube__test_standard.test_standard: PASS
  376. Toro-3-ShockTube__test_standard.test_standard: PASS
  377. Toro-3-ShockTube__test_standard.test_standard: PASS
  378. Toro-3-ShockTube__test_standard.test_standard: PASS
  379. Toro-3-ShockTube__test_standard.test_standard: PASS
  380. Toro-3-ShockTube__test_standard.test_standard: PASS
  381. Toro-3-ShockTube__test_standard.test_standard: PASS
  382. Toro-3-ShockTube__test_standard.test_standard: PASS
  383. Toro-3-ShockTube__test_standard.test_standard: PASS
  384. Toro-3-ShockTube__test_standard.test_standard: PASS
  385. Toro-3-ShockTube__test_toro3.test_toro3: PASS
  386. Toro-3-ShockTube__test_toro3.test_toro3: PASS
  387. Toro-3-ShockTube__test_toro3.test_toro3: PASS
  388. Toro-3-ShockTube__test_toro3.test_toro3: PASS
  389. Toro-3-ShockTube__test_toro3.test_toro3: PASS
  390. Toro-3-ShockTube__test_toro3.test_toro3: PASS
  391. Toro-3-ShockTube__test_toro3.test_toro3: PASS
  392. Toro-3-ShockTube__test_toro3.test_toro3: PASS
  393. Toro-3-ShockTubeAMR__test_standard.test_exist: PASS
  394. Toro-3-ShockTubeAMR__test_standard.test_standard: PASS
  395. Toro-3-ShockTubeAMR__test_standard.test_standard: PASS
  396. Toro-3-ShockTubeAMR__test_standard.test_standard: PASS
  397. Toro-3-ShockTubeAMR__test_standard.test_standard: PASS
  398. Toro-3-ShockTubeAMR__test_standard.test_standard: PASS
  399. Toro-3-ShockTubeAMR__test_standard.test_standard: PASS
  400. Toro-3-ShockTubeAMR__test_standard.test_standard: PASS
  401. Toro-3-ShockTubeAMR__test_standard.test_standard: PASS
  402. Toro-3-ShockTubeAMR__test_standard.test_standard: PASS
  403. Toro-3-ShockTubeAMR__test_standard.test_standard: PASS
  404. Toro-3-ShockTubeAMR__test_standard.test_standard: PASS
  405. Toro-3-ShockTubeAMR__test_standard.test_standard: PASS
  406. Toro-3-ShockTubeAMR__test_standard.test_standard: PASS
  407. Toro-3-ShockTubeAMR__test_standard.test_standard: PASS
  408. Toro-3-ShockTubeAMR__test_standard.test_standard: PASS
  409. Toro-3-ShockTubeAMR__test_standard.test_standard: PASS
  410. Toro-3-ShockTubeAMR__test_standard.test_standard: PASS
  411. Toro-3-ShockTubeAMR__test_standard.test_standard: PASS
  412. Toro-3-ShockTubeAMR__test_standard.test_standard: PASS
  413. Toro-3-ShockTubeAMR__test_standard.test_standard: PASS
  414. Toro-3-ShockTubeAMR__test_standard.test_standard: PASS
  415. Toro-3-ShockTubeAMR__test_standard.test_standard: PASS
  416. Toro-3-ShockTubeAMR__test_standard.test_standard: PASS
  417. Toro-3-ShockTubeAMR__test_standard.test_standard: PASS
  418. Toro-3-ShockTubeAMR__test_standard.test_standard: PASS
  419. Toro-3-ShockTubeAMR__test_standard.test_standard: PASS
  420. Toro-3-ShockTubeAMR__test_standard.test_standard: PASS
  421. Toro-3-ShockTubeAMR__test_standard.test_standard: PASS
  422. Toro-3-ShockTubeAMR__test_standard.test_standard: PASS
  423. Toro-3-ShockTubeAMR__test_toro3_amr.test_toro3_amr: PASS
  424. Toro-3-ShockTubeAMR__test_toro3_amr.test_toro3_amr: PASS
  425. Toro-3-ShockTubeAMR__test_toro3_amr.test_toro3_amr: PASS
  426. Toro-3-ShockTubeAMR__test_toro3_amr.test_toro3_amr: PASS
  427. Toro-3-ShockTubeAMR__test_toro3_amr.test_toro3_amr: PASS
  428. Toro-3-ShockTubeAMR__test_toro3_amr.test_toro3_amr: PASS
  429. Toro-3-ShockTubeAMR__test_toro3_amr.test_toro3_amr: PASS
  430. Toro-3-ShockTubeAMR__test_toro3_amr.test_toro3_amr: PASS
  431. Toro-4-ShockTube__test_standard.test_exist: PASS
  432. Toro-4-ShockTube__test_standard.test_standard: PASS
  433. Toro-4-ShockTube__test_standard.test_standard: PASS
  434. Toro-4-ShockTube__test_standard.test_standard: PASS
  435. Toro-4-ShockTube__test_standard.test_standard: PASS
  436. Toro-4-ShockTube__test_standard.test_standard: PASS
  437. Toro-4-ShockTube__test_standard.test_standard: PASS
  438. Toro-4-ShockTube__test_standard.test_standard: PASS
  439. Toro-4-ShockTube__test_standard.test_standard: PASS
  440. Toro-4-ShockTube__test_standard.test_standard: PASS
  441. Toro-4-ShockTube__test_standard.test_standard: PASS
  442. Toro-4-ShockTube__test_standard.test_standard: PASS
  443. Toro-4-ShockTube__test_standard.test_standard: PASS
  444. Toro-4-ShockTube__test_standard.test_standard: PASS
  445. Toro-4-ShockTube__test_standard.test_standard: PASS
  446. Toro-4-ShockTube__test_standard.test_standard: PASS
  447. Toro-4-ShockTube__test_standard.test_standard: PASS
  448. Toro-4-ShockTube__test_standard.test_standard: PASS
  449. Toro-4-ShockTube__test_standard.test_standard: PASS
  450. Toro-4-ShockTube__test_standard.test_standard: PASS
  451. Toro-4-ShockTube__test_standard.test_standard: PASS
  452. Toro-4-ShockTube__test_standard.test_standard: PASS
  453. Toro-4-ShockTube__test_standard.test_standard: PASS
  454. Toro-4-ShockTube__test_standard.test_standard: PASS
  455. Toro-4-ShockTube__test_standard.test_standard: PASS
  456. Toro-4-ShockTube__test_standard.test_standard: PASS
  457. Toro-4-ShockTube__test_standard.test_standard: PASS
  458. Toro-4-ShockTube__test_standard.test_standard: PASS
  459. Toro-4-ShockTube__test_standard.test_standard: PASS
  460. Toro-4-ShockTube__test_standard.test_standard: PASS
  461. Toro-4-ShockTube__test_toro4.test_toro4: PASS
  462. Toro-4-ShockTube__test_toro4.test_toro4: PASS
  463. Toro-4-ShockTube__test_toro4.test_toro4: PASS
  464. Toro-4-ShockTube__test_toro4.test_toro4: PASS
  465. Toro-4-ShockTube__test_toro4.test_toro4: PASS
  466. Toro-4-ShockTube__test_toro4.test_toro4: PASS
  467. Toro-4-ShockTube__test_toro4.test_toro4: PASS
  468. Toro-4-ShockTube__test_toro4.test_toro4: PASS
  469. Toro-4-ShockTubeAMR__test_standard.test_exist: PASS
  470. Toro-4-ShockTubeAMR__test_standard.test_standard: PASS
  471. Toro-4-ShockTubeAMR__test_standard.test_standard: PASS
  472. Toro-4-ShockTubeAMR__test_standard.test_standard: PASS
  473. Toro-4-ShockTubeAMR__test_standard.test_standard: PASS
  474. Toro-4-ShockTubeAMR__test_standard.test_standard: PASS
  475. Toro-4-ShockTubeAMR__test_standard.test_standard: PASS
  476. Toro-4-ShockTubeAMR__test_standard.test_standard: PASS
  477. Toro-4-ShockTubeAMR__test_standard.test_standard: PASS
  478. Toro-4-ShockTubeAMR__test_standard.test_standard: PASS
  479. Toro-4-ShockTubeAMR__test_standard.test_standard: PASS
  480. Toro-4-ShockTubeAMR__test_standard.test_standard: PASS
  481. Toro-4-ShockTubeAMR__test_standard.test_standard: PASS
  482. Toro-4-ShockTubeAMR__test_standard.test_standard: PASS
  483. Toro-4-ShockTubeAMR__test_standard.test_standard: PASS
  484. Toro-4-ShockTubeAMR__test_standard.test_standard: PASS
  485. Toro-4-ShockTubeAMR__test_standard.test_standard: PASS
  486. Toro-4-ShockTubeAMR__test_standard.test_standard: PASS
  487. Toro-4-ShockTubeAMR__test_standard.test_standard: PASS
  488. Toro-4-ShockTubeAMR__test_standard.test_standard: PASS
  489. Toro-4-ShockTubeAMR__test_standard.test_standard: PASS
  490. Toro-4-ShockTubeAMR__test_standard.test_standard: PASS
  491. Toro-4-ShockTubeAMR__test_standard.test_standard: PASS
  492. Toro-4-ShockTubeAMR__test_standard.test_standard: PASS
  493. Toro-4-ShockTubeAMR__test_standard.test_standard: PASS
  494. Toro-4-ShockTubeAMR__test_standard.test_standard: PASS
  495. Toro-4-ShockTubeAMR__test_standard.test_standard: PASS
  496. Toro-4-ShockTubeAMR__test_standard.test_standard: PASS
  497. Toro-4-ShockTubeAMR__test_standard.test_standard: PASS
  498. Toro-4-ShockTubeAMR__test_standard.test_standard: PASS
  499. Toro-4-ShockTubeAMR__test_toro4_amr.test_toro4_amr: PASS
  500. Toro-4-ShockTubeAMR__test_toro4_amr.test_toro4_amr: PASS
  501. Toro-4-ShockTubeAMR__test_toro4_amr.test_toro4_amr: PASS
  502. Toro-4-ShockTubeAMR__test_toro4_amr.test_toro4_amr: PASS
  503. Toro-4-ShockTubeAMR__test_toro4_amr.test_toro4_amr: PASS
  504. Toro-4-ShockTubeAMR__test_toro4_amr.test_toro4_amr: PASS
  505. Toro-4-ShockTubeAMR__test_toro4_amr.test_toro4_amr: PASS
  506. Toro-4-ShockTubeAMR__test_toro4_amr.test_toro4_amr: PASS
  507. Toro-5-ShockTube__test_standard.test_exist: PASS
  508. Toro-5-ShockTube__test_standard.test_standard: PASS
  509. Toro-5-ShockTube__test_standard.test_standard: PASS
  510. Toro-5-ShockTube__test_standard.test_standard: PASS
  511. Toro-5-ShockTube__test_standard.test_standard: PASS
  512. Toro-5-ShockTube__test_standard.test_standard: PASS
  513. Toro-5-ShockTube__test_standard.test_standard: PASS
  514. Toro-5-ShockTube__test_standard.test_standard: PASS
  515. Toro-5-ShockTube__test_standard.test_standard: PASS
  516. Toro-5-ShockTube__test_standard.test_standard: PASS
  517. Toro-5-ShockTube__test_standard.test_standard: PASS
  518. Toro-5-ShockTube__test_standard.test_standard: PASS
  519. Toro-5-ShockTube__test_standard.test_standard: PASS
  520. Toro-5-ShockTube__test_standard.test_standard: PASS
  521. Toro-5-ShockTube__test_standard.test_standard: PASS
  522. Toro-5-ShockTube__test_standard.test_standard: PASS
  523. Toro-5-ShockTube__test_standard.test_standard: PASS
  524. Toro-5-ShockTube__test_standard.test_standard: PASS
  525. Toro-5-ShockTube__test_standard.test_standard: PASS
  526. Toro-5-ShockTube__test_standard.test_standard: PASS
  527. Toro-5-ShockTube__test_standard.test_standard: PASS
  528. Toro-5-ShockTube__test_standard.test_standard: PASS
  529. Toro-5-ShockTube__test_standard.test_standard: PASS
  530. Toro-5-ShockTube__test_standard.test_standard: PASS
  531. Toro-5-ShockTube__test_standard.test_standard: PASS
  532. Toro-5-ShockTube__test_standard.test_standard: PASS
  533. Toro-5-ShockTube__test_standard.test_standard: PASS
  534. Toro-5-ShockTube__test_standard.test_standard: PASS
  535. Toro-5-ShockTube__test_standard.test_standard: PASS
  536. Toro-5-ShockTube__test_standard.test_standard: PASS
  537. Toro-5-ShockTube__test_toro5.test_toro5_amr: PASS
  538. Toro-5-ShockTube__test_toro5.test_toro5_amr: PASS
  539. Toro-5-ShockTube__test_toro5.test_toro5_amr: PASS
  540. Toro-5-ShockTubeAMR__test_standard.test_exist: PASS
  541. Toro-5-ShockTubeAMR__test_standard.test_standard: PASS
  542. Toro-5-ShockTubeAMR__test_standard.test_standard: PASS
  543. Toro-5-ShockTubeAMR__test_standard.test_standard: PASS
  544. Toro-5-ShockTubeAMR__test_standard.test_standard: PASS
  545. Toro-5-ShockTubeAMR__test_standard.test_standard: PASS
  546. Toro-5-ShockTubeAMR__test_standard.test_standard: PASS
  547. Toro-5-ShockTubeAMR__test_standard.test_standard: PASS
  548. Toro-5-ShockTubeAMR__test_standard.test_standard: PASS
  549. Toro-5-ShockTubeAMR__test_standard.test_standard: PASS
  550. Toro-5-ShockTubeAMR__test_standard.test_standard: PASS
  551. Toro-5-ShockTubeAMR__test_standard.test_standard: PASS
  552. Toro-5-ShockTubeAMR__test_standard.test_standard: PASS
  553. Toro-5-ShockTubeAMR__test_standard.test_standard: PASS
  554. Toro-5-ShockTubeAMR__test_standard.test_standard: PASS
  555. Toro-5-ShockTubeAMR__test_standard.test_standard: PASS
  556. Toro-5-ShockTubeAMR__test_standard.test_standard: PASS
  557. Toro-5-ShockTubeAMR__test_standard.test_standard: PASS
  558. Toro-5-ShockTubeAMR__test_standard.test_standard: PASS
  559. Toro-5-ShockTubeAMR__test_standard.test_standard: PASS
  560. Toro-5-ShockTubeAMR__test_standard.test_standard: PASS
  561. Toro-5-ShockTubeAMR__test_standard.test_standard: PASS
  562. Toro-5-ShockTubeAMR__test_standard.test_standard: PASS
  563. Toro-5-ShockTubeAMR__test_standard.test_standard: PASS
  564. Toro-5-ShockTubeAMR__test_standard.test_standard: PASS
  565. Toro-5-ShockTubeAMR__test_standard.test_standard: PASS
  566. Toro-5-ShockTubeAMR__test_standard.test_standard: PASS
  567. Toro-5-ShockTubeAMR__test_standard.test_standard: PASS
  568. Toro-5-ShockTubeAMR__test_standard.test_standard: PASS
  569. Toro-5-ShockTubeAMR__test_standard.test_standard: PASS
  570. Toro-5-ShockTubeAMR__test_toro5_amr.test_toro5_amr: PASS
  571. Toro-5-ShockTubeAMR__test_toro5_amr.test_toro5_amr: PASS
  572. Toro-5-ShockTubeAMR__test_toro5_amr.test_toro5_amr: PASS
  573. Toro-6-ShockTube__test_toro6.test_exist: PASS
  574. Toro-6-ShockTube__test_toro6.test_toro6: PASS
  575. Toro-6-ShockTube__test_toro6.test_almost_standard: PASS
  576. Toro-6-ShockTube__test_toro6.test_almost_standard: PASS
  577. Toro-6-ShockTube__test_toro6.test_almost_standard: PASS
  578. Toro-6-ShockTube__test_toro6.test_almost_standard: PASS
  579. Toro-6-ShockTube__test_toro6.test_almost_standard: PASS
  580. Toro-6-ShockTube__test_toro6.test_almost_standard: PASS
  581. Toro-6-ShockTube__test_toro6.test_almost_standard: PASS
  582. Toro-6-ShockTube__test_toro6.test_almost_standard: PASS
  583. Toro-7-ShockTube__test_standard.test_exist: PASS
  584. Toro-7-ShockTube__test_standard.test_standard: PASS
  585. Toro-7-ShockTube__test_standard.test_standard: PASS
  586. Toro-7-ShockTube__test_standard.test_standard: PASS
  587. Toro-7-ShockTube__test_standard.test_standard: PASS
  588. Toro-7-ShockTube__test_standard.test_standard: PASS
  589. Toro-7-ShockTube__test_standard.test_standard: PASS
  590. Toro-7-ShockTube__test_standard.test_standard: PASS
  591. Toro-7-ShockTube__test_standard.test_standard: PASS
  592. Toro-7-ShockTube__test_standard.test_standard: PASS
  593. Toro-7-ShockTube__test_standard.test_standard: PASS
  594. Toro-7-ShockTube__test_standard.test_standard: PASS
  595. Toro-7-ShockTube__test_standard.test_standard: PASS
  596. Toro-7-ShockTube__test_standard.test_standard: PASS
  597. Toro-7-ShockTube__test_standard.test_standard: PASS
  598. Toro-7-ShockTube__test_standard.test_standard: PASS
  599. Toro-7-ShockTube__test_standard.test_standard: PASS
  600. Toro-7-ShockTube__test_standard.test_standard: PASS
  601. Toro-7-ShockTube__test_standard.test_standard: PASS
  602. Toro-7-ShockTube__test_standard.test_standard: PASS
  603. Toro-7-ShockTube__test_standard.test_standard: PASS
  604. Toro-7-ShockTube__test_standard.test_standard: PASS
  605. Toro-7-ShockTube__test_standard.test_standard: PASS
  606. Toro-7-ShockTube__test_standard.test_standard: PASS
  607. Toro-7-ShockTube__test_standard.test_standard: PASS
  608. Toro-7-ShockTube__test_standard.test_standard: PASS
  609. Toro-7-ShockTube__test_standard.test_standard: PASS
  610. Toro-7-ShockTube__test_standard.test_standard: PASS
  611. Toro-7-ShockTube__test_standard.test_standard: PASS
  612. Toro-7-ShockTube__test_standard.test_standard: PASS
  613. Toro-7-ShockTube__test_toro7.test_toro7: PASS
  614. Toro-7-ShockTube__test_toro7.test_toro7: PASS
  615. Toro-7-ShockTube__test_toro7.test_toro7: PASS
  616. Toro-7-ShockTube__test_toro7.test_toro7: PASS
  617. Toro-7-ShockTube__test_toro7.test_toro7: PASS
  618. Toro-7-ShockTube__test_toro7.test_toro7: PASS
  619. Toro-7-ShockTube__test_toro7.test_toro7: PASS
  620. Toro-7-ShockTube__test_toro7.test_toro7: PASS
  621. WavePool__test_standard.test_exist: PASS
  622. WavePool__test_standard.test_standard: PASS
  623. WavePool__test_standard.test_standard: PASS
  624. WavePool__test_standard.test_standard: PASS
  625. WavePool__test_standard.test_standard: PASS
  626. WavePool__test_standard.test_standard: PASS
  627. WavePool__test_standard.test_standard: PASS
  628. WavePool__test_standard.test_standard: PASS
  629. WavePool__test_standard.test_standard: PASS
  630. WavePool__test_standard.test_standard: PASS
  631. WavePool__test_standard.test_standard: PASS
  632. WavePool__test_standard.test_standard: PASS
  633. WavePool__test_standard.test_standard: PASS
  634. WavePool__test_standard.test_standard: PASS
  635. WavePool__test_standard.test_standard: PASS
  636. WavePool__test_standard.test_standard: PASS
  637. AMRShockPool2D__test_standard.test_exist: PASS
  638. AMRShockPool2D__test_standard.test_standard: PASS
  639. AMRShockPool2D__test_standard.test_standard: PASS
  640. AMRShockPool2D__test_standard.test_standard: PASS
  641. AMRShockPool2D__test_standard.test_standard: PASS
  642. AMRShockPool2D__test_standard.test_standard: PASS
  643. AMRShockPool2D__test_standard.test_standard: PASS
  644. AMRShockPool2D__test_standard.test_standard: PASS
  645. AMRShockPool2D__test_standard.test_standard: PASS
  646. AMRShockPool2D__test_standard.test_standard: PASS
  647. AMRShockPool2D__test_standard.test_standard: PASS
  648. AMRShockPool2D__test_standard.test_standard: PASS
  649. AMRShockPool2D__test_standard.test_standard: PASS
  650. AMRShockPool2D__test_standard.test_standard: PASS
  651. AMRShockPool2D__test_standard.test_standard: PASS
  652. AMRShockPool2D__test_standard.test_standard: PASS
  653. AMRShockPool2D__test_standard.test_standard: PASS
  654. AMRShockPool2D__test_standard.test_standard: PASS
  655. AMRShockPool2D__test_standard.test_standard: PASS
  656. AMRShockPool2D__test_standard.test_standard: PASS
  657. AMRShockPool2D__test_standard.test_standard: PASS
  658. AMRShockPool2D__test_standard.test_standard: PASS
  659. AMRShockPool2D__test_standard.test_standard: PASS
  660. FreeExpansionAMR__test_free_expansion.test_collapse_max_value: PASS
  661. FreeExpansionAMR__test_standard.test_exist: PASS
  662. FreeExpansionAMR__test_standard.test_standard: PASS
  663. FreeExpansionAMR__test_standard.test_standard: PASS
  664. FreeExpansionAMR__test_standard.test_standard: PASS
  665. FreeExpansionAMR__test_standard.test_standard: PASS
  666. FreeExpansionAMR__test_standard.test_standard: PASS
  667. FreeExpansionAMR__test_standard.test_standard: PASS
  668. FreeExpansionAMR__test_standard.test_standard: PASS
  669. FreeExpansionAMR__test_standard.test_standard: PASS
  670. FreeExpansionAMR__test_standard.test_standard: PASS
  671. FreeExpansionAMR__test_standard.test_standard: PASS
  672. FreeExpansionAMR__test_standard.test_standard: PASS
  673. FreeExpansionAMR__test_standard.test_standard: PASS
  674. FreeExpansionAMR__test_standard.test_standard: PASS
  675. FreeExpansionAMR__test_standard.test_standard: PASS
  676. FreeExpansionAMR__test_standard.test_standard: PASS
  677. FreeExpansionAMR__test_standard.test_standard: PASS
  678. FreeExpansionAMR__test_standard.test_standard: PASS
  679. FreeExpansionAMR__test_standard.test_standard: PASS
  680. FreeExpansionAMR__test_standard.test_standard: PASS
  681. FreeExpansionAMR__test_standard.test_standard: PASS
  682. FreeExpansionAMR__test_standard.test_standard: PASS
  683. FreeExpansionAMR__test_standard.test_standard: PASS
  684. FreeExpansionAMR__test_standard.test_standard: PASS
  685. FreeExpansionAMR__test_standard.test_standard: PASS
  686. FreeExpansionAMR__test_standard.test_standard: PASS
  687. FreeExpansionAMR__test_standard.test_standard: PASS
  688. FreeExpansionAMR__test_standard.test_standard: PASS
  689. FreeExpansionAMR__test_standard.test_standard: PASS
  690. FreeExpansionAMR__test_standard.test_standard: PASS
  691. HDMHD2DCheckOddEvenCouplingOfRiemannSolver__test_standard.test_exist: PASS
  692. HDMHD2DCheckOddEvenCouplingOfRiemannSolver__test_standard.test_standard: PASS
  693. HDMHD2DCheckOddEvenCouplingOfRiemannSolver__test_standard.test_standard: PASS
  694. HDMHD2DCheckOddEvenCouplingOfRiemannSolver__test_standard.test_standard: PASS
  695. HDMHD2DCheckOddEvenCouplingOfRiemannSolver__test_standard.test_standard: PASS
  696. HDMHD2DCheckOddEvenCouplingOfRiemannSolver__test_standard.test_standard: PASS
  697. HDMHD2DCheckOddEvenCouplingOfRiemannSolver__test_standard.test_standard: PASS
  698. HDMHD2DCheckOddEvenCouplingOfRiemannSolver__test_standard.test_standard: PASS
  699. HDMHD2DCheckOddEvenCouplingOfRiemannSolver__test_standard.test_standard: PASS
  700. HDMHD2DCheckOddEvenCouplingOfRiemannSolver__test_standard.test_standard: PASS
  701. HDMHD2DCheckOddEvenCouplingOfRiemannSolver__test_standard.test_standard: PASS
  702. HDMHD2DCheckOddEvenCouplingOfRiemannSolver__test_standard.test_standard: PASS
  703. HDMHD2DCheckOddEvenCouplingOfRiemannSolver__test_standard.test_standard: PASS
  704. HDMHD2DCheckOddEvenCouplingOfRiemannSolver__test_standard.test_standard: PASS
  705. HDMHD2DCheckOddEvenCouplingOfRiemannSolver__test_standard.test_standard: PASS
  706. HDMHD2DCheckOddEvenCouplingOfRiemannSolver__test_standard.test_standard: PASS
  707. HDMHD2DCheckOddEvenCouplingOfRiemannSolver__test_standard.test_standard: PASS
  708. HDMHD2DCheckOddEvenCouplingOfRiemannSolver__test_standard.test_standard: PASS
  709. HDMHD2DCheckOddEvenCouplingOfRiemannSolver__test_standard.test_standard: PASS
  710. HDMHD2DCheckOddEvenCouplingOfRiemannSolver__test_standard.test_standard: PASS
  711. HDMHD2DCheckOddEvenCouplingOfRiemannSolver__test_standard.test_standard: PASS
  712. HDMHD2DCheckOddEvenCouplingOfRiemannSolver__test_standard.test_standard: PASS
  713. HDMHD2DCheckOddEvenCouplingOfRiemannSolver__test_standard.test_standard: PASS
  714. HDMHD2DCheckOddEvenCouplingOfRiemannSolver__test_standard.test_standard: PASS
  715. HDMHD2DCheckOddEvenCouplingOfRiemannSolver__test_standard.test_standard: PASS
  716. HDMHD2DCheckOddEvenCouplingOfRiemannSolver__test_standard.test_standard: PASS
  717. HDMHD2DCheckOddEvenCouplingOfRiemannSolver__test_standard.test_standard: PASS
  718. HDMHD2DCheckOddEvenCouplingOfRiemannSolver__test_standard.test_standard: PASS
  719. HDMHD2DCheckOddEvenCouplingOfRiemannSolver__test_standard.test_standard: PASS
  720. HDMHD2DCheckOddEvenCouplingOfRiemannSolver__test_standard.test_standard: PASS
  721. NohProblem2D__test_noh2d.test_noh2d: PASS
  722. NohProblem2D__test_noh2d.test_noh2d: PASS
  723. NohProblem2D__test_standard.test_exist: PASS
  724. NohProblem2D__test_standard.test_standard: PASS
  725. NohProblem2D__test_standard.test_standard: PASS
  726. NohProblem2D__test_standard.test_standard: PASS
  727. NohProblem2D__test_standard.test_standard: PASS
  728. NohProblem2D__test_standard.test_standard: PASS
  729. NohProblem2D__test_standard.test_standard: PASS
  730. NohProblem2D__test_standard.test_standard: PASS
  731. NohProblem2D__test_standard.test_standard: PASS
  732. NohProblem2D__test_standard.test_standard: PASS
  733. NohProblem2D__test_standard.test_standard: PASS
  734. NohProblem2D__test_standard.test_standard: PASS
  735. NohProblem2D__test_standard.test_standard: PASS
  736. NohProblem2D__test_standard.test_standard: PASS
  737. NohProblem2D__test_standard.test_standard: PASS
  738. NohProblem2D__test_standard.test_standard: PASS
  739. NohProblem2D__test_standard.test_standard: PASS
  740. NohProblem2D__test_standard.test_standard: PASS
  741. NohProblem2D__test_standard.test_standard: PASS
  742. NohProblem2D__test_standard.test_standard: PASS
  743. NohProblem2D__test_standard.test_standard: PASS
  744. NohProblem2D__test_standard.test_standard: PASS
  745. NohProblem2D__test_standard.test_standard: PASS
  746. ShockPool2D__test_standard.test_exist: PASS
  747. ShockPool2D__test_standard.test_standard: PASS
  748. ShockPool2D__test_standard.test_standard: PASS
  749. ShockPool2D__test_standard.test_standard: PASS
  750. ShockPool2D__test_standard.test_standard: PASS
  751. ShockPool2D__test_standard.test_standard: PASS
  752. ShockPool2D__test_standard.test_standard: PASS
  753. ShockPool2D__test_standard.test_standard: PASS
  754. ShockPool2D__test_standard.test_standard: PASS
  755. ShockPool2D__test_standard.test_standard: PASS
  756. ShockPool2D__test_standard.test_standard: PASS
  757. ShockPool2D__test_standard.test_standard: PASS
  758. ShockPool2D__test_standard.test_standard: PASS
  759. ShockPool2D__test_standard.test_standard: PASS
  760. ShockPool2D__test_standard.test_standard: PASS
  761. ShockPool2D__test_standard.test_standard: PASS
  762. ShockPool2D__test_standard.test_standard: PASS
  763. ShockPool2D__test_standard.test_standard: PASS
  764. ShockPool2D__test_standard.test_standard: PASS
  765. ShockPool2D__test_standard.test_standard: PASS
  766. ShockPool2D__test_standard.test_standard: PASS
  767. ShockPool2D__test_standard.test_standard: PASS
  768. ShockPool2D__test_standard.test_standard: PASS
  769. ExtremeAdvectionTest__test_standard.test_exist: PASS
  770. ExtremeAdvectionTest__test_standard.test_standard: PASS
  771. ExtremeAdvectionTest__test_standard.test_standard: PASS
  772. ExtremeAdvectionTest__test_standard.test_standard: PASS
  773. ExtremeAdvectionTest__test_standard.test_standard: PASS
  774. ExtremeAdvectionTest__test_standard.test_standard: PASS
  775. ExtremeAdvectionTest__test_standard.test_standard: PASS
  776. ExtremeAdvectionTest__test_standard.test_standard: PASS
  777. ExtremeAdvectionTest__test_standard.test_standard: PASS
  778. ExtremeAdvectionTest__test_standard.test_standard: PASS
  779. ExtremeAdvectionTest__test_standard.test_standard: PASS
  780. ExtremeAdvectionTest__test_standard.test_standard: PASS
  781. ExtremeAdvectionTest__test_standard.test_standard: PASS
  782. ExtremeAdvectionTest__test_standard.test_standard: PASS
  783. ExtremeAdvectionTest__test_standard.test_standard: PASS
  784. ExtremeAdvectionTest__test_standard.test_standard: PASS
  785. ExtremeAdvectionTest__test_standard.test_standard: PASS
  786. ExtremeAdvectionTest__test_standard.test_standard: PASS
  787. ExtremeAdvectionTest__test_standard.test_standard: PASS
  788. ExtremeAdvectionTest__test_standard.test_standard: PASS
  789. ExtremeAdvectionTest__test_standard.test_standard: PASS
  790. ExtremeAdvectionTest__test_standard.test_standard: PASS
  791. ExtremeAdvectionTest__test_standard.test_standard: PASS
  792. ExtremeAdvectionTest__test_standard.test_standard: PASS
  793. ExtremeAdvectionTest__test_standard.test_standard: PASS
  794. ExtremeAdvectionTest__test_standard.test_standard: PASS
  795. ExtremeAdvectionTest__test_standard.test_standard: PASS
  796. ExtremeAdvectionTest__test_standard.test_standard: PASS
  797. ExtremeAdvectionTest__test_standard.test_standard: PASS
  798. ExtremeAdvectionTest__test_standard.test_standard: PASS
  799. BrioWu-MHD-1D__test_briowu.test_briowu: PASS
  800. BrioWu-MHD-1D__test_standard.test_exist: PASS
  801. BrioWu-MHD-1D__test_standard.test_standard: PASS
  802. BrioWu-MHD-1D__test_standard.test_standard: PASS
  803. BrioWu-MHD-1D__test_standard.test_standard: PASS
  804. BrioWu-MHD-1D__test_standard.test_standard: PASS
  805. BrioWu-MHD-1D__test_standard.test_standard: PASS
  806. BrioWu-MHD-1D__test_standard.test_standard: PASS
  807. BrioWu-MHD-1D__test_standard.test_standard: PASS
  808. BrioWu-MHD-1D__test_standard.test_standard: PASS
  809. BrioWu-MHD-1D__test_standard.test_standard: PASS
  810. BrioWu-MHD-1D__test_standard.test_standard: PASS
  811. BrioWu-MHD-1D__test_standard.test_standard: PASS
  812. BrioWu-MHD-1D__test_standard.test_standard: PASS
  813. BrioWu-MHD-1D__test_standard.test_standard: PASS
  814. BrioWu-MHD-1D__test_standard.test_standard: PASS
  815. BrioWu-MHD-1D__test_standard.test_standard: PASS
  816. BrioWu-MHD-1D__test_standard.test_standard: PASS
  817. BrioWu-MHD-1D__test_standard.test_standard: PASS
  818. BrioWu-MHD-1D__test_standard.test_standard: PASS
  819. BrioWu-MHD-1D__test_standard.test_standard: PASS
  820. BrioWu-MHD-1D__test_standard.test_standard: PASS
  821. BrioWu-MHD-1D__test_standard.test_standard: PASS
  822. BrioWu-MHD-1D__test_standard.test_standard: PASS
  823. BrioWu-MHD-1D__test_standard.test_standard: PASS
  824. BrioWu-MHD-1D__test_standard.test_standard: PASS
  825. BrioWu-MHD-1D__test_standard.test_standard: PASS
  826. BrioWu-MHD-1D__test_standard.test_standard: PASS
  827. BrioWu-MHD-1D__test_standard.test_standard: PASS
  828. BrioWu-MHD-1D__test_standard.test_standard: PASS
  829. BrioWu-MHD-1D__test_standard.test_standard: PASS
  830. MHD2DRotorTest__test_almost_standard.test_exist: PASS
  831. MHD2DRotorTest__test_almost_standard.test_standard: PASS
  832. MHD2DRotorTest__test_almost_standard.test_standard: PASS
  833. MHD2DRotorTest__test_almost_standard.test_standard: PASS
  834. MHD2DRotorTest__test_almost_standard.test_standard: PASS
  835. MHD2DRotorTest__test_almost_standard.test_standard: PASS
  836. MHD2DRotorTest__test_almost_standard.test_standard: PASS
  837. MHD2DRotorTest__test_almost_standard.test_standard: PASS
  838. MHD2DRotorTest__test_almost_standard.test_standard: PASS
  839. MHD2DRotorTest__test_almost_standard.test_standard: PASS
  840. MHD2DRotorTest__test_almost_standard.test_standard: PASS
  841. MHD2DRotorTest__test_almost_standard.test_standard: PASS
  842. MHD2DRotorTest__test_almost_standard.test_standard: PASS
  843. MHD2DRotorTest__test_almost_standard.test_standard: PASS
  844. MHD2DRotorTest__test_almost_standard.test_standard: PASS
  845. MHD2DRotorTest__test_almost_standard.test_standard: PASS
  846. MHD2DRotorTest__test_rotor.test_rotor: PASS
  847. MHD2DRotorTest__test_rotor.test_rotor: PASS
  848. MHD2DRotorTest__test_rotor.test_rotor: PASS
  849. SedovBlast-MHD-2D-Gardiner__test_gardiner.test_gardiner: PASS
  850. SedovBlast-MHD-2D-Gardiner__test_gardiner.test_gardiner: PASS
  851. SedovBlast-MHD-2D-Gardiner__test_gardiner.test_gardiner: PASS
  852. SedovBlast-MHD-2D-Gardiner__test_gardiner.test_gardiner: PASS
  853. SedovBlast-MHD-2D-Gardiner__test_standard.test_exist: PASS
  854. SedovBlast-MHD-2D-Gardiner__test_standard.test_standard: PASS
  855. SedovBlast-MHD-2D-Gardiner__test_standard.test_standard: PASS
  856. SedovBlast-MHD-2D-Gardiner__test_standard.test_standard: PASS
  857. SedovBlast-MHD-2D-Gardiner__test_standard.test_standard: PASS
  858. SedovBlast-MHD-2D-Gardiner__test_standard.test_standard: PASS
  859. SedovBlast-MHD-2D-Gardiner__test_standard.test_standard: PASS
  860. SedovBlast-MHD-2D-Gardiner__test_standard.test_standard: PASS
  861. SedovBlast-MHD-2D-Gardiner__test_standard.test_standard: PASS
  862. SedovBlast-MHD-2D-Gardiner__test_standard.test_standard: PASS
  863. SedovBlast-MHD-2D-Gardiner__test_standard.test_standard: PASS
  864. SedovBlast-MHD-2D-Gardiner__test_standard.test_standard: PASS
  865. SedovBlast-MHD-2D-Gardiner__test_standard.test_standard: PASS
  866. SedovBlast-MHD-2D-Gardiner__test_standard.test_standard: PASS
  867. SedovBlast-MHD-2D-Gardiner__test_standard.test_standard: PASS
  868. SedovBlast-MHD-2D-Gardiner__test_standard.test_standard: PASS
  869. SedovBlast-MHD-2D-Gardiner__test_standard.test_standard: PASS
  870. SedovBlast-MHD-2D-Gardiner__test_standard.test_standard: PASS
  871. SedovBlast-MHD-2D-Gardiner__test_standard.test_standard: PASS
  872. SedovBlast-MHD-2D-Gardiner__test_standard.test_standard: PASS
  873. SedovBlast-MHD-2D-Gardiner__test_standard.test_standard: PASS
  874. SedovBlast-MHD-2D-Gardiner__test_standard.test_standard: PASS
  875. SedovBlast-MHD-2D-Gardiner__test_standard.test_standard: PASS
  876. SedovBlast-MHD-2D-Gardiner__test_standard.test_standard: PASS
  877. SedovBlast-MHD-2D-Gardiner__test_standard.test_standard: PASS
  878. SedovBlast-MHD-2D-Gardiner__test_standard.test_standard: PASS
  879. SedovBlast-MHD-2D-Gardiner__test_standard.test_standard: PASS
  880. SedovBlast-MHD-2D-Gardiner__test_standard.test_standard: PASS
  881. SedovBlast-MHD-2D-Gardiner__test_standard.test_standard: PASS
  882. SedovBlast-MHD-2D-Gardiner__test_standard.test_standard: PASS
  883. PhotonShadowing__test_photonshadowing.test_photon_shadowing: PASS
  884. PhotonShadowing__test_photonshadowing.test_photon_shadowing: PASS
  885. PhotonShadowing__test_photonshadowing.test_photon_shadowing: PASS
  886. PhotonShadowing__test_photonshadowing.test_photon_shadowing: PASS
  887. PhotonShadowing__test_standard.test_exist: PASS
  888. PhotonShadowing__test_standard.test_standard: PASS
  889. PhotonShadowing__test_standard.test_standard: PASS
  890. PhotonShadowing__test_standard.test_standard: PASS
  891. PhotonShadowing__test_standard.test_standard: PASS
  892. PhotonShadowing__test_standard.test_standard: PASS
  893. PhotonShadowing__test_standard.test_standard: PASS
  894. PhotonShadowing__test_standard.test_standard: PASS
  895. PhotonShadowing__test_standard.test_standard: PASS
  896. PhotonShadowing__test_standard.test_standard: PASS
  897. PhotonShadowing__test_standard.test_standard: PASS
  898. PhotonShadowing__test_standard.test_standard: PASS
  899. PhotonShadowing__test_standard.test_standard: PASS
  900. PhotonShadowing__test_standard.test_standard: PASS
  901. PhotonShadowing__test_standard.test_standard: PASS
  902. PhotonShadowing__test_standard.test_standard: PASS
  903. PhotonShadowing__test_standard.test_standard: PASS
  904. PhotonShadowing__test_standard.test_standard: PASS
  905. PhotonShadowing__test_standard.test_standard: PASS
  906. PhotonShadowing__test_standard.test_standard: PASS
  907. PhotonShadowing__test_standard.test_standard: PASS
  908. PhotonShadowing__test_standard.test_standard: PASS
  909. PhotonShadowing__test_standard.test_standard: PASS
  910. PhotonShadowing__test_standard.test_standard: PASS
  911. PhotonShadowing__test_standard.test_standard: PASS
  912. PhotonShadowing__test_standard.test_standard: PASS
  913. PhotonShadowing__test_standard.test_standard: PASS
  914. PhotonShadowing__test_standard.test_standard: PASS
  915. PhotonShadowing__test_standard.test_standard: PASS
  916. PhotonTest__test_photontest.test_photon_test: PASS
  917. PhotonTest__test_photontest.test_photon_test: PASS
  918. PhotonTest__test_photontest.test_photon_test: PASS
  919. PhotonTest__test_standard.test_exist: PASS
  920. PhotonTest__test_standard.test_standard: PASS
  921. PhotonTest__test_standard.test_standard: PASS
  922. PhotonTest__test_standard.test_standard: PASS
  923. PhotonTest__test_standard.test_standard: PASS
  924. PhotonTest__test_standard.test_standard: PASS
  925. PhotonTest__test_standard.test_standard: PASS
  926. PhotonTest__test_standard.test_standard: PASS
  927. PhotonTest__test_standard.test_standard: PASS
  928. PhotonTest__test_standard.test_standard: PASS
  929. PhotonTest__test_standard.test_standard: PASS
  930. PhotonTest__test_standard.test_standard: PASS
  931. PhotonTest__test_standard.test_standard: PASS
  932. PhotonTest__test_standard.test_standard: PASS
  933. PhotonTest__test_standard.test_standard: PASS
  934. PhotonTest__test_standard.test_standard: PASS
  935. PhotonTest__test_standard.test_standard: PASS
  936. PhotonTest__test_standard.test_standard: PASS
  937. PhotonTest__test_standard.test_standard: PASS
  938. PhotonTest__test_standard.test_standard: PASS
  939. PhotonTest__test_standard.test_standard: PASS
  940. PhotonTest__test_standard.test_standard: PASS
  941. PhotonTest__test_standard.test_standard: PASS
  942. PhotonTest__test_standard.test_standard: PASS
  943. PhotonTest__test_standard.test_standard: PASS
  944. PhotonTest__test_standard.test_standard: PASS
  945. PhotonTest__test_standard.test_standard: PASS
  946. PhotonTest__test_standard.test_standard: PASS
  947. PhotonTest__test_standard.test_standard: PASS
  948. PhotonTest__test_standard.test_standard: PASS
  949.  
  950. Tests that failed:
  951. AdiabaticExpansion__test_standard.test_standard: FAILURE (<type 'exceptions.AssertionError'>, AssertionError('
  952.     Not equal to tolerance rtol=0.001, atol=0
  953.     Density values of Density (None weighted) projection (axis 0) not equal.
  954.     (mismatch 100.0%)
  955.      x: array([ 0.00388704,  0.00388939,  0.00389358,  0.00389062,  0.00388944,
  956.             0.0038901 ,  0.003892  ,  0.00389112,  0.00388886,  0.00388938,
  957.             0.00388921,  0.00388875,  0.00389136,  0.00389454,  0.00389068,...
  958.      y: array([ 0.00388639,  0.00388914,  0.00389217,  0.00388982,  0.00388941,
  959.             0.00388939,  0.00388939,  0.00388939,  0.00388939,  0.00388939,
  960.             0.00388939,  0.00388941,  0.00388982,  0.00389217,  0.00388914,...',), <traceback object at 0x106c64bd8>)
  961. AdiabaticExpansion__test_standard.test_standard: FAILURE (<type 'exceptions.AssertionError'>, AssertionError('
  962.     Not equal to tolerance rtol=0.001, atol=0
  963.     weight_field values of Density (Density weighted) projection (axis 0) not equal.
  964.     (mismatch 100.0%)
  965.      x: array([  2.01576179e-29,   2.01698080e-29,   2.01915415e-29,
  966.              2.01761946e-29,   2.01700357e-29,   2.01734563e-29,
  967.              2.01833404e-29,   2.01787494e-29,   2.01670546e-29,...
  968.      y: array([  2.01493815e-29,   2.01636731e-29,   2.01793725e-29,
  969.              2.01671633e-29,   2.01650529e-29,   2.01649245e-29,
  970.              2.01649340e-29,   2.01649286e-29,   2.01649291e-29,...',), <traceback object at 0x106fa37e8>)
  971. AdiabaticExpansion__test_standard.test_standard: FAILURE (<type 'exceptions.AssertionError'>, AssertionError('
  972.     Not equal to tolerance rtol=0.001, atol=0
  973.     Density values of Density (None weighted) projection (axis 1) not equal.
  974.     (mismatch 100.0%)
  975.      x: array([ 0.00388581,  0.00388782,  0.00389221,  0.00388955,  0.00388876,
  976.             0.00388958,  0.00389072,  0.00389116,  0.00388959,  0.00388872,
  977.             0.0038886 ,  0.0038896 ,  0.00389149,  0.00389309,  0.00389013,...
  978.      y: array([ 0.00388407,  0.00388682,  0.00388985,  0.00388749,  0.00388709,
  979.             0.00388706,  0.00388706,  0.00388706,  0.00388706,  0.00388706,
  980.             0.00388706,  0.00388709,  0.00388749,  0.00388984,  0.00388682,...',), <traceback object at 0x106fa3fc8>)
  981. AdiabaticExpansion__test_standard.test_standard: FAILURE (<type 'exceptions.AssertionError'>, AssertionError('
  982.     Not equal to tolerance rtol=0.001, atol=0
  983.     weight_field values of Density (Density weighted) projection (axis 1) not equal.
  984.     (mismatch 100.0%)
  985.      x: array([  2.01512498e-29,   2.01616407e-29,   2.01844155e-29,
  986.              2.01705997e-29,   2.01665025e-29,   2.01707663e-29,
  987.              2.01767138e-29,   2.01789735e-29,   2.01708327e-29,...
  988.      y: array([  2.01373439e-29,   2.01516190e-29,   2.01673075e-29,
  989.              2.01551049e-29,   2.01530021e-29,   2.01528732e-29,
  990.              2.01528708e-29,   2.01528644e-29,   2.01528871e-29,...',), <traceback object at 0x106fa67e8>)
  991. AdiabaticExpansion__test_standard.test_standard: FAILURE (<type 'exceptions.AssertionError'>, AssertionError('
  992.     Not equal to tolerance rtol=0.001, atol=0
  993.     Density values of Density (None weighted) projection (axis 2) not equal.
  994.     (mismatch 100.0%)
  995.      x: array([ 0.00388581,  0.00388782,  0.00389221,  0.00388954,  0.00388875,
  996.             0.00388958,  0.00389073,  0.00389116,  0.00388959,  0.00388872,
  997.             0.0038886 ,  0.0038896 ,  0.00389149,  0.00389309,  0.00389013,...
  998.      y: array([ 0.00388407,  0.00388682,  0.00388985,  0.00388749,  0.00388709,
  999.             0.00388706,  0.00388706,  0.00388706,  0.00388706,  0.00388706,
  1000.             0.00388706,  0.00388709,  0.00388749,  0.00388984,  0.00388682,...',), <traceback object at 0x106fa3f38>)
  1001. AdiabaticExpansion__test_standard.test_standard: FAILURE (<type 'exceptions.AssertionError'>, AssertionError('
  1002.     Not equal to tolerance rtol=0.001, atol=0
  1003.     weight_field values of Density (Density weighted) projection (axis 2) not equal.
  1004.     (mismatch 100.0%)
  1005.      x: array([  2.01512517e-29,   2.01616437e-29,   2.01844172e-29,
  1006.              2.01705980e-29,   2.01665008e-29,   2.01707631e-29,
  1007.              2.01767188e-29,   2.01789754e-29,   2.01708367e-29,...
  1008.      y: array([  2.01373439e-29,   2.01516190e-29,   2.01673075e-29,
  1009.              2.01551049e-29,   2.01530021e-29,   2.01528732e-29,
  1010.              2.01528708e-29,   2.01528644e-29,   2.01528871e-29,...',), <traceback object at 0x106fa3758>)
  1011. AdiabaticExpansion__test_standard.test_standard: FAILURE (<type 'exceptions.AssertionError'>, AssertionError('
  1012.     Not equal to tolerance rtol=0.001, atol=0
  1013.     Field values for Density not equal.
  1014.     (mismatch 100.0%)
  1015.      x: array([  1.93535315e-29,   3.52524816e-30,   2.64752187e-29])
  1016.      y: array([  2.01826795e-29,   2.01218084e-29,   2.02400428e-29])',), <traceback object at 0x106fa37e8>)
  1017. AdiabaticExpansion__test_standard.test_standard: FAILURE (<type 'exceptions.AssertionError'>, AssertionError('
  1018.     Not equal to tolerance rtol=0.001, atol=0
  1019.     x-velocity values of x-velocity (None weighted) projection (axis 0) not equal.
  1020.     (mismatch 100.0%)
  1021.      x: array([ 487985.46215568,  487985.4752935 ,  487985.44520087,
  1022.             487985.52281975,  487985.46594117,  487985.65777522,
  1023.             487987.94032984,  487985.18896497,  487989.34642886,...
  1024.      y: array([ 487985.37834929,  487985.37892683,  487985.37899758,
  1025.             487985.37883073,  487985.37876926,  487985.3787357 ,
  1026.             487985.37873443,  487985.37850775,  487985.37809715,...',), <traceback object at 0x106c18f38>)
  1027. AdiabaticExpansion__test_standard.test_standard: FAILURE (<type 'exceptions.AssertionError'>, AssertionError('
  1028.     Not equal to tolerance rtol=0.001, atol=0
  1029.     weight_field values of x-velocity (Density weighted) projection (axis 0) not equal.
  1030.     (mismatch 100.0%)
  1031.      x: array([  2.01576179e-29,   2.01698080e-29,   2.01915415e-29,
  1032.              2.01761946e-29,   2.01700357e-29,   2.01734563e-29,
  1033.              2.01833404e-29,   2.01787494e-29,   2.01670546e-29,...
  1034.      y: array([  2.01493815e-29,   2.01636731e-29,   2.01793725e-29,
  1035.              2.01671633e-29,   2.01650529e-29,   2.01649245e-29,
  1036.              2.01649340e-29,   2.01649286e-29,   2.01649291e-29,...',), <traceback object at 0x106d77a28>)
  1037. AdiabaticExpansion__test_standard.test_standard: FAILURE (<type 'exceptions.AssertionError'>, AssertionError('
  1038.     Not equal to tolerance rtol=0.001, atol=0
  1039.     x-velocity values of x-velocity (None weighted) projection (axis 1) not equal.
  1040.     (mismatch 100.0%)
  1041.      x: array([  527291.28924031,   516837.49592687,   518298.85278013,
  1042.              526661.9181026 ,   545713.35631262,   572251.75778381,
  1043.              591868.69874188,   590691.17604316,   568050.2957977 ,...
  1044.      y: array([ 495082.44502813,  495088.12905124,  495088.48658601,
  1045.             495086.83506078,  495078.8228431 ,  495064.16248153,
  1046.             495033.87533221,  495007.57134917,  494989.84232323,...',), <traceback object at 0x106d97ab8>)
  1047. AdiabaticExpansion__test_standard.test_standard: FAILURE (<type 'exceptions.AssertionError'>, AssertionError('
  1048.     Not equal to tolerance rtol=0.001, atol=0
  1049.     weight_field values of x-velocity (Density weighted) projection (axis 1) not equal.
  1050.     (mismatch 100.0%)
  1051.      x: array([  2.01512498e-29,   2.01616407e-29,   2.01844155e-29,
  1052.              2.01705997e-29,   2.01665025e-29,   2.01707663e-29,
  1053.              2.01767138e-29,   2.01789735e-29,   2.01708327e-29,...
  1054.      y: array([  2.01373439e-29,   2.01516190e-29,   2.01673075e-29,
  1055.              2.01551049e-29,   2.01530021e-29,   2.01528732e-29,
  1056.              2.01528708e-29,   2.01528644e-29,   2.01528871e-29,...',), <traceback object at 0x106deb680>)
  1057. AdiabaticExpansion__test_standard.test_standard: FAILURE (<type 'exceptions.AssertionError'>, AssertionError('
  1058.     Not equal to tolerance rtol=0.001, atol=0
  1059.     x-velocity values of x-velocity (None weighted) projection (axis 2) not equal.
  1060.     (mismatch 100.0%)
  1061.      x: array([  527334.51442065,   516876.791786  ,   518339.67573008,
  1062.              526697.44824457,   545747.20789192,   572264.00392503,
  1063.              591860.63483172,   590659.55776049,   568001.82670214,...
  1064.      y: array([ 495082.43345451,  495088.11726281,  495088.47647057,
  1065.             495086.82394357,  495078.81054601,  495064.14592607,
  1066.             495033.85792348,  495007.57411364,  494989.86888832,...',), <traceback object at 0x106c16908>)
  1067. AdiabaticExpansion__test_standard.test_standard: FAILURE (<type 'exceptions.AssertionError'>, AssertionError('
  1068.     Not equal to tolerance rtol=0.001, atol=0
  1069.     weight_field values of x-velocity (Density weighted) projection (axis 2) not equal.
  1070.     (mismatch 100.0%)
  1071.      x: array([  2.01512517e-29,   2.01616437e-29,   2.01844172e-29,
  1072.              2.01705980e-29,   2.01665008e-29,   2.01707631e-29,
  1073.              2.01767188e-29,   2.01789754e-29,   2.01708367e-29,...
  1074.      y: array([  2.01373439e-29,   2.01516190e-29,   2.01673075e-29,
  1075.              2.01551049e-29,   2.01530021e-29,   2.01528732e-29,
  1076.              2.01528708e-29,   2.01528644e-29,   2.01528871e-29,...',), <traceback object at 0x106fa64d0>)
  1077. AdiabaticExpansion__test_standard.test_standard: FAILURE (<type 'exceptions.AssertionError'>, AssertionError('
  1078.     Not equal to tolerance rtol=0.001, atol=0
  1079.     Field values for x-velocity not equal.
  1080.     (mismatch 100.0%)
  1081.      x: array([   755020.93316397, -11194995.13604744,  10796332.77340854])
  1082.      y: array([ 488843.79024969,  458094.4443559 ,  519896.32598253])',), <traceback object at 0x106fa6368>)
  1083. AdiabaticExpansion__test_standard.test_standard: FAILURE (<type 'exceptions.AssertionError'>, AssertionError('
  1084.     Not equal to tolerance rtol=0.001, atol=0
  1085.     y-velocity values of y-velocity (None weighted) projection (axis 0) not equal.
  1086.     (mismatch 100.0%)
  1087.      x: array([  5.07723412e+04,   4.20885345e+04,   4.25022761e+04,
  1088.              5.06554746e+04,   6.83704238e+04,   9.29022516e+04,
  1089.              1.10772875e+05,   1.05953422e+05,   8.44702855e+04,...
  1090.      y: array([  2.00696207e+04,   2.00795362e+04,   2.00840260e+04,
  1091.              2.00810115e+04,   2.00780244e+04,   2.00730288e+04,
  1092.              2.00624234e+04,   2.00468935e+04,   2.00358073e+04,...',), <traceback object at 0x106deb680>)
  1093. AdiabaticExpansion__test_standard.test_standard: FAILURE (<type 'exceptions.AssertionError'>, AssertionError('
  1094.     Not equal to tolerance rtol=0.001, atol=0
  1095.     weight_field values of y-velocity (Density weighted) projection (axis 0) not equal.
  1096.     (mismatch 100.0%)
  1097.      x: array([  2.01576179e-29,   2.01698080e-29,   2.01915415e-29,
  1098.              2.01761946e-29,   2.01700357e-29,   2.01734563e-29,
  1099.              2.01833404e-29,   2.01787494e-29,   2.01670546e-29,...
  1100.      y: array([  2.01493815e-29,   2.01636731e-29,   2.01793725e-29,
  1101.              2.01671633e-29,   2.01650529e-29,   2.01649245e-29,
  1102.              2.01649340e-29,   2.01649286e-29,   2.01649291e-29,...',), <traceback object at 0x106d77128>)
  1103. AdiabaticExpansion__test_standard.test_standard: FAILURE (<type 'exceptions.AssertionError'>, AssertionError('
  1104.     Not equal to tolerance rtol=0.001, atol=0
  1105.     y-velocity values of y-velocity (None weighted) projection (axis 1) not equal.
  1106.     (mismatch 100.0%)
  1107.      x: array([  2.77893475e-02,   3.96255168e-01,   4.62909383e-01,
  1108.              1.99586326e-02,   4.62444878e-01,   4.87988068e-01,
  1109.              6.73307693e-01,  -1.09267062e-02,  -1.95144877e+00,...
  1110.      y: array([  3.34889746e-03,   1.81723690e-03,   1.71384644e-03,
  1111.              2.38867145e-03,   2.24459763e-03,   3.85577980e-03,
  1112.             -3.38487352e-03,   1.53649689e-03,   4.28749751e-04,...',), <traceback object at 0x106c185f0>)
  1113. AdiabaticExpansion__test_standard.test_standard: FAILURE (<type 'exceptions.AssertionError'>, AssertionError('
  1114.     Not equal to tolerance rtol=0.001, atol=0
  1115.     weight_field values of y-velocity (Density weighted) projection (axis 1) not equal.
  1116.     (mismatch 100.0%)
  1117.      x: array([  2.01512498e-29,   2.01616407e-29,   2.01844155e-29,
  1118.              2.01705997e-29,   2.01665025e-29,   2.01707663e-29,
  1119.              2.01767138e-29,   2.01789735e-29,   2.01708327e-29,...
  1120.      y: array([  2.01373439e-29,   2.01516190e-29,   2.01673075e-29,
  1121.              2.01551049e-29,   2.01530021e-29,   2.01528732e-29,
  1122.              2.01528708e-29,   2.01528644e-29,   2.01528871e-29,...',), <traceback object at 0x106fa3b90>)
  1123. AdiabaticExpansion__test_standard.test_standard: FAILURE (<type 'exceptions.AssertionError'>, AssertionError('
  1124.     Not equal to tolerance rtol=0.001, atol=0
  1125.     y-velocity values of y-velocity (None weighted) projection (axis 2) not equal.
  1126.     (mismatch 100.0%)
  1127.      x: array([  5.46380754e+04,   4.79982579e+04,   4.08886724e+03,
  1128.             -3.54177319e+04,  -5.18174425e+04,  -4.85556488e+04,
  1129.             -3.16030087e+04,  -9.32240824e+03,   4.98299319e+03,...
  1130.      y: array([  2.00592521e+04,   3.43914614e+04,   1.68765966e+04,
  1131.              2.64724728e+03,   1.46691081e+02,   7.82586913e+01,
  1132.              6.96563253e+01,   8.74637961e+01,   5.92629647e+01,...',), <traceback object at 0x106fa6200>)
  1133. AdiabaticExpansion__test_standard.test_standard: FAILURE (<type 'exceptions.AssertionError'>, AssertionError('
  1134.     Not equal to tolerance rtol=0.001, atol=0
  1135.     weight_field values of y-velocity (Density weighted) projection (axis 2) not equal.
  1136.     (mismatch 100.0%)
  1137.      x: array([  2.01512517e-29,   2.01616437e-29,   2.01844172e-29,
  1138.              2.01705980e-29,   2.01665008e-29,   2.01707631e-29,
  1139.              2.01767188e-29,   2.01789754e-29,   2.01708367e-29,...
  1140.      y: array([  2.01373439e-29,   2.01516190e-29,   2.01673075e-29,
  1141.              2.01551049e-29,   2.01530021e-29,   2.01528732e-29,
  1142.              2.01528708e-29,   2.01528644e-29,   2.01528871e-29,...',), <traceback object at 0x106fb31b8>)
  1143. AdiabaticExpansion__test_standard.test_standard: FAILURE (<type 'exceptions.AssertionError'>, AssertionError('
  1144.     Not equal to tolerance rtol=0.001, atol=0
  1145.     Field values for y-velocity not equal.
  1146.     (mismatch 100.0%)
  1147.      x: array([ -4.93019584e+02,  -1.08947775e+07,   1.08921563e+07])
  1148.      y: array([   243.54922616, -35310.89940223,  34425.92274348])',), <traceback object at 0x106fb41b8>)
  1149. AdiabaticExpansion__test_standard.test_standard: FAILURE (<type 'exceptions.AssertionError'>, AssertionError('
  1150.     Not equal to tolerance rtol=0.001, atol=0
  1151.     z-velocity values of z-velocity (None weighted) projection (axis 0) not equal.
  1152.     (mismatch 100.0%)
  1153.      x: array([  5.07657463e+04,   4.63412084e+04,   5.20422864e+03,
  1154.             -3.17360785e+04,  -4.53481534e+04,  -4.08043564e+04,
  1155.             -2.65706402e+04,  -6.03032997e+03,   1.30386405e+04,...
  1156.      y: array([  2.00696178e+04,   3.43969507e+04,   1.68736813e+04,
  1157.              2.63640495e+03,   1.28873283e+02,   5.78802889e+01,
  1158.              4.12697958e+01,   4.49736107e+01,   2.35686729e+01,...',), <traceback object at 0x106fb3908>)
  1159. AdiabaticExpansion__test_standard.test_standard: FAILURE (<type 'exceptions.AssertionError'>, AssertionError('
  1160.     Not equal to tolerance rtol=0.001, atol=0
  1161.     z-velocity values of z-velocity (Density weighted) projection (axis 0) not equal.
  1162.     (mismatch 100.0%)
  1163.      x: array([  5.07672847e+04,   4.63415854e+04,   5.20375875e+03,
  1164.             -3.17365788e+04,  -4.53477916e+04,  -4.08036142e+04,
  1165.             -2.65573627e+04,  -6.01926633e+03,   1.30103411e+04,...
  1166.      y: array([  2.00696188e+04,   3.43969524e+04,   1.68736816e+04,
  1167.              2.63640444e+03,   1.28873130e+02,   5.78804783e+01,
  1168.              4.12701318e+01,   4.49740013e+01,   2.35689848e+01,...',), <traceback object at 0x106fb7128>)
  1169. AdiabaticExpansion__test_standard.test_standard: FAILURE (<type 'exceptions.AssertionError'>, AssertionError('
  1170.     Not equal to tolerance rtol=0.001, atol=0
  1171.     z-velocity values of z-velocity (None weighted) projection (axis 1) not equal.
  1172.     (mismatch 100.0%)
  1173.      x: array([  5.46430732e+04,   4.80003482e+04,   4.08511325e+03,
  1174.             -3.54271994e+04,  -5.18385084e+04,  -4.85842920e+04,
  1175.             -3.16246872e+04,  -9.33424205e+03,   4.97847461e+03,...
  1176.      y: array([  2.00592490e+04,   3.43914600e+04,   1.68765949e+04,
  1177.              2.64724593e+03,   1.46695526e+02,   7.82740639e+01,
  1178.              6.96799744e+01,   8.74911243e+01,   5.92967574e+01,...',), <traceback object at 0x106fb3320>)
  1179. AdiabaticExpansion__test_standard.test_standard: FAILURE (<type 'exceptions.AssertionError'>, AssertionError('
  1180.     Not equal to tolerance rtol=0.001, atol=0
  1181.     z-velocity values of z-velocity (Density weighted) projection (axis 1) not equal.
  1182.     (mismatch 100.0%)
  1183.      x: array([  5.46469986e+04,   4.80009839e+04,   4.08390116e+03,
  1184.             -3.54292511e+04,  -5.18398158e+04,  -4.85855500e+04,
  1185.             -3.16171649e+04,  -9.32046746e+03,   4.96375594e+03,...
  1186.      y: array([  2.00592497e+04,   3.43914616e+04,   1.68765954e+04,
  1187.              2.64724585e+03,   1.46696063e+02,   7.82752378e+01,
  1188.              6.96815444e+01,   8.74931012e+01,   5.92985394e+01,...',), <traceback object at 0x106fa6200>)
  1189. AdiabaticExpansion__test_standard.test_standard: FAILURE (<type 'exceptions.AssertionError'>, AssertionError('
  1190.     Not equal to tolerance rtol=0.001, atol=0
  1191.     z-velocity values of z-velocity (None weighted) projection (axis 2) not equal.
  1192.     (mismatch 100.0%)
  1193.      x: array([  3.07341648e-02,   3.98827843e-01,   4.66838940e-01,
  1194.              2.55182841e-03,   4.65845318e-01,   4.88755998e-01,
  1195.              6.83733090e-01,  -2.57637946e-02,  -1.93994625e+00,...
  1196.      y: array([  3.47310860e-03,   1.89361162e-03,   1.78576329e-03,
  1197.              2.50131682e-03,   2.33985920e-03,   4.05693924e-03,
  1198.             -3.40147456e-03,   1.54843395e-03,   4.28010796e-04,...',), <traceback object at 0x106fa34d0>)
  1199. AdiabaticExpansion__test_standard.test_standard: FAILURE (<type 'exceptions.AssertionError'>, AssertionError('
  1200.     Not equal to tolerance rtol=0.001, atol=0
  1201.     z-velocity values of z-velocity (Density weighted) projection (axis 2) not equal.
  1202.     (mismatch 100.0%)
  1203.      x: array([ -1.85691611e+00,  -1.32303167e+00,  -1.36738306e+00,
  1204.             -2.35095135e+00,  -2.20987600e+00,  -3.30521933e+00,
  1205.             -3.86176162e+00,  -6.00838971e+00,  -1.02862915e+01,...
  1206.      y: array([  4.49114457e-03,   2.78238043e-03,   3.21606015e-03,
  1207.              3.70130029e-03,   3.87246800e-03,   5.07707787e-03,
  1208.             -2.08118476e-03,   3.51738992e-03,   2.86389225e-03,...',), <traceback object at 0x106d77c20>)
  1209. AdiabaticExpansion__test_standard.test_standard: FAILURE (<type 'exceptions.AssertionError'>, AssertionError('
  1210.     Not equal to tolerance rtol=0.001, atol=0
  1211.     Field values for z-velocity not equal.
  1212.     (mismatch 100.0%)
  1213.      x: array([ -6.20780517e+02,  -1.08943230e+07,   1.08893442e+07])
  1214.      y: array([   243.60251717, -35310.40990506,  34425.91979001])',), <traceback object at 0x106d77a28>)
  1215. MHDZeldovichPancake__test_standard.test_standard: FAILURE (<type 'exceptions.AssertionError'>, AssertionError('
  1216.     Items are not equal: Output times not equal.
  1217.      ACTUAL: 4.8164747703949
  1218.      DESIRED: 4.8164747703426',), <traceback object at 0x106dcfb00>)
  1219. MHDZeldovichPancake__test_standard.test_standard: FAILURE (<type 'exceptions.AssertionError'>, AssertionError('
  1220.     Not equal to tolerance rtol=0.001, atol=0
  1221.     x-velocity values of x-velocity (None weighted) projection (axis 0) not equal.
  1222.     (mismatch 100.0%)
  1223.      x: array([ 158.38184756])
  1224.      y: array([ 10.29856172])',), <traceback object at 0x1023bd050>)
  1225. MHDZeldovichPancake__test_standard.test_standard: FAILURE (<type 'exceptions.AssertionError'>, AssertionError('
  1226.     Not equal to tolerance rtol=0.001, atol=0
  1227.     x-velocity values of x-velocity (Density weighted) projection (axis 0) not equal.
  1228.     (mismatch 100.0%)
  1229.      x: array([ 11.13081453])
  1230.      y: array([ 11.21599345])',), <traceback object at 0x1023bb5a8>)
  1231. MHDZeldovichPancake__test_standard.test_standard: FAILURE (<type 'exceptions.AssertionError'>, AssertionError('
  1232.     Not equal to tolerance rtol=0.001, atol=0
  1233.     Field values for x-velocity not equal.
  1234.     (mismatch 100.0%)
  1235.      x: array([  4.52742330e+01,  -2.17294199e+08,   2.17294535e+08])
  1236.      y: array([  1.10343452e+01,  -2.17245505e+08,   2.17245522e+08])',), <traceback object at 0x1023bb518>)
  1237. GravityTest__test_gravity.test_gravity_test: FAILURE (<type 'exceptions.AssertionError'>, AssertionError('
  1238.     Not equal to tolerance rtol=0.001, atol=0
  1239.    
  1240.     (mismatch 100.0%)
  1241.      x: array(0.24742341596959755)
  1242.      y: array(0.24332802273585494)',), <traceback object at 0x106d4fe18>)
  1243. GravityTestSphere__test_standard.test_standard: FAILURE (<type 'exceptions.AssertionError'>, AssertionError('
  1244.     Not equal to tolerance rtol=0.001, atol=0
  1245.     x-velocity values of x-velocity (None weighted) projection (axis 0) not equal.
  1246.     (mismatch 100.0%)
  1247.      x: array([ -3.02748104e-22,  -6.84905547e-22,  -7.34536384e-22, ...,
  1248.             -1.00384469e-04,  -1.00384469e-04,  -1.00733697e-04])
  1249.      y: array([  4.29140332e-28,  -4.29140332e-28,   4.03896783e-28, ...,
  1250.              2.21603187e-05,   2.21603187e-05,   2.18135806e-05])',), <traceback object at 0x1075d7638>)
  1251. GravityTestSphere__test_standard.test_standard: FAILURE (<type 'exceptions.AssertionError'>, AssertionError('
  1252.     Not equal to tolerance rtol=0.001, atol=0
  1253.     x-velocity values of x-velocity (Density weighted) projection (axis 0) not equal.
  1254.     (mismatch 100.0%)
  1255.      x: array([ -1.05917893e-19,   5.11481962e-20,  -1.95142246e-19, ...,
  1256.             -1.00384470e-04,  -1.00384470e-04,  -1.00733654e-04])
  1257.      y: array([  9.46633086e-28,   1.18329136e-28,   7.09974815e-28, ...,
  1258.              2.21605177e-05,   2.21605177e-05,   2.18138061e-05])',), <traceback object at 0x106f77d40>)
  1259. GravityTestSphere__test_standard.test_standard: FAILURE (<type 'exceptions.AssertionError'>, AssertionError('
  1260.     Not equal to tolerance rtol=0.001, atol=0
  1261.     x-velocity values of x-velocity (None weighted) projection (axis 1) not equal.
  1262.     (mismatch 100.0%)
  1263.      x: array([  2.64082024e-07,   2.72771895e-07,   2.87381201e-07, ...,
  1264.             -4.42647325e-04,  -4.54349185e-04,  -4.39098086e-04])
  1265.      y: array([ -1.66223426e-12,  -1.70978144e-12,  -1.80858128e-12, ...,
  1266.             -3.97256118e-04,  -4.08967421e-04,  -3.93712428e-04])',), <traceback object at 0x106f77290>)
  1267. GravityTestSphere__test_standard.test_standard: FAILURE (<type 'exceptions.AssertionError'>, AssertionError('
  1268.     Not equal to tolerance rtol=0.001, atol=0
  1269.     x-velocity values of x-velocity (Density weighted) projection (axis 1) not equal.
  1270.     (mismatch 100.0%)
  1271.      x: array([  2.64082024e-07,   2.72771895e-07,   2.87381201e-07, ...,
  1272.             -4.42649246e-04,  -4.54351287e-04,  -4.39101283e-04])
  1273.      y: array([ -1.66223426e-12,  -1.70978144e-12,  -1.80858128e-12, ...,
  1274.             -3.97258008e-04,  -4.08969493e-04,  -3.93715602e-04])',), <traceback object at 0x106cf8f80>)
  1275. GravityTestSphere__test_standard.test_standard: FAILURE (<type 'exceptions.AssertionError'>, AssertionError('
  1276.     Not equal to tolerance rtol=0.001, atol=0
  1277.     x-velocity values of x-velocity (None weighted) projection (axis 2) not equal.
  1278.     (mismatch 100.0%)
  1279.      x: array([  2.64082024e-07,   2.72771895e-07,   2.87381201e-07, ...,
  1280.             -4.42647325e-04,  -4.54349185e-04,  -4.39098086e-04])
  1281.      y: array([ -1.66223426e-12,  -1.70978144e-12,  -1.80858128e-12, ...,
  1282.             -3.97256118e-04,  -4.08967421e-04,  -3.93712428e-04])',), <traceback object at 0x106cf9d40>)
  1283. GravityTestSphere__test_standard.test_standard: FAILURE (<type 'exceptions.AssertionError'>, AssertionError('
  1284.     Not equal to tolerance rtol=0.001, atol=0
  1285.     x-velocity values of x-velocity (Density weighted) projection (axis 2) not equal.
  1286.     (mismatch 100.0%)
  1287.      x: array([  2.64082024e-07,   2.72771895e-07,   2.87381201e-07, ...,
  1288.             -4.42649246e-04,  -4.54351287e-04,  -4.39101283e-04])
  1289.      y: array([ -1.66223426e-12,  -1.70978144e-12,  -1.80858128e-12, ...,
  1290.             -3.97258008e-04,  -4.08969493e-04,  -3.93715602e-04])',), <traceback object at 0x106d3a200>)
  1291. GravityTestSphere__test_standard.test_standard: FAILURE (<type 'exceptions.AssertionError'>, AssertionError('
  1292.     Not equal to tolerance rtol=0.001, atol=0
  1293.     Field values for x-velocity not equal.
  1294.     (mismatch 100.0%)
  1295.      x: array([ 0.00069027, -0.04387345,  0.04396361])
  1296.      y: array([ 0.00065458, -0.04392307,  0.0439129 ])',), <traceback object at 0x106d3a320>)
  1297. GravityTestSphere__test_standard.test_standard: FAILURE (<type 'exceptions.AssertionError'>, AssertionError('
  1298.     Not equal to tolerance rtol=0.001, atol=0
  1299.     y-velocity values of y-velocity (None weighted) projection (axis 0) not equal.
  1300.     (mismatch 100.0%)
  1301.      x: array([ -4.97661152e-11,   4.78535987e-11,  -4.41021624e-11, ...,
  1302.             -3.82218697e-04,  -3.94969521e-04,  -3.78994775e-04])
  1303.      y: array([ -1.13113918e-16,   1.08767014e-16,  -1.00240255e-16, ...,
  1304.             -3.84079386e-04,  -3.96830944e-04,  -3.80856184e-04])',), <traceback object at 0x106d3af80>)
  1305. GravityTestSphere__test_standard.test_standard: FAILURE (<type 'exceptions.AssertionError'>, AssertionError('
  1306.     Not equal to tolerance rtol=0.001, atol=0
  1307.     y-velocity values of y-velocity (Density weighted) projection (axis 0) not equal.
  1308.     (mismatch 100.0%)
  1309.      x: array([ -4.97661152e-11,   4.78535987e-11,  -4.41021624e-11, ...,
  1310.             -3.82220808e-04,  -3.94971732e-04,  -3.78998194e-04])
  1311.      y: array([ -1.13113918e-16,   1.08767014e-16,  -1.00240255e-16, ...,
  1312.             -3.84081387e-04,  -3.96833045e-04,  -3.80859491e-04])',), <traceback object at 0x106d44bd8>)
  1313. GravityTestSphere__test_standard.test_standard: FAILURE (<type 'exceptions.AssertionError'>, AssertionError('
  1314.     Not equal to tolerance rtol=0.001, atol=0
  1315.     y-velocity values of y-velocity (None weighted) projection (axis 1) not equal.
  1316.     (mismatch 100.0%)
  1317.      x: array([  3.30872245e-24,   3.63959470e-22,   1.22422731e-22, ...,
  1318.             -6.73975129e-05,  -6.74011730e-05,  -6.75657381e-05])
  1319.      y: array([  0.00000000e+00,   5.80601626e-28,  -7.57306469e-29, ...,
  1320.             -1.30095760e-05,  -1.30133849e-05,  -1.31791034e-05])',), <traceback object at 0x1075e2758>)
  1321. GravityTestSphere__test_standard.test_standard: FAILURE (<type 'exceptions.AssertionError'>, AssertionError('
  1322.     Not equal to tolerance rtol=0.001, atol=0
  1323.     y-velocity values of y-velocity (Density weighted) projection (axis 1) not equal.
  1324.     (mismatch 100.0%)
  1325.      x: array([ -2.24830276e-19,   1.21804930e-19,  -2.07053647e-19, ...,
  1326.             -6.73975581e-05,  -6.74012162e-05,  -6.75657520e-05])
  1327.      y: array([  4.14151975e-28,   6.31088724e-28,   8.08582428e-28, ...,
  1328.             -1.30094730e-05,  -1.30132802e-05,  -1.31789749e-05])',), <traceback object at 0x106f77e18>)
  1329. GravityTestSphere__test_standard.test_standard: FAILURE (<type 'exceptions.AssertionError'>, AssertionError('
  1330.     Not equal to tolerance rtol=0.001, atol=0
  1331.     y-velocity values of y-velocity (None weighted) projection (axis 2) not equal.
  1332.     (mismatch 100.0%)
  1333.      x: array([ -8.23442908e-10,   8.25505815e-07,   1.62451216e-06, ...,
  1334.             -3.81716666e-04,  -3.69309258e-04,  -3.66465499e-04])
  1335.      y: array([ -4.24182314e-16,   4.52506626e-12,  -2.45321647e-12, ...,
  1336.             -3.81288309e-04,  -3.68879242e-04,  -3.66033257e-04])',), <traceback object at 0x1075db200>)
  1337. GravityTestSphere__test_standard.test_standard: FAILURE (<type 'exceptions.AssertionError'>, AssertionError('
  1338.     Not equal to tolerance rtol=0.001, atol=0
  1339.     y-velocity values of y-velocity (Density weighted) projection (axis 2) not equal.
  1340.     (mismatch 100.0%)
  1341.      x: array([ -8.23442908e-10,   8.25505815e-07,   1.62451216e-06, ...,
  1342.             -3.81718640e-04,  -3.69311227e-04,  -3.66468641e-04])
  1343.      y: array([ -4.24182314e-16,   4.52506626e-12,  -2.45321647e-12, ...,
  1344.             -3.81290249e-04,  -3.68881176e-04,  -3.66036363e-04])',), <traceback object at 0x106d418c0>)
  1345. GravityTestSphere__test_standard.test_standard: FAILURE (<type 'exceptions.AssertionError'>, AssertionError('
  1346.     Not equal to tolerance rtol=0.001, atol=0
  1347.     Field values for y-velocity not equal.
  1348.     (mismatch 100.0%)
  1349.      x: array([ 0.00030694, -0.04424704,  0.04424704])
  1350.      y: array([ 0.00030873, -0.04424477,  0.04425738])',), <traceback object at 0x106d419e0>)
  1351. GravityTestSphere__test_standard.test_standard: FAILURE (<type 'exceptions.AssertionError'>, AssertionError('
  1352.     Not equal to tolerance rtol=0.001, atol=0
  1353.     z-velocity values of z-velocity (None weighted) projection (axis 0) not equal.
  1354.     (mismatch 100.0%)
  1355.      x: array([ -4.97661152e-11,   8.20748160e-07,   1.61716874e-06, ...,
  1356.             -3.94969521e-04,  -3.82218697e-04,  -3.78994775e-04])
  1357.      y: array([ -1.13113915e-16,   4.56682114e-12,  -2.36902466e-12, ...,
  1358.             -3.96830944e-04,  -3.84079386e-04,  -3.80856184e-04])',), <traceback object at 0x1075e59e0>)
  1359. GravityTestSphere__test_standard.test_standard: FAILURE (<type 'exceptions.AssertionError'>, AssertionError('
  1360.     Not equal to tolerance rtol=0.001, atol=0
  1361.     z-velocity values of z-velocity (Density weighted) projection (axis 0) not equal.
  1362.     (mismatch 100.0%)
  1363.      x: array([ -4.97661152e-11,   8.20748160e-07,   1.61716874e-06, ...,
  1364.             -3.94971732e-04,  -3.82220808e-04,  -3.78998194e-04])
  1365.      y: array([ -1.13113915e-16,   4.56682114e-12,  -2.36902466e-12, ...,
  1366.             -3.96833045e-04,  -3.84081387e-04,  -3.80859491e-04])',), <traceback object at 0x1075e6440>)
  1367. GravityTestSphere__test_standard.test_standard: FAILURE (<type 'exceptions.AssertionError'>, AssertionError('
  1368.     Not equal to tolerance rtol=0.001, atol=0
  1369.     z-velocity values of z-velocity (None weighted) projection (axis 1) not equal.
  1370.     (mismatch 100.0%)
  1371.      x: array([ -8.23442908e-10,   8.25505815e-07,   1.62451216e-06, ...,
  1372.             -3.81716666e-04,  -3.69309258e-04,  -3.66465499e-04])
  1373.      y: array([ -4.24182310e-16,   4.52506626e-12,  -2.45321647e-12, ...,
  1374.             -3.81288309e-04,  -3.68879242e-04,  -3.66033257e-04])',), <traceback object at 0x1075e6638>)
  1375. GravityTestSphere__test_standard.test_standard: FAILURE (<type 'exceptions.AssertionError'>, AssertionError('
  1376.     Not equal to tolerance rtol=0.001, atol=0
  1377.     z-velocity values of z-velocity (Density weighted) projection (axis 1) not equal.
  1378.     (mismatch 100.0%)
  1379.      x: array([ -8.23442908e-10,   8.25505815e-07,   1.62451216e-06, ...,
  1380.             -3.81718640e-04,  -3.69311227e-04,  -3.66468641e-04])
  1381.      y: array([ -4.24182310e-16,   4.52506626e-12,  -2.45321647e-12, ...,
  1382.             -3.81290249e-04,  -3.68881176e-04,  -3.66036363e-04])',), <traceback object at 0x106d0a830>)
  1383. GravityTestSphere__test_standard.test_standard: FAILURE (<type 'exceptions.AssertionError'>, AssertionError('
  1384.     Not equal to tolerance rtol=0.001, atol=0
  1385.     z-velocity values of z-velocity (None weighted) projection (axis 2) not equal.
  1386.     (mismatch 100.0%)
  1387.      x: array([ -5.29395592e-23,  -2.08449514e-22,   2.11758237e-22, ...,
  1388.             -6.73975129e-05,  -6.74011730e-05,  -6.75657381e-05])
  1389.      y: array([ -5.04870979e-29,  -2.52435490e-29,   2.01948392e-28, ...,
  1390.             -1.30095760e-05,  -1.30133849e-05,  -1.31791034e-05])',), <traceback object at 0x106d0a5a8>)
  1391. GravityTestSphere__test_standard.test_standard: FAILURE (<type 'exceptions.AssertionError'>, AssertionError('
  1392.     Not equal to tolerance rtol=0.001, atol=0
  1393.     z-velocity values of z-velocity (Density weighted) projection (axis 2) not equal.
  1394.     (mismatch 100.0%)
  1395.      x: array([ -2.24589876e-19,   1.22171992e-19,  -2.07017458e-19, ...,
  1396.             -6.73975581e-05,  -6.74012162e-05,  -6.75657520e-05])
  1397.      y: array([  4.53595021e-28,   1.02551918e-27,   2.76101317e-28, ...,
  1398.             -1.30094730e-05,  -1.30132802e-05,  -1.31789749e-05])',), <traceback object at 0x106f6c710>)
  1399. GravityTestSphere__test_standard.test_standard: FAILURE (<type 'exceptions.AssertionError'>, AssertionError('
  1400.     Not equal to tolerance rtol=0.001, atol=0
  1401.     Field values for z-velocity not equal.
  1402.     (mismatch 100.0%)
  1403.      x: array([ 0.00030694, -0.04424704,  0.04424704])
  1404.      y: array([ 0.00030873, -0.04424477,  0.04425738])',), <traceback object at 0x106f6ce60>)
  1405. PhotonShadowing__test_standard.test_standard: FAILURE (<type 'exceptions.AssertionError'>, AssertionError('
  1406.     Items are not equal: Output times not equal.
  1407.      ACTUAL: 0.99999054614794
  1408.      DESIRED: 0.99999144105439',), <traceback object at 0x107580998>)
  1409.  
  1410. Tests that errored:
RAW Paste Data
We use cookies for various purposes including analytics. By continuing to use Pastebin, you agree to our use of cookies as described in the Cookies Policy. OK, I Understand
Top