SHARE
TWEET

Corona

a guest Jul 25th, 2019 24 Never
Not a member of Pastebin yet? Sign Up, it unlocks many cool features!
  1. 11:40:11.146  
  2. 11:40:11.146  Copyright (C) 2009-2019  C o r o n a   L a b s   I n c .
  3. 11:40:11.146    Version: 3.0.0
  4. 11:40:11.146    Build: 2019.3504
  5. 11:40:11.146  Platform: GT-I9300 / x64 / 6.1 / Intel(R) HD Graphics 4000 / 3.3.0 - Build 8.15.10.2778 / 2019.3504 / en_US | US | en_US | en
  6. 11:40:11.146  Loading project from:   C:\Program Files (x86)\Corona Labs\Corona\Sample Code\GettingStarted\HelloWorld
  7. 11:40:11.146  Project sandbox folder: C:\Users\viral\AppData\Local\Corona Labs\Corona Simulator\Sandbox\helloworld-B0BA8AD67375BCE02D153B4D3F8CC8BB\Documents
  8. 11:40:15.983  Testing credentials for 'F:\MyGames\codenew\millionaireNewTheme\gkapps_gkapps123.keystore':
  9. 11:40:17.696  Picked up JAVA_TOOL_OPTIONS: -Duser.language=en
  10. 11:40:17.696  jar signed.
  11. 11:40:19.601  Using custom build id from app bundle: 00000 (AppSettings.lua)
  12. 11:40:19.601  
  13. 11:40:19.601  Using custom Build Id 00000
  14. 11:40:19.611  Prepackage: Compiling Lua ...
  15. 11:40:19.661  Prepackage: Building server data file
  16. 11:40:19.661  Prepackage: running: "C:\Program Files\Java\jdk-12.0.2\bin\java.exe" -Djava.class.path="C:\Program Files (x86)\Corona Labs\Corona\Resources/ant.jar;C:\Program Files (x86)\Corona Labs\Corona\Resources/ant-launcher.jar;C:\Program Files (x86)\Corona Labs\Corona\Resources/AntLiveManifest.jar" org.apache.tools.ant.launch.Launcher -d -DTEMP_DIR="C:\Users\viral\AppData\Local\Temp\Corona Labs\CLtmpa00776" -DSRC_DIR="C:\Program Files (x86)\Corona Labs\Corona\Sample Code\GettingStarted\HelloWorld" -DBUNDLE_DIR="C:\Program Files (x86)\Corona Labs\Corona\Resources" -DLIVE_BUILD=NO -DLIVE_BUILD_MANIFEST_FILE= -f "C:\Program Files (x86)\Corona Labs\Corona\Resources"/build.xml build-input-zip
  17. 11:40:21.606  Picked up JAVA_TOOL_OPTIONS: -Duser.language=en
  18. 11:40:21.606  Apache Ant version 1.8.1 compiled on April 30 2010
  19. 11:40:21.606  Buildfile: C:\Program Files (x86)\Corona Labs\Corona\Resources\build.xml
  20. 11:40:21.606  Adding reference: ant.PropertyHelper
  21. 11:40:21.606  Detected Java version: 1.6 in: C:\Program Files\Java\jdk-12.0.2
  22. 11:40:21.606  Detected OS: Windows 7
  23. 11:40:21.606  Adding reference: ant.ComponentHelper
  24. 11:40:21.606  Setting ro project property: LIVE_BUILD -> NO
  25. 11:40:21.606  Setting ro project property: BUNDLE_DIR -> C:\Program Files (x86)\Corona Labs\Corona\Resources
  26. 11:40:21.606  Setting ro project property: TEMP_DIR -> C:\Users\viral\AppData\Local\Temp\Corona Labs\CLtmpa00776
  27. 11:40:21.606  Setting ro project property: SRC_DIR -> C:\Program Files (x86)\Corona Labs\Corona\Sample Code\GettingStarted\HelloWorld
  28. 11:40:21.606  Setting ro project property: LIVE_BUILD_MANIFEST_FILE ->
  29. 11:40:21.606  Setting ro project property: ant.file -> C:\Program Files (x86)\Corona Labs\Corona\Resources\build.xml
  30. 11:40:21.606  Setting ro project property: ant.file.type -> file
  31. 11:40:21.606  Adding reference: ant.projectHelper
  32. 11:40:21.606  Adding reference: ant.parsing.context
  33. 11:40:21.606  Adding reference: ant.targets
  34. 11:40:21.606  parsing buildfile C:\Program Files (x86)\Corona Labs\Corona\Resources\build.xml with URI = file:/C:/Program%20Files%20(x86)/Corona%20Labs/Corona/Resources/build.xml
  35. 11:40:21.606  Setting ro project property: ant.project.name -> Corona Client Build
  36. 11:40:21.606  Adding reference: Corona Client Build
  37. 11:40:21.606  Setting ro project property: ant.project.default-target -> none
  38. 11:40:21.606  Setting ro project property: ant.file.Corona Client Build -> C:\Program Files (x86)\Corona Labs\Corona\Resources\build.xml
  39. 11:40:21.606  Setting ro project property: ant.file.type.Corona Client Build -> file
  40. 11:40:21.606  Project base dir set to: C:\Program Files (x86)\Corona Labs\Corona\Resources
  41. 11:40:21.606   +Target:
  42. 11:40:21.606   +Target: generate-live-build-manifest
  43. 11:40:21.606   +Target: check-gradle-bundle
  44. 11:40:21.606   +Target: setup-gradle-builds
  45. 11:40:21.606   +Target: build-input-zip
  46. 11:40:21.606   +Target: unzip-apk-template
  47. 11:40:21.606   +Target: find-main-application-icons
  48. 11:40:21.606   +Target: find-main-application-banner
  49. 11:40:21.606   +Target: find-ouya-application-icon
  50. 11:40:21.606   +Target: find-ouya-xiaomi-application-icon
  51. 11:40:21.606   +Target: find-default-notification-icons
  52. 11:40:21.606   +Target: copy-file
  53. 11:40:21.606   +Target: can-copy-file
  54. 11:40:21.606   +Target: delete-file
  55. 11:40:21.606   +Target: can-delete-file
  56. 11:40:21.606   +Target: insert-main-application-icons
  57. 11:40:21.606   +Target: insert-main-application-banner
  58. 11:40:21.606   +Target: insert-ouya-application-icon
  59. 11:40:21.606   +Target: insert-ouya-xiaomi-application-icon
  60. 11:40:21.606   +Target: insert-default-notification-icons
  61. 11:40:21.606   +Target: insert-assets-multi-icon
  62. 11:40:21.606   +Target: copy-apk-assets
  63. 11:40:21.606   +Target: copy-files-to-apk
  64. 11:40:21.606   +Target: sign-apk
  65. 11:40:21.606   +Target: sign-apk-md5
  66. 11:40:21.606   +Target: sign-apk-sha1
  67. 11:40:21.606   +Target: sign-apk-auto
  68. 11:40:21.606   +Target: build-unsigned-apk
  69. 11:40:21.606   +Target: build-signed-apk
  70. 11:40:21.606   +Target: build-expansion-file
  71. 11:40:21.606   +Target: copy-apk-to
  72. 11:40:21.606   +Target: copy-to
  73. 11:40:21.606   +Target: build
  74. 11:40:21.606   +Target: test-sign
  75. 11:40:21.606  Adding reference: ant.LocalProperties
  76. 11:40:21.606  parsing buildfile jar:file:/C:/Program%20Files%20(x86)/Corona%20Labs/Corona/Resources/ant.jar!/org/apache/tools/ant/antlib.xml with URI = jar:file:/C:/Program%20Files%20(x86)/Corona%20Labs/Corona/Resources/ant.jar!/org/apache/tools/ant/antlib.xml from a zip file
  77. 11:40:21.606   [property] Loading C:\Program Files (x86)\Corona Labs\Corona\Resources\build.properties
  78. 11:40:21.606  Setting project property: ANDROID_API_VERSION -> android-8
  79. 11:40:21.606  Setting project property: ANDROID_ROOT -> /usr/local/bin/android-sdk-mac_x86
  80. 11:40:21.606  Setting project property: USER_ACTIVITY_PATH -> com/ansca/test/analyticstest
  81. 11:40:21.606  Setting project property: ANDROID_VERSION -> android-8
  82. 11:40:21.606  Setting project property: USER_ACTIVITY_PACKAGE -> com.ansca.test.analyticstest
  83. 11:40:21.606  Setting project property: ANDROID_MIN_SDK_INTEGER_VERSION -> 8
  84. 11:40:21.606  Setting project property: CORONA_ROOT -> /Volumes/Ansca/code/main
  85. 11:40:21.606  Setting project property: USER_APP_DISPLAY_NAME -> analyticstest
  86. 11:40:21.606  Override ignored for property "SRC_DIR"
  87. 11:40:21.606  Setting project property: APK_APP_NAME -> MyCoronaActivity
  88. 11:40:21.606  Class org.apache.tools.ant.taskdefs.condition.Os loaded from parent loader (parentFirst)
  89. 11:40:21.606  Condition true; setting SCRIPT_EXT to exe
  90. 11:40:21.606  Setting project property: SCRIPT_EXT -> exe
  91. 11:40:21.606  Override ignored for property "SCRIPT_EXT"
  92. 11:40:21.606  Condition true; setting USE_OLD_TOUCH to true
  93. 11:40:21.606  Setting project property: USE_OLD_TOUCH -> true
  94. 11:40:21.606  Condition true; setting onWindows to true
  95. 11:40:21.606  Setting project property: onWindows -> true
  96. 11:40:21.606  Class org.apache.tools.ant.taskdefs.condition.Equals loaded from parent loader (parentFirst)
  97. 11:40:21.606  Condition false; not setting live.build
  98. 11:40:21.606  Adding reference: asset.fileset
  99. 11:40:21.606  [available] Found: C:\Program Files (x86)\Corona Labs\Corona\Native\Corona\android
  100. 11:40:21.606  Condition true; setting corona.native.android to C:\Program Files (x86)\Corona Labs\Corona\Resources/../Native/Corona/android
  101. 11:40:21.606  Setting project property: corona.native.android -> C:\Program Files (x86)\Corona Labs\Corona\Resources/../Native/Corona/android
  102. 11:40:21.606  [available] Unable to find C:\Program Files (x86)\Native\Corona\android
  103. 11:40:21.606  Condition false; not setting corona.native.android
  104. 11:40:21.606  [available] Unable to find ..\..\..\..\..\android
  105. 11:40:21.606  Condition false; not setting corona.native.android
  106. 11:40:21.606  [available] Unable to find C:\Users\viral\Library\Application Support\Corona\Native\Corona\android
  107. 11:40:21.606  Condition false; not setting corona.native.android
  108. 11:40:21.606   +Datatype copy-res-file org.apache.tools.ant.taskdefs.MacroInstance
  109. 11:40:21.606   [macrodef] creating macro  copy-res-file
  110. 11:40:21.606   +Datatype copy-drawable-file org.apache.tools.ant.taskdefs.MacroInstance
  111. 11:40:21.606   [macrodef] creating macro  copy-drawable-file
  112. 11:40:21.606   +Datatype copy-mipmap-file org.apache.tools.ant.taskdefs.MacroInstance
  113. 11:40:21.606   [macrodef] creating macro  copy-mipmap-file
  114. 11:40:21.606   +Datatype copy-notification-icon org.apache.tools.ant.taskdefs.MacroInstance
  115. 11:40:21.606   [macrodef] creating macro  copy-notification-icon
  116. 11:40:21.606  Setting ro project property: ant.project.invoked-targets -> build-input-zip
  117. 11:40:21.606  Attempting to create object of type org.apache.tools.ant.helper.DefaultExecutor
  118. 11:40:21.606  Adding reference: ant.executor
  119. 11:40:21.606  Build sequence for target(s) `build-input-zip' is [generate-live-build-manifest, check-gradle-bundle, setup-gradle-builds, build-input-zip]
  120. 11:40:21.606  Complete build sequence is [generate-live-build-manifest, check-gradle-bundle, setup-gradle-builds, build-input-zip, can-delete-file, unzip-apk-template, build-unsigned-apk, sign-apk-md5, sign-apk-sha1, can-copy-file, build-signed-apk, copy-files-to-apk, copy-apk-assets, test-sign, find-ouya-xiaomi-application-icon, insert-ouya-xiaomi-application-icon, copy-apk-to, sign-apk-auto, sign-apk, find-main-application-banner, insert-main-application-banner, find-main-application-icons, insert-main-application-icons, find-default-notification-icons, insert-default-notification-icons, insert-assets-multi-icon, build-expansion-file, copy-to, build, find-ouya-application-icon, insert-ouya-application-icon, copy-file, , delete-file]
  121. 11:40:21.606  
  122. 11:40:21.606  generate-live-build-manifest:
  123. 11:40:21.606  Skipped because property 'live.build' not set.
  124. 11:40:21.606  
  125. 11:40:21.606  check-gradle-bundle:
  126. 11:40:21.606  [available] Found: C:\Program Files (x86)\Corona Labs\Corona\Native\Corona\android\resource\android-template.zip
  127. 11:40:21.606  Setting project property: gradle.bundle.exists -> true
  128. 11:40:21.606  
  129. 11:40:21.606  setup-gradle-builds:
  130. 11:40:21.606      [unzip] Expanding: C:\Program Files (x86)\Corona Labs\Corona\Native\Corona\android\resource\android-template.zip into C:\Users\viral\AppData\Local\Temp\Corona Labs\CLtmpa00776
  131. 11:40:21.606      [unzip] extracting template/gradlew.bat
  132. 11:40:21.606      [unzip] expanding template/gradlew.bat to C:\Users\viral\AppData\Local\Temp\Corona Labs\CLtmpa00776\template\gradlew.bat
  133. 11:40:21.606      [unzip] extracting template/setup.sh
  134. 11:40:21.606      [unzip] expanding template/setup.sh to C:\Users\viral\AppData\Local\Temp\Corona Labs\CLtmpa00776\template\setup.sh
  135. 11:40:21.606      [unzip] extracting template/gradle.properties
  136. 11:40:21.606      [unzip] expanding template/gradle.properties to C:\Users\viral\AppData\Local\Temp\Corona Labs\CLtmpa00776\template\gradle.properties
  137. 11:40:21.606      [unzip] extracting template/app/
  138. 11:40:21.606      [unzip] expanding template/app/ to C:\Users\viral\AppData\Local\Temp\Corona Labs\CLtmpa00776\template\app
  139. 11:40:21.606      [unzip] extracting template/app/build.gradle.kts
  140. 11:40:21.606      [unzip] expanding template/app/build.gradle.kts to C:\Users\viral\AppData\Local\Temp\Corona Labs\CLtmpa00776\template\app\build.gradle.kts
  141. 11:40:21.606      [unzip] extracting template/gradle/wrapper/gradle-wrapper.properties
  142. 11:40:21.606      [unzip] expanding template/gradle/wrapper/gradle-wrapper.properties to C:\Users\viral\AppData\Local\Temp\Corona Labs\CLtmpa00776\template\gradle\wrapper\gradle-wrapper.properties
  143. 11:40:21.606      [unzip] extracting template/app/src/main/
  144. 11:40:21.606      [unzip] expanding template/app/src/main/ to C:\Users\viral\AppData\Local\Temp\Corona Labs\CLtmpa00776\template\app\src\main
  145. 11:40:21.606      [unzip] extracting sdk/licenses/android-sdk-license
  146. 11:40:21.606      [unzip] expanding sdk/licenses/android-sdk-license to C:\Users\viral\AppData\Local\Temp\Corona Labs\CLtmpa00776\sdk\licenses\android-sdk-license
  147. 11:40:21.606      [unzip] extracting template/app/buildTools/strings.xml
  148. 11:40:21.606      [unzip] expanding template/app/buildTools/strings.xml to C:\Users\viral\AppData\Local\Temp\Corona Labs\CLtmpa00776\template\app\buildTools\strings.xml
  149. 11:40:21.606      [unzip] extracting template/app/_corona_splash_screen.png
  150. 11:40:21.606      [unzip] expanding template/app/_corona_splash_screen.png to C:\Users\viral\AppData\Local\Temp\Corona Labs\CLtmpa00776\template\app\_corona_splash_screen.png
  151. 11:40:21.606      [unzip] extracting template/app/src/main/res/values/
  152. 11:40:21.606      [unzip] expanding template/app/src/main/res/values/ to C:\Users\viral\AppData\Local\Temp\Corona Labs\CLtmpa00776\template\app\src\main\res\values
  153. 11:40:21.606      [unzip] extracting template/
  154. 11:40:21.606      [unzip] expanding template/ to C:\Users\viral\AppData\Local\Temp\Corona Labs\CLtmpa00776\template
  155. 11:40:21.606      [unzip] extracting sdk/
  156. 11:40:21.606      [unzip] expanding sdk/ to C:\Users\viral\AppData\Local\Temp\Corona Labs\CLtmpa00776\sdk
  157. 11:40:21.606      [unzip] extracting template/gradlew
  158. 11:40:21.606      [unzip] expanding template/gradlew to C:\Users\viral\AppData\Local\Temp\Corona Labs\CLtmpa00776\template\gradlew
  159. 11:40:21.606      [unzip] extracting template/app/proguard-rules.pro
  160. 11:40:21.606      [unzip] expanding template/app/proguard-rules.pro to C:\Users\viral\AppData\Local\Temp\Corona Labs\CLtmpa00776\template\app\proguard-rules.pro
  161. 11:40:21.606      [unzip] extracting template/app/buildTools/update_manifest.lua
  162. 11:40:21.606      [unzip] expanding template/app/buildTools/update_manifest.lua to C:\Users\viral\AppData\Local\Temp\Corona Labs\CLtmpa00776\template\app\buildTools\update_manifest.lua
  163. 11:40:21.606      [unzip] extracting template/app/buildTools/convert_metadata.lua
  164. 11:40:21.616      [unzip] expanding template/app/buildTools/convert_metadata.lua to C:\Users\viral\AppData\Local\Temp\Corona Labs\CLtmpa00776\template\app\buildTools\convert_metadata.lua
  165. 11:40:21.616      [unzip] extracting template/app/src/main/res/
  166. 11:40:21.616      [unzip] expanding template/app/src/main/res/ to C:\Users\viral\AppData\Local\Temp\Corona Labs\CLtmpa00776\template\app\src\main\res
  167. 11:40:21.616      [unzip] extracting template/gradle/wrapper/
  168. 11:40:21.616      [unzip] expanding template/gradle/wrapper/ to C:\Users\viral\AppData\Local\Temp\Corona Labs\CLtmpa00776\template\gradle\wrapper
  169. 11:40:21.616      [unzip] extracting template/gradle/wrapper/gradle-wrapper.jar
  170. 11:40:21.616      [unzip] expanding template/gradle/wrapper/gradle-wrapper.jar to C:\Users\viral\AppData\Local\Temp\Corona Labs\CLtmpa00776\template\gradle\wrapper\gradle-wrapper.jar
  171. 11:40:21.616      [unzip] extracting template/settings.gradle.kts
  172. 11:40:21.616      [unzip] expanding template/settings.gradle.kts to C:\Users\viral\AppData\Local\Temp\Corona Labs\CLtmpa00776\template\settings.gradle.kts
  173. 11:40:21.616      [unzip] extracting template/app/src/
  174. 11:40:21.616      [unzip] expanding template/app/src/ to C:\Users\viral\AppData\Local\Temp\Corona Labs\CLtmpa00776\template\app\src
  175. 11:40:21.616      [unzip] extracting template/gradle/
  176. 11:40:21.616      [unzip] expanding template/gradle/ to C:\Users\viral\AppData\Local\Temp\Corona Labs\CLtmpa00776\template\gradle
  177. 11:40:21.616      [unzip] extracting template/app/src/main/res/values/strings.xml
  178. 11:40:21.616      [unzip] expanding template/app/src/main/res/values/strings.xml to C:\Users\viral\AppData\Local\Temp\Corona Labs\CLtmpa00776\template\app\src\main\res\values\strings.xml
  179. 11:40:21.616      [unzip] extracting template/app/buildTools/
  180. 11:40:21.616      [unzip] expanding template/app/buildTools/ to C:\Users\viral\AppData\Local\Temp\Corona Labs\CLtmpa00776\template\app\buildTools
  181. 11:40:21.616      [unzip] extracting template/build.gradle.kts
  182. 11:40:21.616      [unzip] expanding template/build.gradle.kts to C:\Users\viral\AppData\Local\Temp\Corona Labs\CLtmpa00776\template\build.gradle.kts
  183. 11:40:21.616      [unzip] extracting template/app/libs/licensing-google.jar
  184. 11:40:21.616      [unzip] expanding template/app/libs/licensing-google.jar to C:\Users\viral\AppData\Local\Temp\Corona Labs\CLtmpa00776\template\app\libs\licensing-google.jar
  185. 11:40:21.616      [unzip] extracting template/app/buildTools/AndroidManifest.template.xml
  186. 11:40:21.616      [unzip] expanding template/app/buildTools/AndroidManifest.template.xml to C:\Users\viral\AppData\Local\Temp\Corona Labs\CLtmpa00776\template\app\buildTools\AndroidManifest.template.xml
  187. 11:40:21.616      [unzip] extracting template/app/libs/
  188. 11:40:21.616      [unzip] expanding template/app/libs/ to C:\Users\viral\AppData\Local\Temp\Corona Labs\CLtmpa00776\template\app\libs
  189. 11:40:21.616      [unzip] extracting sdk/licenses/
  190. 11:40:21.616      [unzip] expanding sdk/licenses/ to C:\Users\viral\AppData\Local\Temp\Corona Labs\CLtmpa00776\sdk\licenses
  191. 11:40:21.616      [unzip] extracting template/setup.bat
  192. 11:40:21.616      [unzip] expanding template/setup.bat to C:\Users\viral\AppData\Local\Temp\Corona Labs\CLtmpa00776\template\setup.bat
  193. 11:40:21.616      [unzip] extracting template/app/src/main/AndroidManifest.xml
  194. 11:40:21.616      [unzip] expanding template/app/src/main/AndroidManifest.xml to C:\Users\viral\AppData\Local\Temp\Corona Labs\CLtmpa00776\template\app\src\main\AndroidManifest.xml
  195. 11:40:21.616      [unzip] expand complete
  196. 11:40:21.616  fileset: Setup scanner in dir C:\Program Files (x86)\Corona Labs\Corona\Native\Corona\android\lib\gradle with patternSet{ includes: [] excludes: [] }
  197. 11:40:21.616       [copy] Corona.aar added as Corona.aar doesn't exist.
  198. 11:40:21.616       [copy]  added as  is outdated.
  199. 11:40:21.616       [copy] Copying 1 file to C:\Users\viral\AppData\Local\Temp\Corona Labs\CLtmpa00776\template\app\libs
  200. 11:40:21.616       [copy] Copying C:\Program Files (x86)\Corona Labs\Corona\Native\Corona\android\lib\gradle\Corona.aar to C:\Users\viral\AppData\Local\Temp\Corona Labs\CLtmpa00776\template\app\libs\Corona.aar
  201. 11:40:21.616  
  202. 11:40:21.616  build-input-zip:
  203. 11:40:21.616  Setting project property: USER_ZIP -> C:\Users\viral\AppData\Local\Temp\Corona Labs\CLtmpa00776/input.zip
  204. 11:40:21.616  fileset: Setup scanner in dir C:\Users\viral\AppData\Local\Temp\Corona Labs\CLtmpa00776 with patternSet{ includes: [] excludes: [resource.car] }
  205. 11:40:21.616        [zip] Building zip: C:\Users\viral\AppData\Local\Temp\Corona Labs\CLtmpa00776\input.zip
  206. 11:40:21.616        [zip] adding directory sdk/
  207. 11:40:21.616        [zip] adding directory sdk/licenses/
  208. 11:40:21.616        [zip] adding directory template/
  209. 11:40:21.616        [zip] adding directory template/app/
  210. 11:40:21.616        [zip] adding directory template/app/buildTools/
  211. 11:40:21.616        [zip] adding directory template/app/libs/
  212. 11:40:21.616        [zip] adding directory template/app/src/
  213. 11:40:21.616        [zip] adding directory template/app/src/main/
  214. 11:40:21.616        [zip] adding directory template/app/src/main/res/
  215. 11:40:21.616        [zip] adding directory template/app/src/main/res/values/
  216. 11:40:21.616        [zip] adding directory template/gradle/
  217. 11:40:21.616        [zip] adding directory template/gradle/wrapper/
  218. 11:40:21.616        [zip] adding entry build.properties
  219. 11:40:21.616        [zip] adding entry config.lu
  220. 11:40:21.616        [zip] adding entry excludesfile.properties
  221. 11:40:21.616        [zip] adding entry main.lu
  222. 11:40:21.616        [zip] adding entry sdk/licenses/android-sdk-license
  223. 11:40:21.616        [zip] adding entry template/app/_corona_splash_screen.png
  224. 11:40:21.616        [zip] adding entry template/app/build.gradle.kts
  225. 11:40:21.616        [zip] adding entry template/app/buildTools/AndroidManifest.template.xml
  226. 11:40:21.616        [zip] adding entry template/app/buildTools/convert_metadata.lua
  227. 11:40:21.616        [zip] adding entry template/app/buildTools/strings.xml
  228. 11:40:21.627        [zip] adding entry template/app/buildTools/update_manifest.lua
  229. 11:40:21.627        [zip] adding entry template/app/libs/Corona.aar
  230. 11:40:21.627        [zip] adding entry template/app/libs/licensing-google.jar
  231. 11:40:21.627        [zip] adding entry template/app/proguard-rules.pro
  232. 11:40:21.627        [zip] adding entry template/app/src/main/AndroidManifest.xml
  233. 11:40:21.627        [zip] adding entry template/app/src/main/res/values/strings.xml
  234. 11:40:21.627        [zip] adding entry template/build.gradle.kts
  235. 11:40:21.627        [zip] adding entry template/gradle.properties
  236. 11:40:21.627        [zip] adding entry template/gradle/wrapper/gradle-wrapper.jar
  237. 11:40:21.627        [zip] adding entry template/gradle/wrapper/gradle-wrapper.properties
  238. 11:40:21.627        [zip] adding entry template/gradlew
  239. 11:40:21.627        [zip] adding entry template/gradlew.bat
  240. 11:40:21.627        [zip] adding entry template/settings.gradle.kts
  241. 11:40:21.627        [zip] adding entry template/setup.bat
  242. 11:40:21.627        [zip] adding entry template/setup.sh
  243. 11:40:21.627  
  244. 11:40:21.627  BUILD SUCCESSFUL
  245. 11:40:21.627  Total time: 1 second
  246. 11:40:21.627  DeviceBuildData: {"isLaunchPadActive":false,"targetCertType":"distribution","targetPlatformVersion":140300,"debugBuildProcess":5,"targetDevice":0,"dailyBuildRevision":3504,"buildBucket":"ansca-templates","clientPlatform":"Win","targetAppStore":"google","targetPlatform":1,"clientDeviceId":"811b516401191b3dc6485b358ec06e74","plugins":[],"dailyBuildYear":2019,"clientProductId":"basic","appName":"HelloWorld"}
  247. 11:40:21.627  Build: running: cd "C:\Users\viral\AppData\Local\Temp\Corona Labs\CLtmpa00776" && cd template && setup.bat && gradlew.bat buildCoronaApp --no-daemon -PconfigureCoronaPlugins=YES -PcoronaBuild=2019.3504 -PcoronaResourcesDir="C:\Program Files (x86)\Corona Labs\Corona\Resources" -PcoronaDstDir="C:\Users\viral\Desktop" -PcoronaTmpDir="C:\Users\viral\AppData\Local\Temp\Corona Labs\CLtmpa00776" -PcoronaSrcDir="C:\Program Files (x86)\Corona Labs\Corona\Sample Code\GettingStarted\HelloWorld" -PcoronaAppFileName="HelloWorld" -PcoronaAppPackage="com.gmail.vrgandhi98.HelloWorld" -PcoronaVersionCode=1 -PcoronaVersionName="1.0.0" -PcoronaKeystore="F:\MyGames\codenew\millionaireNewTheme\gkapps_gkapps123.keystore" -PcoronaKeystorePassword="XXXXXX" -PcoronaKeyAlias="gkapps" -PcoronaKeyAliasPassword="XXXXXX" -PcoronaBuildData="C:\Users\viral\AppData\Local\Temp\Corona Labs\CLtmpa00776\build.data" --console=plain
  248. 11:41:17.134  Picked up JAVA_TOOL_OPTIONS: -Duser.language=en
  249. 11:41:17.134  To honour the JVM settings for this build a new JVM will be forked. Please consider using the daemon: https://docs.gradle.org/5.1.1/userguide/gradle_daemon.html.
  250. 11:41:17.134  Exception in thread "DisconnectableInputStream source reader" org.gradle.api.UncheckedIOException: java.io.IOException: The handle is invalid
  251. 11:41:17.134    at org.gradle.internal.UncheckedException.throwAsUncheckedException(UncheckedException.java:61)
  252. 11:41:17.134    at org.gradle.internal.UncheckedException.throwAsUncheckedException(UncheckedException.java:41)
  253. 11:41:17.134    at org.gradle.util.DisconnectableInputStream$1.run(DisconnectableInputStream.java:125)
  254. 11:41:17.134    at java.base/java.lang.Thread.run(Thread.java:835)
  255. 11:41:17.134  Caused by: java.io.IOException: The handle is invalid
  256. 11:41:17.134    at java.base/java.io.FileInputStream.readBytes(Native Method)
  257. 11:41:17.134    at java.base/java.io.FileInputStream.read(FileInputStream.java:273)
  258. 11:41:17.134    at java.base/java.io.BufferedInputStream.fill(BufferedInputStream.java:252)
  259. 11:41:17.134    at java.base/java.io.BufferedInputStream.read1(BufferedInputStream.java:292)
  260. 11:41:17.134    at java.base/java.io.BufferedInputStream.read(BufferedInputStream.java:351)
  261. 11:41:17.134    at org.gradle.util.DisconnectableInputStream$1.run(DisconnectableInputStream.java:96)
  262. 11:41:17.134    ... 1 more
  263. 11:41:17.134  Daemon will be stopped at the end of the build stopping after processing
  264. 11:41:17.134  
  265. 11:41:17.134  > Configure project :App
  266. 11:41:17.134  Authorizing plugins
  267. 11:41:17.134  Downloading plugins
  268. 11:41:17.134  Fetching plugin dependencies
  269. 11:41:17.134  Collecting plugin assets
  270. 11:41:17.134  Collecting plugin resources
  271. 11:41:17.134  Collecting plugin metadata
  272. 11:41:17.134  Output written to (C:\Users\viral\AppData\Local\Temp\Corona Labs\CLtmpa00776\template\app\build/intermediates/plugins_metadata.json)
  273. 11:41:17.134  Creating AndroidManifest.xml
  274. 11:41:17.134  Opening:  C:\Users\viral\AppData\Local\Temp\Corona Labs\CLtmpa00776\template\app\build/intermediates/corona_manifest_gen/strings.xml
  275. 11:41:17.134  Opening:  C:\Users\viral\AppData\Local\Temp\Corona Labs\CLtmpa00776\template\app\build/intermediates/corona_manifest_gen/CopyToApk.txt
  276. 11:41:17.134  Collecting native libraries
  277. 11:41:17.134  Collecting legacy jar libraries
  278. 11:41:17.134  
  279. 11:41:17.134  > Task :App:cleanupIconsDirectory UP-TO-DATE
  280. 11:41:17.134  > Task :App:copyDefaultNotificationIcons NO-SOURCE
  281. 11:41:17.134  > Task :App:copyMainApplicationBanner NO-SOURCE
  282. 11:41:17.134  > Task :App:copyMainApplicationIcon NO-SOURCE
  283. 11:41:17.134  > Task :App:copyOuyaApplicationIcon NO-SOURCE
  284. 11:41:17.134  > Task :App:copySplashScreen
  285. 11:41:17.134  > Task :App:copyXiaomiApplicationIcon NO-SOURCE
  286. 11:41:17.134  > Task :App:copyCoronaIconFiles
  287. 11:41:17.134  > Task :App:copyAdaptiveIconResources
  288. 11:41:17.134  > Task :App:copyCoronaIcons
  289. 11:41:17.134  > Task :App:preBuild
  290. 11:41:17.134  > Task :App:preReleaseBuild
  291. 11:41:17.134  > Task :App:compileReleaseAidl NO-SOURCE
  292. 11:41:17.134  > Task :App:compileReleaseRenderscript NO-SOURCE
  293. 11:41:17.134  > Task :App:checkReleaseManifest
  294. 11:41:17.134  > Task :App:generateReleaseBuildConfig SKIPPED
  295. 11:41:17.134  > Task :App:prepareLintJar
  296. 11:41:17.134  > Task :App:generateReleaseSources
  297. 11:41:17.134  > Task :App:javaPreCompileRelease
  298. 11:41:17.134  > Task :App:mainApkListPersistenceRelease
  299. 11:41:17.134  > Task :App:generateReleaseResValues
  300. 11:41:17.134  > Task :App:generateReleaseResources
  301. 11:41:17.134  > Task :App:mergeReleaseResources
  302. 11:41:17.134  > Task :App:createReleaseCompatibleScreenManifests
  303. 11:41:17.134  > Task :App:processReleaseManifest
  304. 11:41:17.134  > Task :App:processReleaseResources
  305. 11:41:17.134  
  306. 11:41:17.134  > Task :App:compileReleaseJavaWithJavac
  307. 11:41:17.134  warning: [options] source value 7 is obsolete and will be removed in a future release
  308. 11:41:17.134  warning: [options] target value 7 is obsolete and will be removed in a future release
  309. 11:41:17.134  warning: [options] To suppress warnings about obsolete options, use -Xlint:-options.
  310. 11:41:17.134  3 warnings
  311. 11:41:17.134  
  312. 11:41:17.134  > Task :App:compileReleaseSources
  313. 11:41:17.134  > Task :App:lintVitalRelease
  314. 11:41:17.134  > Task :App:checkReleaseDuplicateClasses
  315. 11:41:17.134  > Task :App:transformClassesWithDexBuilderForRelease
  316. 11:41:17.134  > Task :App:transformClassesWithMultidexlistForRelease
  317. 11:41:17.134  > Task :App:mergeDexRelease
  318. 11:41:17.134  > Task :App:mergeReleaseShaders
  319. 11:41:17.134  > Task :App:compileReleaseShaders
  320. 11:41:17.134  > Task :App:generateReleaseAssets
  321. 11:41:17.134  > Task :App:compileLuaRelease FAILED
  322. 11:41:17.134  
  323. 11:41:17.134  Deprecated Gradle features were used in this build, making it incompatible with Gradle 6.0.
  324. 11:41:17.134  Use '--warning-mode all' to show the individual deprecation warnings.
  325. 11:41:17.134  See https://docs.gradle.org/5.1.1/userguide/command_line_interface.html#sec:command_line_warnings
  326. 11:41:17.134  22 actionable tasks: 21 executed, 1 up-to-date
  327. 11:41:17.134  
  328. 11:41:17.134  FAILURE: Build failed with an exception.
  329. 11:41:17.134  
  330. 11:41:17.134  * What went wrong:
  331. 11:41:17.134  Execution failed for task ':App:compileLuaRelease'.
  332. 11:41:17.134  > Process 'command 'C:/Program Files (x86)/Corona Labs/Corona/Native/Corona/win/bin/luac'' finished with non-zero exit value -1073741515
  333. 11:41:17.134  
  334. 11:41:17.134  * Try:
  335. 11:41:17.134  Run with --stacktrace option to get the stack trace. Run with --info or --debug option to get more log output. Run with --scan to get full insights.
  336. 11:41:17.134  
  337. 11:41:17.134  * Get more help at https://help.gradle.org
  338. 11:41:17.134  
  339. 11:41:17.134  BUILD FAILED in 55s
  340. 11:41:17.538  Android build failed (1) after 58 seconds
RAW Paste Data
We use cookies for various purposes including analytics. By continuing to use Pastebin, you agree to our use of cookies as described in the Cookies Policy. OK, I Understand
 
Top