Advertisement
Guest User

Untitled

a guest
Apr 17th, 2022
31
Never
Not a member of Pastebin yet? Sign Up, it unlocks many cool features!
text 4.11 KB | None
  1.  
  2. Executing Gradle task: build
  3. Build info: MCreator 2021.3.54000, forge-1.16.5, 64-bit, 8033 MB, Windows 10, JVM 16.0.2, JAVA_HOME: C:\Program Files\Pylo\MCreator\jdk
  4.  
  5. > Task :compileJava
  6. C:\Users\conno\Desktop\mod stuffs\mod stuffs\purpsaddons\src\main\java\net\mcreator\betterrecipes\entity\renderer\FroststaffRenderer.java:66: error: net.mcreator.betterrecipes.entity.renderer.FroststaffRenderer.Modelice_beam is not abstract and does not override abstract method setRotationAngles(net.minecraft.entity.Entity,float,float,float,float,float) in net.minecraft.client.renderer.entity.model.EntityModel
  7. public static class Modelice_beam extends EntityModel<Entity> {
  8. ^
  9. C:\Users\conno\Desktop\mod stuffs\mod stuffs\purpsaddons\src\main\java\net\mcreator\betterrecipes\entity\renderer\FroststaffRenderer.java:70: error: cannot find symbol
  10. texWidth = 32;
  11. ^
  12. symbol: variable texWidth
  13. location: class net.mcreator.betterrecipes.entity.renderer.FroststaffRenderer.Modelice_beam
  14. C:\Users\conno\Desktop\mod stuffs\mod stuffs\purpsaddons\src\main\java\net\mcreator\betterrecipes\entity\renderer\FroststaffRenderer.java:71: error: cannot find symbol
  15. texHeight = 32;
  16. ^
  17. symbol: variable texHeight
  18. location: class net.mcreator.betterrecipes.entity.renderer.FroststaffRenderer.Modelice_beam
  19. C:\Users\conno\Desktop\mod stuffs\mod stuffs\purpsaddons\src\main\java\net\mcreator\betterrecipes\entity\renderer\FroststaffRenderer.java:73: error: cannot find symbol
  20. bone.setPos(0.0F, 24.0F, 0.0F);
  21. ^
  22. symbol: method setPos(float,float,float)
  23. location: variable bone of type net.minecraft.client.renderer.model.ModelRenderer
  24. C:\Users\conno\Desktop\mod stuffs\mod stuffs\purpsaddons\src\main\java\net\mcreator\betterrecipes\entity\renderer\FroststaffRenderer.java:74: error: cannot find symbol
  25. bone.texOffs(2, 5).addBox(-9.0F, -7.0F, 3.0F, 2.0F, 2.0F, 10.0F, 0.0F, false);
  26. ^
  27. symbol: method texOffs(int,int)
  28. location: variable bone of type net.minecraft.client.renderer.model.ModelRenderer
  29. C:\Users\conno\Desktop\mod stuffs\mod stuffs\purpsaddons\src\main\java\net\mcreator\betterrecipes\entity\renderer\FroststaffRenderer.java:77: error: method does not override or implement a method from a supertype
  30. @Override
  31. ^
  32. C:\Users\conno\Desktop\mod stuffs\mod stuffs\purpsaddons\src\main\java\net\mcreator\betterrecipes\entity\renderer\FroststaffRenderer.java:82: error: method does not override or implement a method from a supertype
  33. @Override
  34. ^
  35. C:\Users\conno\Desktop\mod stuffs\mod stuffs\purpsaddons\src\main\java\net\mcreator\betterrecipes\entity\renderer\FroststaffRenderer.java:89: error: cannot find symbol
  36. modelRenderer.xRot = x;
  37. ^
  38. symbol: variable xRot
  39. location: variable modelRenderer of type net.minecraft.client.renderer.model.ModelRenderer
  40. C:\Users\conno\Desktop\mod stuffs\mod stuffs\purpsaddons\src\main\java\net\mcreator\betterrecipes\entity\renderer\FroststaffRenderer.java:90: error: cannot find symbol
  41. modelRenderer.yRot = y;
  42. ^
  43. symbol: variable yRot
  44. location: variable modelRenderer of type net.minecraft.client.renderer.model.ModelRenderer
  45. C:\Users\conno\Desktop\mod stuffs\mod stuffs\purpsaddons\src\main\java\net\mcreator\betterrecipes\entity\renderer\FroststaffRenderer.java:91: error: cannot find symbol
  46. modelRenderer.zRot = z;
  47. ^
  48. symbol: variable zRot
  49. location: variable modelRenderer of type net.minecraft.client.renderer.model.ModelRenderer
  50. 10 errors
  51. > Task :compileJava FAILED
  52. FAILURE: Build failed with an exception.
  53. * What went wrong:
  54. Execution failed for task ':compileJava'.
  55. > Compilation failed; see the compiler error output for details.
  56. * Try:
  57. Run with --stacktrace option to get the stack trace. Run with --info or --debug option to get more log output. Run with --scan to get full insights.
  58. * Get more help at https://help.gradle.org
  59. BUILD FAILED in 4s
  60. 1 actionable task: 1 executed
  61.  
  62. BUILD FAILED
  63. Task completed in 7 seconds
Advertisement
RAW Paste Data Copied
Advertisement