daily pastebin goal
49%
SHARE
TWEET

Untitled

a guest Dec 30th, 2010 800 Never
Not a member of Pastebin yet? Sign Up, it unlocks many cool features!
  1. [  3%] Building CXX object cmake-bitcoinr/CMakeFiles/bitcoinr.dir/__/src/remoteminermain.cpp.o
  2. In file included from /home/uncaer9/bitcoin-remote-rpc-20101229-src/src/minercommon/minerheaders.h:46:0,                                                                                                                                                  
  3.                  from /home/uncaer9/bitcoin-remote-rpc-20101229-src/src/remoteminermain.cpp:19:
  4. /home/uncaer9/bitcoin-remote-rpc-20101229-src/src/minercommon/../serialize.h: In function ‘void Unserialize_impl(Stream&, std::vector<T, A>&, int, int, const boost::true_type&)’:
  5. /home/uncaer9/bitcoin-remote-rpc-20101229-src/src/minercommon/../serialize.h:475:82: error: there are no arguments to ‘min’ that depend on a template parameter, so a declaration of ‘min’ must be available
  6. /home/uncaer9/bitcoin-remote-rpc-20101229-src/src/minercommon/../serialize.h:475:82: note: (if you use ‘-fpermissive’, G++ will accept your code, but allowing the use of an undeclared name is deprecated)
  7. /home/uncaer9/bitcoin-remote-rpc-20101229-src/src/minercommon/../serialize.h: In function ‘void Unserialize(Stream&, std::map<K, T, Pred, A>&, int, int)’:
  8. /home/uncaer9/bitcoin-remote-rpc-20101229-src/src/minercommon/../serialize.h:588:9: error: ‘pair’ was not declared in this scope
  9. /home/uncaer9/bitcoin-remote-rpc-20101229-src/src/minercommon/../serialize.h:588:15: error: expected primary-expression before ‘,’ token
  10. /home/uncaer9/bitcoin-remote-rpc-20101229-src/src/minercommon/../serialize.h:588:18: error: expected primary-expression before ‘>’ token
  11. /home/uncaer9/bitcoin-remote-rpc-20101229-src/src/minercommon/../serialize.h:588:20: error: ‘item’ was not declared in this scope
  12. /home/uncaer9/bitcoin-remote-rpc-20101229-src/src/minercommon/../serialize.h: In member function ‘void secure_allocator<T>::deallocate(T*, size_t)’:
  13. /home/uncaer9/bitcoin-remote-rpc-20101229-src/src/minercommon/../serialize.h:700:9: error: ‘allocator’ was not declared in this scope
  14. /home/uncaer9/bitcoin-remote-rpc-20101229-src/src/minercommon/../serialize.h:700:20: error: expected primary-expression before ‘>’ token
  15. /home/uncaer9/bitcoin-remote-rpc-20101229-src/src/minercommon/../serialize.h:700:21: error: ‘::deallocate’ has not been declared
  16. /home/uncaer9/bitcoin-remote-rpc-20101229-src/src/minercommon/../serialize.h: In member function ‘void CAutoFile::fclose()’:
  17. /home/uncaer9/bitcoin-remote-rpc-20101229-src/src/minercommon/../serialize.h:1104:37: error: ‘stdin’ was not declared in this scope
  18. /home/uncaer9/bitcoin-remote-rpc-20101229-src/src/minercommon/../serialize.h:1104:54: error: ‘stdout’ was not declared in this scope
  19. /home/uncaer9/bitcoin-remote-rpc-20101229-src/src/minercommon/../serialize.h:1104:72: error: ‘stderr’ was not declared in this scope
  20. /home/uncaer9/bitcoin-remote-rpc-20101229-src/src/minercommon/../serialize.h:1105:13: error: ‘::fclose’ has not been declared
  21. /home/uncaer9/bitcoin-remote-rpc-20101229-src/src/minercommon/../serialize.h: In member function ‘CAutoFile& CAutoFile::read(char*, int)’:
  22. /home/uncaer9/bitcoin-remote-rpc-20101229-src/src/minercommon/../serialize.h:1145:38: error: ‘fread’ was not declared in this scope
  23. /home/uncaer9/bitcoin-remote-rpc-20101229-src/src/minercommon/../serialize.h:1146:41: error: ‘feof’ was not declared in this scope
  24. /home/uncaer9/bitcoin-remote-rpc-20101229-src/src/minercommon/../serialize.h: In member function ‘CAutoFile& CAutoFile::write(const char*, int)’:
  25. /home/uncaer9/bitcoin-remote-rpc-20101229-src/src/minercommon/../serialize.h:1154:39: error: ‘fwrite’ was not declared in this scope
  26. In file included from /home/uncaer9/bitcoin-remote-rpc-20101229-src/src/minercommon/minerheaders.h:47:0,
  27.                  from /home/uncaer9/bitcoin-remote-rpc-20101229-src/src/remoteminermain.cpp:19:
  28. /home/uncaer9/bitcoin-remote-rpc-20101229-src/src/minercommon/../uint256.h: In function ‘int Testuint256AdHoc(std::vector<std::basic_string<char> >)’:
  29. /home/uncaer9/bitcoin-remote-rpc-20101229-src/src/minercommon/../uint256.h:638:40: error: ‘printf’ was not declared in this scope
  30. In file included from /home/uncaer9/bitcoin-remote-rpc-20101229-src/src/minercommon/minerheaders.h:48:0,
  31.                  from /home/uncaer9/bitcoin-remote-rpc-20101229-src/src/remoteminermain.cpp:19:
  32. /home/uncaer9/bitcoin-remote-rpc-20101229-src/src/minercommon/../util.h: At global scope:
  33. /home/uncaer9/bitcoin-remote-rpc-20101229-src/src/minercommon/../util.h:214:5: error: ‘interprocess’ in namespace ‘boost’ does not name a type
  34. /home/uncaer9/bitcoin-remote-rpc-20101229-src/src/minercommon/../util.h: In member function ‘void CCriticalSection::Enter()’:
  35. /home/uncaer9/bitcoin-remote-rpc-20101229-src/src/minercommon/../util.h:218:20: error: ‘mutex’ was not declared in this scope
  36. /home/uncaer9/bitcoin-remote-rpc-20101229-src/src/minercommon/../util.h: In member function ‘void CCriticalSection::Leave()’:
  37. /home/uncaer9/bitcoin-remote-rpc-20101229-src/src/minercommon/../util.h:219:20: error: ‘mutex’ was not declared in this scope
  38. /home/uncaer9/bitcoin-remote-rpc-20101229-src/src/minercommon/../util.h: In member function ‘bool CCriticalSection::TryEnter()’:
  39. /home/uncaer9/bitcoin-remote-rpc-20101229-src/src/minercommon/../util.h:220:30: error: ‘mutex’ was not declared in this scope
  40. /home/uncaer9/bitcoin-remote-rpc-20101229-src/src/minercommon/../util.h: In function ‘void SetThreadPriority(int)’:
  41. /home/uncaer9/bitcoin-remote-rpc-20101229-src/src/minercommon/../util.h:614:17: error: ‘PRIO_PROCESS’ was not declared in this scope
  42. /home/uncaer9/bitcoin-remote-rpc-20101229-src/src/minercommon/../util.h:614:43: error: ‘setpriority’ was not declared in this scope
  43. In file included from /usr/include/openssl/bn.h:130:0,
  44.                  from /home/uncaer9/bitcoin-remote-rpc-20101229-src/src/minercommon/../bignum.h:11,
  45.                  from /home/uncaer9/bitcoin-remote-rpc-20101229-src/src/minercommon/minerheaders.h:49,
  46.                  from /home/uncaer9/bitcoin-remote-rpc-20101229-src/src/remoteminermain.cpp:19:
  47. /home/uncaer9/bitcoin-remote-rpc-20101229-src/src/minercommon/../util.h: At global scope:
  48. /home/uncaer9/bitcoin-remote-rpc-20101229-src/src/minercommon/../util.h:155:5: error: previous declaration of ‘int OutputDebugStringF(const char*, ...)’ with ‘C++’ linkage
  49. /usr/include/stdio.h:359:58: error: conflicts with new declaration with ‘C’ linkage
  50. /home/uncaer9/bitcoin-remote-rpc-20101229-src/src/minercommon/../util.h:156:5: error: previous declaration of ‘int my_snprintf(char*, size_t, const char*, ...)’ with ‘C++’ linkage
  51. /usr/include/stdio.h:385:60: error: conflicts with new declaration with ‘C’ linkage
  52. /usr/include/stdio.h:385:60: error: declaration of ‘int my_snprintf(char*, size_t, const char*, ...) throw ()’ throws different exceptions
  53. /home/uncaer9/bitcoin-remote-rpc-20101229-src/src/minercommon/../util.h:156:5: error: from previous declaration ‘int my_snprintf(char*, size_t, const char*, ...)’
  54. In file included from /home/uncaer9/bitcoin-remote-rpc-20101229-src/src/minercommon/minerheaders.h:49:0,
  55.                  from /home/uncaer9/bitcoin-remote-rpc-20101229-src/src/remoteminermain.cpp:19:
  56. /home/uncaer9/bitcoin-remote-rpc-20101229-src/src/minercommon/../bignum.h: In member function ‘void CBigNum::Unserialize(Stream&, int, int)’:
  57. /home/uncaer9/bitcoin-remote-rpc-20101229-src/src/minercommon/../bignum.h:355:9: error: ‘vector’ was not declared in this scope
  58. /home/uncaer9/bitcoin-remote-rpc-20101229-src/src/minercommon/../bignum.h:355:16: error: expected primary-expression before ‘unsigned’
  59. /home/uncaer9/bitcoin-remote-rpc-20101229-src/src/minercommon/../bignum.h:355:16: error: expected ‘;’ before ‘unsigned’
  60. /home/uncaer9/bitcoin-remote-rpc-20101229-src/src/minercommon/../bignum.h:356:26: error: ‘vch’ was not declared in this scope
  61. make[2]: *** [cmake-bitcoinr/CMakeFiles/bitcoinr.dir/__/src/remoteminermain.cpp.o] Błąd 1
  62. make[1]: *** [cmake-bitcoinr/CMakeFiles/bitcoinr.dir/all] Błąd 2
  63. make: *** [all] Błąd 2
RAW Paste Data
We use cookies for various purposes including analytics. By continuing to use Pastebin, you agree to our use of cookies as described in the Cookies Policy. OK, I Understand
 
Top