Guest User

Qt 6.1 not working

a guest
Aug 23rd, 2021
156
0
Never
Not a member of Pastebin yet? Sign Up, it unlocks many cool features!
text 106.29 KB | None | 0 0
  1. cd 'C:\Users\Patron\Desktop\Code Projects\Sistema_Silo'
  2. C:\MinGW\msys\1.0\bin\make.exe -f Makefile CONF=Debug clean QMAKE=/C/Qt14/6.1.2/mingw81_64/bin/qmake.exe
  3. "/C/MinGW/msys/1.0/bin/make.exe" -f nbproject/Makefile-Debug.mk QMAKE=/C/Qt14/6.1.2/mingw81_64/bin/qmake.exe SUBPROJECTS= .clean-conf
  4. make.exe[1]: Entering directory `/c/Users/Patron/Desktop/Code Projects/Sistema_Silo'
  5. /C/Qt14/6.1.2/mingw81_64/bin/qmake.exe VPATH=. -spec win32-g++ -o qttmp-Debug.mk nbproject/qt-Debug.pro
  6. mv -f qttmp-Debug.mk nbproject/qt-Debug.mk
  7. /C/MinGW/msys/1.0/bin/make.exe -f nbproject/qt-Debug.mk distclean
  8. make.exe[2]: Entering directory `/c/Users/Patron/Desktop/Code Projects/Sistema_Silo'
  9. rm -f qrc_darkstyle.cpp qrc_framelesswindow.cpp qrc_LogoSplashScreen.cpp
  10. rm -f moc_predefs.h
  11. rm -f moc_DarkStyle.cpp moc_framelesswindow.cpp moc_windowdragger.cpp moc_Launcher.cpp moc_Login.cpp moc_Silo_SaS.cpp
  12. rm -f ui_framelesswindow.h ui_Launcher.h "ui_Login V0.2.h" "ui_Pantalla_Principal V2.6.h"
  13. rm -f build/Debug/MinGW64__Qt_6.1.2-Windows/DarkStyle.o build/Debug/MinGW64__Qt_6.1.2-Windows/framelesswindow.o build/Debug/MinGW64__Qt_6.1.2-Windows/windowdragger.o build/Debug/MinGW64__Qt_6.1.2-Windows/Impresora.o build/Debug/MinGW64__Qt_6.1.2-Windows/Launcher.o build/Debug/MinGW64__Qt_6.1.2-Windows/Login.o build/Debug/MinGW64__Qt_6.1.2-Windows/Serial.o build/Debug/MinGW64__Qt_6.1.2-Windows/Silo_SaS.o build/Debug/MinGW64__Qt_6.1.2-Windows/Web_handler.o build/Debug/MinGW64__Qt_6.1.2-Windows/main_Pantalla_Principal.o build/Debug/MinGW64__Qt_6.1.2-Windows/qrc_darkstyle.o build/Debug/MinGW64__Qt_6.1.2-Windows/qrc_framelesswindow.o build/Debug/MinGW64__Qt_6.1.2-Windows/qrc_LogoSplashScreen.o build/Debug/MinGW64__Qt_6.1.2-Windows/moc_DarkStyle.o build/Debug/MinGW64__Qt_6.1.2-Windows/moc_framelesswindow.o build/Debug/MinGW64__Qt_6.1.2-Windows/moc_windowdragger.o build/Debug/MinGW64__Qt_6.1.2-Windows/moc_Launcher.o build/Debug/MinGW64__Qt_6.1.2-Windows/moc_Login.o build/Debug/MinGW64__Qt_6.1.2-Windows/moc_Silo_SaS.o
  14. rm -f build/Debug/MinGW64__Qt_6.1.2-Windows/Sistema_Silo_MinGW64__Qt_6.1.2-Windows_V1.1_resource_res.o
  15. rm -f .qmake.stash
  16. rm -f dist/Debug/MinGW64__Qt_6.1.2-Windows/Sistema_Silo_MinGW64__Qt_6.1.2-Windows_V1.1.exe
  17. rm -f qttmp-Debug.mk
  18. make.exe[2]: Leaving directory `/c/Users/Patron/Desktop/Code Projects/Sistema_Silo'
  19. make.exe[1]: Leaving directory `/c/Users/Patron/Desktop/Code Projects/Sistema_Silo'
  20.  
  21. CLEAN SUCCESSFUL (total time: 10s)
  22. cd 'C:\Users\Patron\Desktop\Code Projects\Sistema_Silo'
  23. C:\MinGW\msys\1.0\bin\make.exe -f Makefile CONF=Debug QMAKE=/C/Qt14/6.1.2/mingw81_64/bin/qmake.exe
  24. "/C/MinGW/msys/1.0/bin/make.exe" -f nbproject/Makefile-Debug.mk QMAKE=/C/Qt14/6.1.2/mingw81_64/bin/qmake.exe SUBPROJECTS= .build-conf
  25. make.exe[1]: Entering directory `/c/Users/Patron/Desktop/Code Projects/Sistema_Silo'
  26. /C/Qt14/6.1.2/mingw81_64/bin/qmake.exe VPATH=. -spec win32-g++ -o qttmp-Debug.mk nbproject/qt-Debug.pro
  27. Info: creating stash file C:\Users\Patron\Desktop\Code Projects\Sistema_Silo\.qmake.stash
  28. WARNING: Failure to find: ui_Launcher.h
  29. WARNING: Failure to find: ui_Login V0.2.h
  30. WARNING: Failure to find: ui_framelesswindow.h
  31. mv -f qttmp-Debug.mk nbproject/qt-Debug.mk
  32. "/C/MinGW/msys/1.0/bin/make.exe" -f nbproject/qt-Debug.mk dist/Debug/MinGW64__Qt_6.1.2-Windows/Sistema_Silo_MinGW64__Qt_6.1.2-Windows_V1.1.exe
  33. make.exe[2]: Entering directory `/c/Users/Patron/Desktop/Code Projects/Sistema_Silo'
  34. 'C:\Qt14\6.1.2\mingw81_64\bin\uic.exe' ../Qt-Frameless-Window-DarkStyle/framelesswindow/framelesswindow.ui -o ui_framelesswindow.h
  35. 'C:\Qt14\6.1.2\mingw81_64\bin\uic.exe' Launcher.ui -o ui_Launcher.h
  36. 'C:\Qt14\6.1.2\mingw81_64\bin\uic.exe' "Login V0.2.ui" -o "ui_Login V0.2.h"
  37. 'C:\Qt14\6.1.2\mingw81_64\bin\uic.exe' "Pantalla_Principal V2.6.ui" -o "ui_Pantalla_Principal V2.6.h"
  38. g++ -c -fno-keep-inline-dllexport -g -std=gnu++1z -Wall -Wextra -Wextra -fexceptions -mthreads -DUNICODE -D_UNICODE -DWIN32 -DMINGW_HAS_SECURE_API=1 -DQT_PRINTSUPPORT_LIB -DQT_WIDGETS_LIB -DQT_GUI_LIB -DQT_SQL_LIB -DQT_CORE_LIB -DQT_NEEDS_QMAIN -Inbproject -I. -I../Qt-Frameless-Window-DarkStyle/framelesswindow -I../Qt-Frameless-Window-DarkStyle -I../../../../../Qt/Qt5.11.3/5.11.3/mingw53_32/include -I../curl-7.78.0-win64-mingw/include -I../openssl-1.1.1k-win64-mingw/include -IC:/Qt14/6.1.2/mingw81_64/include -IC:/Qt14/6.1.2/mingw81_64/include/QtPrintSupport -IC:/Qt14/6.1.2/mingw81_64/include/QtWidgets -IC:/Qt14/6.1.2/mingw81_64/include/QtGui -IC:/Qt14/6.1.2/mingw81_64/include/QtSql -IC:/Qt14/6.1.2/mingw81_64/include/QtCore -I. -I. -IC:/VulkanSDK/1.0.51.0/Include -IC:/Qt14/6.1.2/mingw81_64/mkspecs/win32-g++ -o build/Debug/MinGW64__Qt_6.1.2-Windows/DarkStyle.o ../Qt-Frameless-Window-DarkStyle/DarkStyle.cpp
  39. In file included from C:/Qt/Qt5.11.3/5.11.3/mingw53_32/include/QtGui/qtguiglobal.h:43,
  40. from C:/Qt/Qt5.11.3/5.11.3/mingw53_32/include/QtWidgets/qtwidgetsglobal.h:43,
  41. from C:/Qt14/6.1.2/mingw81_64/include/QtWidgets/qapplication.h:43,
  42. from C:/Qt14/6.1.2/mingw81_64/include/QtWidgets/QApplication:1,
  43. from ../Qt-Frameless-Window-DarkStyle/DarkStyle.h:19,
  44. from ../Qt-Frameless-Window-DarkStyle/DarkStyle.cpp:14:
  45. C:/Qt/Qt5.11.3/5.11.3/mingw53_32/include/QtCore/qglobal.h:86:30: error: division by zero in #if
  46. #define QT_CONFIG(feature) (1/QT_FEATURE_##feature == 1)
  47. ^
  48. C:/Qt14/6.1.2/mingw81_64/include/QtCore/qfile.h:48:5: note: in expansion of macro 'QT_CONFIG'
  49. #if QT_CONFIG(cxx17_filesystem)
  50. ^~~~~~~~~
  51. C:/Qt/Qt5.11.3/5.11.3/mingw53_32/include/QtCore/qglobal.h:86:30: error: division by zero in #if
  52. #define QT_CONFIG(feature) (1/QT_FEATURE_##feature == 1)
  53. ^
  54. C:/Qt14/6.1.2/mingw81_64/include/QtCore/qfile.h:65:5: note: in expansion of macro 'QT_CONFIG'
  55. #if QT_CONFIG(cxx17_filesystem)
  56. ^~~~~~~~~
  57. C:/Qt/Qt5.11.3/5.11.3/mingw53_32/include/QtCore/qglobal.h:86:30: error: division by zero in #if
  58. #define QT_CONFIG(feature) (1/QT_FEATURE_##feature == 1)
  59. ^
  60. C:/Qt14/6.1.2/mingw81_64/include/QtCore/qfile.h:105:7: note: in expansion of macro 'QT_CONFIG'
  61. #elif QT_CONFIG(cxx17_filesystem)
  62. ^~~~~~~~~
  63. C:/Qt/Qt5.11.3/5.11.3/mingw53_32/include/QtCore/qglobal.h:86:30: error: division by zero in #if
  64. #define QT_CONFIG(feature) (1/QT_FEATURE_##feature == 1)
  65. ^
  66. C:/Qt14/6.1.2/mingw81_64/include/QtCore/qfile.h:118:7: note: in expansion of macro 'QT_CONFIG'
  67. #elif QT_CONFIG(cxx17_filesystem)
  68. ^~~~~~~~~
  69. C:/Qt/Qt5.11.3/5.11.3/mingw53_32/include/QtCore/qglobal.h:86:30: error: division by zero in #if
  70. #define QT_CONFIG(feature) (1/QT_FEATURE_##feature == 1)
  71. ^
  72. C:/Qt14/6.1.2/mingw81_64/include/QtCore/qfile.h:128:5: note: in expansion of macro 'QT_CONFIG'
  73. #if QT_CONFIG(cxx17_filesystem) || defined(Q_CLANG_QDOC)
  74. ^~~~~~~~~
  75. C:/Qt/Qt5.11.3/5.11.3/mingw53_32/include/QtCore/qglobal.h:86:30: error: division by zero in #if
  76. #define QT_CONFIG(feature) (1/QT_FEATURE_##feature == 1)
  77. ^
  78. C:/Qt14/6.1.2/mingw81_64/include/QtCore/qfile.h:135:7: note: in expansion of macro 'QT_CONFIG'
  79. #elif QT_CONFIG(cxx17_filesystem)
  80. ^~~~~~~~~
  81. C:/Qt/Qt5.11.3/5.11.3/mingw53_32/include/QtCore/qglobal.h:86:30: error: division by zero in #if
  82. #define QT_CONFIG(feature) (1/QT_FEATURE_##feature == 1)
  83. ^
  84. C:/Qt14/6.1.2/mingw81_64/include/QtCore/qfile.h:188:7: note: in expansion of macro 'QT_CONFIG'
  85. #elif QT_CONFIG(cxx17_filesystem)
  86. ^~~~~~~~~
  87. C:/Qt/Qt5.11.3/5.11.3/mingw53_32/include/QtCore/qglobal.h:86:30: error: division by zero in #if
  88. #define QT_CONFIG(feature) (1/QT_FEATURE_##feature == 1)
  89. ^
  90. C:/Qt14/6.1.2/mingw81_64/include/QtCore/qfile.h:200:7: note: in expansion of macro 'QT_CONFIG'
  91. #elif QT_CONFIG(cxx17_filesystem)
  92. ^~~~~~~~~
  93. C:/Qt/Qt5.11.3/5.11.3/mingw53_32/include/QtCore/qglobal.h:86:30: error: division by zero in #if
  94. #define QT_CONFIG(feature) (1/QT_FEATURE_##feature == 1)
  95. ^
  96. C:/Qt14/6.1.2/mingw81_64/include/QtCore/qfile.h:212:7: note: in expansion of macro 'QT_CONFIG'
  97. #elif QT_CONFIG(cxx17_filesystem)
  98. ^~~~~~~~~
  99. C:/Qt/Qt5.11.3/5.11.3/mingw53_32/include/QtCore/qglobal.h:86:30: error: division by zero in #if
  100. #define QT_CONFIG(feature) (1/QT_FEATURE_##feature == 1)
  101. ^
  102. C:/Qt14/6.1.2/mingw81_64/include/QtCore/qfile.h:237:7: note: in expansion of macro 'QT_CONFIG'
  103. #elif QT_CONFIG(cxx17_filesystem)
  104. ^~~~~~~~~
  105. In file included from ../Qt-Frameless-Window-DarkStyle/DarkStyle.cpp:14:
  106. ../Qt-Frameless-Window-DarkStyle/DarkStyle.h:18:32: warning: unknown option after '#pragma GCC diagnostic' kind [-Wpragmas]
  107. #pragma GCC diagnostic ignored "-Wdeprecated-copy"
  108. ^~~~~~~~~~~~~~~~~~~
  109. In file included from C:/Qt14/6.1.2/mingw81_64/include/QtWidgets/QApplication:1,
  110. from ../Qt-Frameless-Window-DarkStyle/DarkStyle.h:19,
  111. from ../Qt-Frameless-Window-DarkStyle/DarkStyle.cpp:14:
  112. C:/Qt14/6.1.2/mingw81_64/include/QtWidgets/qapplication.h:105:33: error: expected identifier before string constant
  113. QT_DEPRECATED_VERSION_X_6_0("Use the QFontMetricsF constructor instead.")
  114. ^~~~~~~~~~~~~~~~~~~~~~~~~~~~~~~~~~~~~~~~~~~~
  115. C:/Qt14/6.1.2/mingw81_64/include/QtWidgets/qapplication.h:105:33: error: expected ',' or '...' before string constant
  116. C:/Qt14/6.1.2/mingw81_64/include/QtWidgets/qapplication.h:105:77: error: expected ';' at end of member declaration
  117. QT_DEPRECATED_VERSION_X_6_0("Use the QFontMetricsF constructor instead.")
  118. ^
  119. ;
  120. In file included from c:/Qt14/Tools/mingw810_64/lib/gcc/x86_64-w64-mingw32/8.1.0/include/c++/filesystem:37,
  121. from C:/Qt14/6.1.2/mingw81_64/include/QtCore/qfile.h:49,
  122. from C:/Qt14/6.1.2/mingw81_64/include/QtCore/QFile:1,
  123. from ../Qt-Frameless-Window-DarkStyle/DarkStyle.h:20,
  124. from ../Qt-Frameless-Window-DarkStyle/DarkStyle.cpp:14:
  125. c:/Qt14/Tools/mingw810_64/lib/gcc/x86_64-w64-mingw32/8.1.0/include/c++/bits/fs_path.h: In member function 'std::filesystem::__cxx11::path& std::filesystem::__cxx11::path::operator/=(const std::filesystem::__cxx11::path&)':
  126. c:/Qt14/Tools/mingw810_64/lib/gcc/x86_64-w64-mingw32/8.1.0/include/c++/bits/fs_path.h:237:47: error: no match for 'operator!=' (operand types are 'std::filesystem::__cxx11::path' and 'std::filesystem::__cxx11::path')
  127. || (__p.has_root_name() && __p.root_name() != root_name()))
  128. ~~~~~~~~~~~~~~~~^~~~~~~~~~~~~~
  129. In file included from c:/Qt14/Tools/mingw810_64/lib/gcc/x86_64-w64-mingw32/8.1.0/include/c++/utility:70,
  130. from C:/Qt/Qt5.11.3/5.11.3/mingw53_32/include/QtCore/qglobal.h:47,
  131. from C:/Qt/Qt5.11.3/5.11.3/mingw53_32/include/QtGui/qtguiglobal.h:43,
  132. from C:/Qt/Qt5.11.3/5.11.3/mingw53_32/include/QtWidgets/qtwidgetsglobal.h:43,
  133. from C:/Qt14/6.1.2/mingw81_64/include/QtWidgets/qapplication.h:43,
  134. from C:/Qt14/6.1.2/mingw81_64/include/QtWidgets/QApplication:1,
  135. from ../Qt-Frameless-Window-DarkStyle/DarkStyle.h:19,
  136. from ../Qt-Frameless-Window-DarkStyle/DarkStyle.cpp:14:
  137. c:/Qt14/Tools/mingw810_64/lib/gcc/x86_64-w64-mingw32/8.1.0/include/c++/bits/stl_pair.h:456:5: note: candidate: 'template<class _T1, class _T2> constexpr bool std::operator!=(const std::pair<_T1, _T2>&, const std::pair<_T1, _T2>&)'
  138. operator!=(const pair<_T1, _T2>& __x, const pair<_T1, _T2>& __y)
  139. ^~~~~~~~
  140. c:/Qt14/Tools/mingw810_64/lib/gcc/x86_64-w64-mingw32/8.1.0/include/c++/bits/stl_pair.h:456:5: note: template argument deduction/substitution failed:
  141. In file included from c:/Qt14/Tools/mingw810_64/lib/gcc/x86_64-w64-mingw32/8.1.0/include/c++/filesystem:37,
  142. from C:/Qt14/6.1.2/mingw81_64/include/QtCore/qfile.h:49,
  143. from C:/Qt14/6.1.2/mingw81_64/include/QtCore/QFile:1,
  144. from ../Qt-Frameless-Window-DarkStyle/DarkStyle.h:20,
  145. from ../Qt-Frameless-Window-DarkStyle/DarkStyle.cpp:14:
  146. c:/Qt14/Tools/mingw810_64/lib/gcc/x86_64-w64-mingw32/8.1.0/include/c++/bits/fs_path.h:237:60: note: 'std::filesystem::__cxx11::path' is not derived from 'const std::pair<_T1, _T2>'
  147. || (__p.has_root_name() && __p.root_name() != root_name()))
  148. ^
  149. In file included from c:/Qt14/Tools/mingw810_64/lib/gcc/x86_64-w64-mingw32/8.1.0/include/c++/bits/stl_algobase.h:67,
  150. from c:/Qt14/Tools/mingw810_64/lib/gcc/x86_64-w64-mingw32/8.1.0/include/c++/algorithm:61,
  151. from C:/Qt/Qt5.11.3/5.11.3/mingw53_32/include/QtCore/qglobal.h:142,
  152. from C:/Qt/Qt5.11.3/5.11.3/mingw53_32/include/QtGui/qtguiglobal.h:43,
  153. from C:/Qt/Qt5.11.3/5.11.3/mingw53_32/include/QtWidgets/qtwidgetsglobal.h:43,
  154. from C:/Qt14/6.1.2/mingw81_64/include/QtWidgets/qapplication.h:43,
  155. from C:/Qt14/6.1.2/mingw81_64/include/QtWidgets/QApplication:1,
  156. from ../Qt-Frameless-Window-DarkStyle/DarkStyle.h:19,
  157. from ../Qt-Frameless-Window-DarkStyle/DarkStyle.cpp:14:
  158. c:/Qt14/Tools/mingw810_64/lib/gcc/x86_64-w64-mingw32/8.1.0/include/c++/bits/stl_iterator.h:311:5: note: candidate: 'template<class _Iterator> constexpr bool std::operator!=(const std::reverse_iterator<_Iterator>&, const std::reverse_iterator<_Iterator>&)'
  159. operator!=(const reverse_iterator<_Iterator>& __x,
  160. ^~~~~~~~
  161. c:/Qt14/Tools/mingw810_64/lib/gcc/x86_64-w64-mingw32/8.1.0/include/c++/bits/stl_iterator.h:311:5: note: template argument deduction/substitution failed:
  162. In file included from c:/Qt14/Tools/mingw810_64/lib/gcc/x86_64-w64-mingw32/8.1.0/include/c++/filesystem:37,
  163. from C:/Qt14/6.1.2/mingw81_64/include/QtCore/qfile.h:49,
  164. from C:/Qt14/6.1.2/mingw81_64/include/QtCore/QFile:1,
  165. from ../Qt-Frameless-Window-DarkStyle/DarkStyle.h:20,
  166. from ../Qt-Frameless-Window-DarkStyle/DarkStyle.cpp:14:
  167. c:/Qt14/Tools/mingw810_64/lib/gcc/x86_64-w64-mingw32/8.1.0/include/c++/bits/fs_path.h:237:60: note: 'std::filesystem::__cxx11::path' is not derived from 'const std::reverse_iterator<_Iterator>'
  168. || (__p.has_root_name() && __p.root_name() != root_name()))
  169. ^
  170. In file included from c:/Qt14/Tools/mingw810_64/lib/gcc/x86_64-w64-mingw32/8.1.0/include/c++/bits/stl_algobase.h:67,
  171. from c:/Qt14/Tools/mingw810_64/lib/gcc/x86_64-w64-mingw32/8.1.0/include/c++/algorithm:61,
  172. from C:/Qt/Qt5.11.3/5.11.3/mingw53_32/include/QtCore/qglobal.h:142,
  173. from C:/Qt/Qt5.11.3/5.11.3/mingw53_32/include/QtGui/qtguiglobal.h:43,
  174. from C:/Qt/Qt5.11.3/5.11.3/mingw53_32/include/QtWidgets/qtwidgetsglobal.h:43,
  175. from C:/Qt14/6.1.2/mingw81_64/include/QtWidgets/qapplication.h:43,
  176. from C:/Qt14/6.1.2/mingw81_64/include/QtWidgets/QApplication:1,
  177. from ../Qt-Frameless-Window-DarkStyle/DarkStyle.h:19,
  178. from ../Qt-Frameless-Window-DarkStyle/DarkStyle.cpp:14:
  179. c:/Qt14/Tools/mingw810_64/lib/gcc/x86_64-w64-mingw32/8.1.0/include/c++/bits/stl_iterator.h:349:5: note: candidate: 'template<class _IteratorL, class _IteratorR> constexpr bool std::operator!=(const std::reverse_iterator<_Iterator>&, const std::reverse_iterator<_IteratorR>&)'
  180. operator!=(const reverse_iterator<_IteratorL>& __x,
  181. ^~~~~~~~
  182. c:/Qt14/Tools/mingw810_64/lib/gcc/x86_64-w64-mingw32/8.1.0/include/c++/bits/stl_iterator.h:349:5: note: template argument deduction/substitution failed:
  183. In file included from c:/Qt14/Tools/mingw810_64/lib/gcc/x86_64-w64-mingw32/8.1.0/include/c++/filesystem:37,
  184. from C:/Qt14/6.1.2/mingw81_64/include/QtCore/qfile.h:49,
  185. from C:/Qt14/6.1.2/mingw81_64/include/QtCore/QFile:1,
  186. from ../Qt-Frameless-Window-DarkStyle/DarkStyle.h:20,
  187. from ../Qt-Frameless-Window-DarkStyle/DarkStyle.cpp:14:
  188. c:/Qt14/Tools/mingw810_64/lib/gcc/x86_64-w64-mingw32/8.1.0/include/c++/bits/fs_path.h:237:60: note: 'std::filesystem::__cxx11::path' is not derived from 'const std::reverse_iterator<_Iterator>'
  189. || (__p.has_root_name() && __p.root_name() != root_name()))
  190. ^
  191. In file included from c:/Qt14/Tools/mingw810_64/lib/gcc/x86_64-w64-mingw32/8.1.0/include/c++/bits/stl_algobase.h:67,
  192. from c:/Qt14/Tools/mingw810_64/lib/gcc/x86_64-w64-mingw32/8.1.0/include/c++/algorithm:61,
  193. from C:/Qt/Qt5.11.3/5.11.3/mingw53_32/include/QtCore/qglobal.h:142,
  194. from C:/Qt/Qt5.11.3/5.11.3/mingw53_32/include/QtGui/qtguiglobal.h:43,
  195. from C:/Qt/Qt5.11.3/5.11.3/mingw53_32/include/QtWidgets/qtwidgetsglobal.h:43,
  196. from C:/Qt14/6.1.2/mingw81_64/include/QtWidgets/qapplication.h:43,
  197. from C:/Qt14/6.1.2/mingw81_64/include/QtWidgets/QApplication:1,
  198. from ../Qt-Frameless-Window-DarkStyle/DarkStyle.h:19,
  199. from ../Qt-Frameless-Window-DarkStyle/DarkStyle.cpp:14:
  200. c:/Qt14/Tools/mingw810_64/lib/gcc/x86_64-w64-mingw32/8.1.0/include/c++/bits/stl_iterator.h:1124:5: note: candidate: 'template<class _IteratorL, class _IteratorR> constexpr bool std::operator!=(const std::move_iterator<_IteratorL>&, const std::move_iterator<_IteratorR>&)'
  201. operator!=(const move_iterator<_IteratorL>& __x,
  202. ^~~~~~~~
  203. c:/Qt14/Tools/mingw810_64/lib/gcc/x86_64-w64-mingw32/8.1.0/include/c++/bits/stl_iterator.h:1124:5: note: template argument deduction/substitution failed:
  204. In file included from c:/Qt14/Tools/mingw810_64/lib/gcc/x86_64-w64-mingw32/8.1.0/include/c++/filesystem:37,
  205. from C:/Qt14/6.1.2/mingw81_64/include/QtCore/qfile.h:49,
  206. from C:/Qt14/6.1.2/mingw81_64/include/QtCore/QFile:1,
  207. from ../Qt-Frameless-Window-DarkStyle/DarkStyle.h:20,
  208. from ../Qt-Frameless-Window-DarkStyle/DarkStyle.cpp:14:
  209. c:/Qt14/Tools/mingw810_64/lib/gcc/x86_64-w64-mingw32/8.1.0/include/c++/bits/fs_path.h:237:60: note: 'std::filesystem::__cxx11::path' is not derived from 'const std::move_iterator<_IteratorL>'
  210. || (__p.has_root_name() && __p.root_name() != root_name()))
  211. ^
  212. In file included from c:/Qt14/Tools/mingw810_64/lib/gcc/x86_64-w64-mingw32/8.1.0/include/c++/bits/stl_algobase.h:67,
  213. from c:/Qt14/Tools/mingw810_64/lib/gcc/x86_64-w64-mingw32/8.1.0/include/c++/algorithm:61,
  214. from C:/Qt/Qt5.11.3/5.11.3/mingw53_32/include/QtCore/qglobal.h:142,
  215. from C:/Qt/Qt5.11.3/5.11.3/mingw53_32/include/QtGui/qtguiglobal.h:43,
  216. from C:/Qt/Qt5.11.3/5.11.3/mingw53_32/include/QtWidgets/qtwidgetsglobal.h:43,
  217. from C:/Qt14/6.1.2/mingw81_64/include/QtWidgets/qapplication.h:43,
  218. from C:/Qt14/6.1.2/mingw81_64/include/QtWidgets/QApplication:1,
  219. from ../Qt-Frameless-Window-DarkStyle/DarkStyle.h:19,
  220. from ../Qt-Frameless-Window-DarkStyle/DarkStyle.cpp:14:
  221. c:/Qt14/Tools/mingw810_64/lib/gcc/x86_64-w64-mingw32/8.1.0/include/c++/bits/stl_iterator.h:1130:5: note: candidate: 'template<class _Iterator> constexpr bool std::operator!=(const std::move_iterator<_IteratorL>&, const std::move_iterator<_IteratorL>&)'
  222. operator!=(const move_iterator<_Iterator>& __x,
  223. ^~~~~~~~
  224. c:/Qt14/Tools/mingw810_64/lib/gcc/x86_64-w64-mingw32/8.1.0/include/c++/bits/stl_iterator.h:1130:5: note: template argument deduction/substitution failed:
  225. In file included from c:/Qt14/Tools/mingw810_64/lib/gcc/x86_64-w64-mingw32/8.1.0/include/c++/filesystem:37,
  226. from C:/Qt14/6.1.2/mingw81_64/include/QtCore/qfile.h:49,
  227. from C:/Qt14/6.1.2/mingw81_64/include/QtCore/QFile:1,
  228. from ../Qt-Frameless-Window-DarkStyle/DarkStyle.h:20,
  229. from ../Qt-Frameless-Window-DarkStyle/DarkStyle.cpp:14:
  230. c:/Qt14/Tools/mingw810_64/lib/gcc/x86_64-w64-mingw32/8.1.0/include/c++/bits/fs_path.h:237:60: note: 'std::filesystem::__cxx11::path' is not derived from 'const std::move_iterator<_IteratorL>'
  231. || (__p.has_root_name() && __p.root_name() != root_name()))
  232. ^
  233. In file included from c:/Qt14/Tools/mingw810_64/lib/gcc/x86_64-w64-mingw32/8.1.0/include/c++/bits/char_traits.h:40,
  234. from c:/Qt14/Tools/mingw810_64/lib/gcc/x86_64-w64-mingw32/8.1.0/include/c++/string:40,
  235. from C:/Qt/Qt5.11.3/5.11.3/mingw53_32/include/QtCore/qbytearray.h:52,
  236. from C:/Qt/Qt5.11.3/5.11.3/mingw53_32/include/QtCore/qstring.h:49,
  237. from C:/Qt/Qt5.11.3/5.11.3/mingw53_32/include/QtCore/qcoreapplication.h:44,
  238. from C:/Qt14/6.1.2/mingw81_64/include/QtWidgets/qapplication.h:44,
  239. from C:/Qt14/6.1.2/mingw81_64/include/QtWidgets/QApplication:1,
  240. from ../Qt-Frameless-Window-DarkStyle/DarkStyle.h:19,
  241. from ../Qt-Frameless-Window-DarkStyle/DarkStyle.cpp:14:
  242. c:/Qt14/Tools/mingw810_64/lib/gcc/x86_64-w64-mingw32/8.1.0/include/c++/bits/postypes.h:221:5: note: candidate: 'template<class _StateT> bool std::operator!=(const std::fpos<_StateT>&, const std::fpos<_StateT>&)'
  243. operator!=(const fpos<_StateT>& __lhs, const fpos<_StateT>& __rhs)
  244. ^~~~~~~~
  245. c:/Qt14/Tools/mingw810_64/lib/gcc/x86_64-w64-mingw32/8.1.0/include/c++/bits/postypes.h:221:5: note: template argument deduction/substitution failed:
  246. In file included from c:/Qt14/Tools/mingw810_64/lib/gcc/x86_64-w64-mingw32/8.1.0/include/c++/filesystem:37,
  247. from C:/Qt14/6.1.2/mingw81_64/include/QtCore/qfile.h:49,
  248. from C:/Qt14/6.1.2/mingw81_64/include/QtCore/QFile:1,
  249. from ../Qt-Frameless-Window-DarkStyle/DarkStyle.h:20,
  250. from ../Qt-Frameless-Window-DarkStyle/DarkStyle.cpp:14:
  251. c:/Qt14/Tools/mingw810_64/lib/gcc/x86_64-w64-mingw32/8.1.0/include/c++/bits/fs_path.h:237:60: note: 'std::filesystem::__cxx11::path' is not derived from 'const std::fpos<_StateT>'
  252. || (__p.has_root_name() && __p.root_name() != root_name()))
  253. ^
  254. In file included from c:/Qt14/Tools/mingw810_64/lib/gcc/x86_64-w64-mingw32/8.1.0/include/c++/string:41,
  255. from C:/Qt/Qt5.11.3/5.11.3/mingw53_32/include/QtCore/qbytearray.h:52,
  256. from C:/Qt/Qt5.11.3/5.11.3/mingw53_32/include/QtCore/qstring.h:49,
  257. from C:/Qt/Qt5.11.3/5.11.3/mingw53_32/include/QtCore/qcoreapplication.h:44,
  258. from C:/Qt14/6.1.2/mingw81_64/include/QtWidgets/qapplication.h:44,
  259. from C:/Qt14/6.1.2/mingw81_64/include/QtWidgets/QApplication:1,
  260. from ../Qt-Frameless-Window-DarkStyle/DarkStyle.h:19,
  261. from ../Qt-Frameless-Window-DarkStyle/DarkStyle.cpp:14:
  262. c:/Qt14/Tools/mingw810_64/lib/gcc/x86_64-w64-mingw32/8.1.0/include/c++/bits/allocator.h:158:5: note: candidate: 'template<class _T1, class _T2> bool std::operator!=(const std::allocator<_Tp>&, const std::allocator<_Tp>&)'
  263. operator!=(const allocator<_T1>&, const allocator<_T2>&)
  264. ^~~~~~~~
  265. c:/Qt14/Tools/mingw810_64/lib/gcc/x86_64-w64-mingw32/8.1.0/include/c++/bits/allocator.h:158:5: note: template argument deduction/substitution failed:
  266. In file included from c:/Qt14/Tools/mingw810_64/lib/gcc/x86_64-w64-mingw32/8.1.0/include/c++/filesystem:37,
  267. from C:/Qt14/6.1.2/mingw81_64/include/QtCore/qfile.h:49,
  268. from C:/Qt14/6.1.2/mingw81_64/include/QtCore/QFile:1,
  269. from ../Qt-Frameless-Window-DarkStyle/DarkStyle.h:20,
  270. from ../Qt-Frameless-Window-DarkStyle/DarkStyle.cpp:14:
  271. c:/Qt14/Tools/mingw810_64/lib/gcc/x86_64-w64-mingw32/8.1.0/include/c++/bits/fs_path.h:237:60: note: 'std::filesystem::__cxx11::path' is not derived from 'const std::allocator<_Tp>'
  272. || (__p.has_root_name() && __p.root_name() != root_name()))
  273. ^
  274. In file included from c:/Qt14/Tools/mingw810_64/lib/gcc/x86_64-w64-mingw32/8.1.0/include/c++/string:41,
  275. from C:/Qt/Qt5.11.3/5.11.3/mingw53_32/include/QtCore/qbytearray.h:52,
  276. from C:/Qt/Qt5.11.3/5.11.3/mingw53_32/include/QtCore/qstring.h:49,
  277. from C:/Qt/Qt5.11.3/5.11.3/mingw53_32/include/QtCore/qcoreapplication.h:44,
  278. from C:/Qt14/6.1.2/mingw81_64/include/QtWidgets/qapplication.h:44,
  279. from C:/Qt14/6.1.2/mingw81_64/include/QtWidgets/QApplication:1,
  280. from ../Qt-Frameless-Window-DarkStyle/DarkStyle.h:19,
  281. from ../Qt-Frameless-Window-DarkStyle/DarkStyle.cpp:14:
  282. c:/Qt14/Tools/mingw810_64/lib/gcc/x86_64-w64-mingw32/8.1.0/include/c++/bits/allocator.h:164:5: note: candidate: 'template<class _Tp> bool std::operator!=(const std::allocator<_Tp>&, const std::allocator<_Tp>&)'
  283. operator!=(const allocator<_Tp>&, const allocator<_Tp>&)
  284. ^~~~~~~~
  285. c:/Qt14/Tools/mingw810_64/lib/gcc/x86_64-w64-mingw32/8.1.0/include/c++/bits/allocator.h:164:5: note: template argument deduction/substitution failed:
  286. In file included from c:/Qt14/Tools/mingw810_64/lib/gcc/x86_64-w64-mingw32/8.1.0/include/c++/filesystem:37,
  287. from C:/Qt14/6.1.2/mingw81_64/include/QtCore/qfile.h:49,
  288. from C:/Qt14/6.1.2/mingw81_64/include/QtCore/QFile:1,
  289. from ../Qt-Frameless-Window-DarkStyle/DarkStyle.h:20,
  290. from ../Qt-Frameless-Window-DarkStyle/DarkStyle.cpp:14:
  291. c:/Qt14/Tools/mingw810_64/lib/gcc/x86_64-w64-mingw32/8.1.0/include/c++/bits/fs_path.h:237:60: note: 'std::filesystem::__cxx11::path' is not derived from 'const std::allocator<_Tp>'
  292. || (__p.has_root_name() && __p.root_name() != root_name()))
  293. ^
  294. In file included from c:/Qt14/Tools/mingw810_64/lib/gcc/x86_64-w64-mingw32/8.1.0/include/c++/bits/basic_string.h:48,
  295. from c:/Qt14/Tools/mingw810_64/lib/gcc/x86_64-w64-mingw32/8.1.0/include/c++/string:52,
  296. from C:/Qt/Qt5.11.3/5.11.3/mingw53_32/include/QtCore/qbytearray.h:52,
  297. from C:/Qt/Qt5.11.3/5.11.3/mingw53_32/include/QtCore/qstring.h:49,
  298. from C:/Qt/Qt5.11.3/5.11.3/mingw53_32/include/QtCore/qcoreapplication.h:44,
  299. from C:/Qt14/6.1.2/mingw81_64/include/QtWidgets/qapplication.h:44,
  300. from C:/Qt14/6.1.2/mingw81_64/include/QtWidgets/QApplication:1,
  301. from ../Qt-Frameless-Window-DarkStyle/DarkStyle.h:19,
  302. from ../Qt-Frameless-Window-DarkStyle/DarkStyle.cpp:14:
  303. c:/Qt14/Tools/mingw810_64/lib/gcc/x86_64-w64-mingw32/8.1.0/include/c++/string_view:454:5: note: candidate: 'template<class _CharT, class _Traits> constexpr bool std::operator!=(std::basic_string_view<_CharT, _Traits>, std::basic_string_view<_CharT, _Traits>)'
  304. operator!=(basic_string_view<_CharT, _Traits> __x,
  305. ^~~~~~~~
  306. c:/Qt14/Tools/mingw810_64/lib/gcc/x86_64-w64-mingw32/8.1.0/include/c++/string_view:454:5: note: template argument deduction/substitution failed:
  307. In file included from c:/Qt14/Tools/mingw810_64/lib/gcc/x86_64-w64-mingw32/8.1.0/include/c++/filesystem:37,
  308. from C:/Qt14/6.1.2/mingw81_64/include/QtCore/qfile.h:49,
  309. from C:/Qt14/6.1.2/mingw81_64/include/QtCore/QFile:1,
  310. from ../Qt-Frameless-Window-DarkStyle/DarkStyle.h:20,
  311. from ../Qt-Frameless-Window-DarkStyle/DarkStyle.cpp:14:
  312. c:/Qt14/Tools/mingw810_64/lib/gcc/x86_64-w64-mingw32/8.1.0/include/c++/bits/fs_path.h:237:60: note: 'std::filesystem::__cxx11::path' is not derived from 'std::basic_string_view<_CharT, _Traits>'
  313. || (__p.has_root_name() && __p.root_name() != root_name()))
  314. ^
  315. In file included from c:/Qt14/Tools/mingw810_64/lib/gcc/x86_64-w64-mingw32/8.1.0/include/c++/bits/basic_string.h:48,
  316. from c:/Qt14/Tools/mingw810_64/lib/gcc/x86_64-w64-mingw32/8.1.0/include/c++/string:52,
  317. from C:/Qt/Qt5.11.3/5.11.3/mingw53_32/include/QtCore/qbytearray.h:52,
  318. from C:/Qt/Qt5.11.3/5.11.3/mingw53_32/include/QtCore/qstring.h:49,
  319. from C:/Qt/Qt5.11.3/5.11.3/mingw53_32/include/QtCore/qcoreapplication.h:44,
  320. from C:/Qt14/6.1.2/mingw81_64/include/QtWidgets/qapplication.h:44,
  321. from C:/Qt14/6.1.2/mingw81_64/include/QtWidgets/QApplication:1,
  322. from ../Qt-Frameless-Window-DarkStyle/DarkStyle.h:19,
  323. from ../Qt-Frameless-Window-DarkStyle/DarkStyle.cpp:14:
  324. c:/Qt14/Tools/mingw810_64/lib/gcc/x86_64-w64-mingw32/8.1.0/include/c++/string_view:460:5: note: candidate: 'template<class _CharT, class _Traits> constexpr bool std::operator!=(std::basic_string_view<_CharT, _Traits>, std::__detail::__idt<std::basic_string_view<_CharT, _Traits> >)'
  325. operator!=(basic_string_view<_CharT, _Traits> __x,
  326. ^~~~~~~~
  327. c:/Qt14/Tools/mingw810_64/lib/gcc/x86_64-w64-mingw32/8.1.0/include/c++/string_view:460:5: note: template argument deduction/substitution failed:
  328. In file included from c:/Qt14/Tools/mingw810_64/lib/gcc/x86_64-w64-mingw32/8.1.0/include/c++/filesystem:37,
  329. from C:/Qt14/6.1.2/mingw81_64/include/QtCore/qfile.h:49,
  330. from C:/Qt14/6.1.2/mingw81_64/include/QtCore/QFile:1,
  331. from ../Qt-Frameless-Window-DarkStyle/DarkStyle.h:20,
  332. from ../Qt-Frameless-Window-DarkStyle/DarkStyle.cpp:14:
  333. c:/Qt14/Tools/mingw810_64/lib/gcc/x86_64-w64-mingw32/8.1.0/include/c++/bits/fs_path.h:237:60: note: 'std::filesystem::__cxx11::path' is not derived from 'std::basic_string_view<_CharT, _Traits>'
  334. || (__p.has_root_name() && __p.root_name() != root_name()))
  335. ^
  336. In file included from c:/Qt14/Tools/mingw810_64/lib/gcc/x86_64-w64-mingw32/8.1.0/include/c++/bits/basic_string.h:48,
  337. from c:/Qt14/Tools/mingw810_64/lib/gcc/x86_64-w64-mingw32/8.1.0/include/c++/string:52,
  338. from C:/Qt/Qt5.11.3/5.11.3/mingw53_32/include/QtCore/qbytearray.h:52,
  339. from C:/Qt/Qt5.11.3/5.11.3/mingw53_32/include/QtCore/qstring.h:49,
  340. from C:/Qt/Qt5.11.3/5.11.3/mingw53_32/include/QtCore/qcoreapplication.h:44,
  341. from C:/Qt14/6.1.2/mingw81_64/include/QtWidgets/qapplication.h:44,
  342. from C:/Qt14/6.1.2/mingw81_64/include/QtWidgets/QApplication:1,
  343. from ../Qt-Frameless-Window-DarkStyle/DarkStyle.h:19,
  344. from ../Qt-Frameless-Window-DarkStyle/DarkStyle.cpp:14:
  345. c:/Qt14/Tools/mingw810_64/lib/gcc/x86_64-w64-mingw32/8.1.0/include/c++/string_view:466:5: note: candidate: 'template<class _CharT, class _Traits> constexpr bool std::operator!=(std::__detail::__idt<std::basic_string_view<_CharT, _Traits> >, std::basic_string_view<_CharT, _Traits>)'
  346. operator!=(__detail::__idt<basic_string_view<_CharT, _Traits>> __x,
  347. ^~~~~~~~
  348. c:/Qt14/Tools/mingw810_64/lib/gcc/x86_64-w64-mingw32/8.1.0/include/c++/string_view:466:5: note: template argument deduction/substitution failed:
  349. In file included from c:/Qt14/Tools/mingw810_64/lib/gcc/x86_64-w64-mingw32/8.1.0/include/c++/filesystem:37,
  350. from C:/Qt14/6.1.2/mingw81_64/include/QtCore/qfile.h:49,
  351. from C:/Qt14/6.1.2/mingw81_64/include/QtCore/QFile:1,
  352. from ../Qt-Frameless-Window-DarkStyle/DarkStyle.h:20,
  353. from ../Qt-Frameless-Window-DarkStyle/DarkStyle.cpp:14:
  354. c:/Qt14/Tools/mingw810_64/lib/gcc/x86_64-w64-mingw32/8.1.0/include/c++/bits/fs_path.h:237:60: note: 'std::filesystem::__cxx11::path' is not derived from 'std::basic_string_view<_CharT, _Traits>'
  355. || (__p.has_root_name() && __p.root_name() != root_name()))
  356. ^
  357. In file included from c:/Qt14/Tools/mingw810_64/lib/gcc/x86_64-w64-mingw32/8.1.0/include/c++/string:52,
  358. from C:/Qt/Qt5.11.3/5.11.3/mingw53_32/include/QtCore/qbytearray.h:52,
  359. from C:/Qt/Qt5.11.3/5.11.3/mingw53_32/include/QtCore/qstring.h:49,
  360. from C:/Qt/Qt5.11.3/5.11.3/mingw53_32/include/QtCore/qcoreapplication.h:44,
  361. from C:/Qt14/6.1.2/mingw81_64/include/QtWidgets/qapplication.h:44,
  362. from C:/Qt14/6.1.2/mingw81_64/include/QtWidgets/QApplication:1,
  363. from ../Qt-Frameless-Window-DarkStyle/DarkStyle.h:19,
  364. from ../Qt-Frameless-Window-DarkStyle/DarkStyle.cpp:14:
  365. c:/Qt14/Tools/mingw810_64/lib/gcc/x86_64-w64-mingw32/8.1.0/include/c++/bits/basic_string.h:6056:5: note: candidate: 'template<class _CharT, class _Traits, class _Alloc> bool std::operator!=(const std::__cxx11::basic_string<_CharT, _Traits, _Alloc>&, const std::__cxx11::basic_string<_CharT, _Traits, _Alloc>&)'
  366. operator!=(const basic_string<_CharT, _Traits, _Alloc>& __lhs,
  367. ^~~~~~~~
  368. c:/Qt14/Tools/mingw810_64/lib/gcc/x86_64-w64-mingw32/8.1.0/include/c++/bits/basic_string.h:6056:5: note: template argument deduction/substitution failed:
  369. In file included from c:/Qt14/Tools/mingw810_64/lib/gcc/x86_64-w64-mingw32/8.1.0/include/c++/filesystem:37,
  370. from C:/Qt14/6.1.2/mingw81_64/include/QtCore/qfile.h:49,
  371. from C:/Qt14/6.1.2/mingw81_64/include/QtCore/QFile:1,
  372. from ../Qt-Frameless-Window-DarkStyle/DarkStyle.h:20,
  373. from ../Qt-Frameless-Window-DarkStyle/DarkStyle.cpp:14:
  374. c:/Qt14/Tools/mingw810_64/lib/gcc/x86_64-w64-mingw32/8.1.0/include/c++/bits/fs_path.h:237:60: note: 'std::filesystem::__cxx11::path' is not derived from 'const std::__cxx11::basic_string<_CharT, _Traits, _Alloc>'
  375. || (__p.has_root_name() && __p.root_name() != root_name()))
  376. ^
  377. In file included from c:/Qt14/Tools/mingw810_64/lib/gcc/x86_64-w64-mingw32/8.1.0/include/c++/string:52,
  378. from C:/Qt/Qt5.11.3/5.11.3/mingw53_32/include/QtCore/qbytearray.h:52,
  379. from C:/Qt/Qt5.11.3/5.11.3/mingw53_32/include/QtCore/qstring.h:49,
  380. from C:/Qt/Qt5.11.3/5.11.3/mingw53_32/include/QtCore/qcoreapplication.h:44,
  381. from C:/Qt14/6.1.2/mingw81_64/include/QtWidgets/qapplication.h:44,
  382. from C:/Qt14/6.1.2/mingw81_64/include/QtWidgets/QApplication:1,
  383. from ../Qt-Frameless-Window-DarkStyle/DarkStyle.h:19,
  384. from ../Qt-Frameless-Window-DarkStyle/DarkStyle.cpp:14:
  385. c:/Qt14/Tools/mingw810_64/lib/gcc/x86_64-w64-mingw32/8.1.0/include/c++/bits/basic_string.h:6069:5: note: candidate: 'template<class _CharT, class _Traits, class _Alloc> bool std::operator!=(const _CharT*, const std::__cxx11::basic_string<_CharT, _Traits, _Alloc>&)'
  386. operator!=(const _CharT* __lhs,
  387. ^~~~~~~~
  388. c:/Qt14/Tools/mingw810_64/lib/gcc/x86_64-w64-mingw32/8.1.0/include/c++/bits/basic_string.h:6069:5: note: template argument deduction/substitution failed:
  389. In file included from c:/Qt14/Tools/mingw810_64/lib/gcc/x86_64-w64-mingw32/8.1.0/include/c++/filesystem:37,
  390. from C:/Qt14/6.1.2/mingw81_64/include/QtCore/qfile.h:49,
  391. from C:/Qt14/6.1.2/mingw81_64/include/QtCore/QFile:1,
  392. from ../Qt-Frameless-Window-DarkStyle/DarkStyle.h:20,
  393. from ../Qt-Frameless-Window-DarkStyle/DarkStyle.cpp:14:
  394. c:/Qt14/Tools/mingw810_64/lib/gcc/x86_64-w64-mingw32/8.1.0/include/c++/bits/fs_path.h:237:60: note: mismatched types 'const _CharT*' and 'std::filesystem::__cxx11::path'
  395. || (__p.has_root_name() && __p.root_name() != root_name()))
  396. ^
  397. In file included from c:/Qt14/Tools/mingw810_64/lib/gcc/x86_64-w64-mingw32/8.1.0/include/c++/string:52,
  398. from C:/Qt/Qt5.11.3/5.11.3/mingw53_32/include/QtCore/qbytearray.h:52,
  399. from C:/Qt/Qt5.11.3/5.11.3/mingw53_32/include/QtCore/qstring.h:49,
  400. from C:/Qt/Qt5.11.3/5.11.3/mingw53_32/include/QtCore/qcoreapplication.h:44,
  401. from C:/Qt14/6.1.2/mingw81_64/include/QtWidgets/qapplication.h:44,
  402. from C:/Qt14/6.1.2/mingw81_64/include/QtWidgets/QApplication:1,
  403. from ../Qt-Frameless-Window-DarkStyle/DarkStyle.h:19,
  404. from ../Qt-Frameless-Window-DarkStyle/DarkStyle.cpp:14:
  405. c:/Qt14/Tools/mingw810_64/lib/gcc/x86_64-w64-mingw32/8.1.0/include/c++/bits/basic_string.h:6081:5: note: candidate: 'template<class _CharT, class _Traits, class _Alloc> bool std::operator!=(const std::__cxx11::basic_string<_CharT, _Traits, _Alloc>&, const _CharT*)'
  406. operator!=(const basic_string<_CharT, _Traits, _Alloc>& __lhs,
  407. ^~~~~~~~
  408. c:/Qt14/Tools/mingw810_64/lib/gcc/x86_64-w64-mingw32/8.1.0/include/c++/bits/basic_string.h:6081:5: note: template argument deduction/substitution failed:
  409. In file included from c:/Qt14/Tools/mingw810_64/lib/gcc/x86_64-w64-mingw32/8.1.0/include/c++/filesystem:37,
  410. from C:/Qt14/6.1.2/mingw81_64/include/QtCore/qfile.h:49,
  411. from C:/Qt14/6.1.2/mingw81_64/include/QtCore/QFile:1,
  412. from ../Qt-Frameless-Window-DarkStyle/DarkStyle.h:20,
  413. from ../Qt-Frameless-Window-DarkStyle/DarkStyle.cpp:14:
  414. c:/Qt14/Tools/mingw810_64/lib/gcc/x86_64-w64-mingw32/8.1.0/include/c++/bits/fs_path.h:237:60: note: 'std::filesystem::__cxx11::path' is not derived from 'const std::__cxx11::basic_string<_CharT, _Traits, _Alloc>'
  415. || (__p.has_root_name() && __p.root_name() != root_name()))
  416. ^
  417. In file included from c:/Qt14/Tools/mingw810_64/lib/gcc/x86_64-w64-mingw32/8.1.0/include/c++/bits/ios_base.h:46,
  418. from c:/Qt14/Tools/mingw810_64/lib/gcc/x86_64-w64-mingw32/8.1.0/include/c++/ios:42,
  419. from c:/Qt14/Tools/mingw810_64/lib/gcc/x86_64-w64-mingw32/8.1.0/include/c++/ostream:38,
  420. from c:/Qt14/Tools/mingw810_64/lib/gcc/x86_64-w64-mingw32/8.1.0/include/c++/iterator:64,
  421. from C:/Qt/Qt5.11.3/5.11.3/mingw53_32/include/QtCore/qbytearray.h:53,
  422. from C:/Qt/Qt5.11.3/5.11.3/mingw53_32/include/QtCore/qstring.h:49,
  423. from C:/Qt/Qt5.11.3/5.11.3/mingw53_32/include/QtCore/qcoreapplication.h:44,
  424. from C:/Qt14/6.1.2/mingw81_64/include/QtWidgets/qapplication.h:44,
  425. from C:/Qt14/6.1.2/mingw81_64/include/QtWidgets/QApplication:1,
  426. from ../Qt-Frameless-Window-DarkStyle/DarkStyle.h:19,
  427. from ../Qt-Frameless-Window-DarkStyle/DarkStyle.cpp:14:
  428. c:/Qt14/Tools/mingw810_64/lib/gcc/x86_64-w64-mingw32/8.1.0/include/c++/system_error:319:3: note: candidate: 'bool std::operator!=(const std::error_code&, const std::error_code&)'
  429. operator!=(const error_code& __lhs, const error_code& __rhs) noexcept
  430. ^~~~~~~~
  431. c:/Qt14/Tools/mingw810_64/lib/gcc/x86_64-w64-mingw32/8.1.0/include/c++/system_error:319:3: note: no known conversion for argument 1 from 'std::filesystem::__cxx11::path' to 'const std::error_code&'
  432. c:/Qt14/Tools/mingw810_64/lib/gcc/x86_64-w64-mingw32/8.1.0/include/c++/system_error:323:3: note: candidate: 'bool std::operator!=(const std::error_code&, const std::error_condition&)'
  433. operator!=(const error_code& __lhs, const error_condition& __rhs) noexcept
  434. ^~~~~~~~
  435. c:/Qt14/Tools/mingw810_64/lib/gcc/x86_64-w64-mingw32/8.1.0/include/c++/system_error:323:3: note: no known conversion for argument 1 from 'std::filesystem::__cxx11::path' to 'const std::error_code&'
  436. c:/Qt14/Tools/mingw810_64/lib/gcc/x86_64-w64-mingw32/8.1.0/include/c++/system_error:327:3: note: candidate: 'bool std::operator!=(const std::error_condition&, const std::error_code&)'
  437. operator!=(const error_condition& __lhs, const error_code& __rhs) noexcept
  438. ^~~~~~~~
  439. c:/Qt14/Tools/mingw810_64/lib/gcc/x86_64-w64-mingw32/8.1.0/include/c++/system_error:327:3: note: no known conversion for argument 1 from 'std::filesystem::__cxx11::path' to 'const std::error_condition&'
  440. c:/Qt14/Tools/mingw810_64/lib/gcc/x86_64-w64-mingw32/8.1.0/include/c++/system_error:331:3: note: candidate: 'bool std::operator!=(const std::error_condition&, const std::error_condition&)'
  441. operator!=(const error_condition& __lhs,
  442. ^~~~~~~~
  443. c:/Qt14/Tools/mingw810_64/lib/gcc/x86_64-w64-mingw32/8.1.0/include/c++/system_error:331:3: note: no known conversion for argument 1 from 'std::filesystem::__cxx11::path' to 'const std::error_condition&'
  444. In file included from c:/Qt14/Tools/mingw810_64/lib/gcc/x86_64-w64-mingw32/8.1.0/include/c++/bits/locale_facets.h:48,
  445. from c:/Qt14/Tools/mingw810_64/lib/gcc/x86_64-w64-mingw32/8.1.0/include/c++/bits/basic_ios.h:37,
  446. from c:/Qt14/Tools/mingw810_64/lib/gcc/x86_64-w64-mingw32/8.1.0/include/c++/ios:44,
  447. from c:/Qt14/Tools/mingw810_64/lib/gcc/x86_64-w64-mingw32/8.1.0/include/c++/ostream:38,
  448. from c:/Qt14/Tools/mingw810_64/lib/gcc/x86_64-w64-mingw32/8.1.0/include/c++/iterator:64,
  449. from C:/Qt/Qt5.11.3/5.11.3/mingw53_32/include/QtCore/qbytearray.h:53,
  450. from C:/Qt/Qt5.11.3/5.11.3/mingw53_32/include/QtCore/qstring.h:49,
  451. from C:/Qt/Qt5.11.3/5.11.3/mingw53_32/include/QtCore/qcoreapplication.h:44,
  452. from C:/Qt14/6.1.2/mingw81_64/include/QtWidgets/qapplication.h:44,
  453. from C:/Qt14/6.1.2/mingw81_64/include/QtWidgets/QApplication:1,
  454. from ../Qt-Frameless-Window-DarkStyle/DarkStyle.h:19,
  455. from ../Qt-Frameless-Window-DarkStyle/DarkStyle.cpp:14:
  456. c:/Qt14/Tools/mingw810_64/lib/gcc/x86_64-w64-mingw32/8.1.0/include/c++/bits/streambuf_iterator.h:209:5: note: candidate: 'template<class _CharT, class _Traits> bool std::operator!=(const std::istreambuf_iterator<_CharT, _Traits>&, const std::istreambuf_iterator<_CharT, _Traits>&)'
  457. operator!=(const istreambuf_iterator<_CharT, _Traits>& __a,
  458. ^~~~~~~~
  459. c:/Qt14/Tools/mingw810_64/lib/gcc/x86_64-w64-mingw32/8.1.0/include/c++/bits/streambuf_iterator.h:209:5: note: template argument deduction/substitution failed:
  460. In file included from c:/Qt14/Tools/mingw810_64/lib/gcc/x86_64-w64-mingw32/8.1.0/include/c++/filesystem:37,
  461. from C:/Qt14/6.1.2/mingw81_64/include/QtCore/qfile.h:49,
  462. from C:/Qt14/6.1.2/mingw81_64/include/QtCore/QFile:1,
  463. from ../Qt-Frameless-Window-DarkStyle/DarkStyle.h:20,
  464. from ../Qt-Frameless-Window-DarkStyle/DarkStyle.cpp:14:
  465. c:/Qt14/Tools/mingw810_64/lib/gcc/x86_64-w64-mingw32/8.1.0/include/c++/bits/fs_path.h:237:60: note: 'std::filesystem::__cxx11::path' is not derived from 'const std::istreambuf_iterator<_CharT, _Traits>'
  466. || (__p.has_root_name() && __p.root_name() != root_name()))
  467. ^
  468. In file included from c:/Qt14/Tools/mingw810_64/lib/gcc/x86_64-w64-mingw32/8.1.0/include/c++/iterator:66,
  469. from C:/Qt/Qt5.11.3/5.11.3/mingw53_32/include/QtCore/qbytearray.h:53,
  470. from C:/Qt/Qt5.11.3/5.11.3/mingw53_32/include/QtCore/qstring.h:49,
  471. from C:/Qt/Qt5.11.3/5.11.3/mingw53_32/include/QtCore/qcoreapplication.h:44,
  472. from C:/Qt14/6.1.2/mingw81_64/include/QtWidgets/qapplication.h:44,
  473. from C:/Qt14/6.1.2/mingw81_64/include/QtWidgets/QApplication:1,
  474. from ../Qt-Frameless-Window-DarkStyle/DarkStyle.h:19,
  475. from ../Qt-Frameless-Window-DarkStyle/DarkStyle.cpp:14:
  476. c:/Qt14/Tools/mingw810_64/lib/gcc/x86_64-w64-mingw32/8.1.0/include/c++/bits/stream_iterator.h:137:5: note: candidate: 'template<class _Tp, class _CharT, class _Traits, class _Dist> bool std::operator!=(const std::istream_iterator<_Tp, _CharT, _Traits, _Dist>&, const std::istream_iterator<_Tp, _CharT, _Traits, _Dist>&)'
  477. operator!=(const istream_iterator<_Tp, _CharT, _Traits, _Dist>& __x,
  478. ^~~~~~~~
  479. c:/Qt14/Tools/mingw810_64/lib/gcc/x86_64-w64-mingw32/8.1.0/include/c++/bits/stream_iterator.h:137:5: note: template argument deduction/substitution failed:
  480. In file included from c:/Qt14/Tools/mingw810_64/lib/gcc/x86_64-w64-mingw32/8.1.0/include/c++/filesystem:37,
  481. from C:/Qt14/6.1.2/mingw81_64/include/QtCore/qfile.h:49,
  482. from C:/Qt14/6.1.2/mingw81_64/include/QtCore/QFile:1,
  483. from ../Qt-Frameless-Window-DarkStyle/DarkStyle.h:20,
  484. from ../Qt-Frameless-Window-DarkStyle/DarkStyle.cpp:14:
  485. c:/Qt14/Tools/mingw810_64/lib/gcc/x86_64-w64-mingw32/8.1.0/include/c++/bits/fs_path.h:237:60: note: 'std::filesystem::__cxx11::path' is not derived from 'const std::istream_iterator<_Tp, _CharT, _Traits, _Dist>'
  486. || (__p.has_root_name() && __p.root_name() != root_name()))
  487. ^
  488. In file included from c:/Qt14/Tools/mingw810_64/lib/gcc/x86_64-w64-mingw32/8.1.0/include/c++/list:63,
  489. from C:/Qt/Qt5.11.3/5.11.3/mingw53_32/include/QtCore/qlist.h:50,
  490. from C:/Qt/Qt5.11.3/5.11.3/mingw53_32/include/QtCore/qobject.h:49,
  491. from C:/Qt/Qt5.11.3/5.11.3/mingw53_32/include/QtCore/qcoreapplication.h:46,
  492. from C:/Qt14/6.1.2/mingw81_64/include/QtWidgets/qapplication.h:44,
  493. from C:/Qt14/6.1.2/mingw81_64/include/QtWidgets/QApplication:1,
  494. from ../Qt-Frameless-Window-DarkStyle/DarkStyle.h:19,
  495. from ../Qt-Frameless-Window-DarkStyle/DarkStyle.cpp:14:
  496. c:/Qt14/Tools/mingw810_64/lib/gcc/x86_64-w64-mingw32/8.1.0/include/c++/bits/stl_list.h:350:5: note: candidate: 'template<class _Val> bool std::operator!=(const std::_List_iterator<_Tp>&, const std::_List_const_iterator<_Tp>&)'
  497. operator!=(const _List_iterator<_Val>& __x,
  498. ^~~~~~~~
  499. c:/Qt14/Tools/mingw810_64/lib/gcc/x86_64-w64-mingw32/8.1.0/include/c++/bits/stl_list.h:350:5: note: template argument deduction/substitution failed:
  500. In file included from c:/Qt14/Tools/mingw810_64/lib/gcc/x86_64-w64-mingw32/8.1.0/include/c++/filesystem:37,
  501. from C:/Qt14/6.1.2/mingw81_64/include/QtCore/qfile.h:49,
  502. from C:/Qt14/6.1.2/mingw81_64/include/QtCore/QFile:1,
  503. from ../Qt-Frameless-Window-DarkStyle/DarkStyle.h:20,
  504. from ../Qt-Frameless-Window-DarkStyle/DarkStyle.cpp:14:
  505. c:/Qt14/Tools/mingw810_64/lib/gcc/x86_64-w64-mingw32/8.1.0/include/c++/bits/fs_path.h:237:60: note: 'std::filesystem::__cxx11::path' is not derived from 'const std::_List_iterator<_Tp>'
  506. || (__p.has_root_name() && __p.root_name() != root_name()))
  507. ^
  508. In file included from c:/Qt14/Tools/mingw810_64/lib/gcc/x86_64-w64-mingw32/8.1.0/include/c++/list:63,
  509. from C:/Qt/Qt5.11.3/5.11.3/mingw53_32/include/QtCore/qlist.h:50,
  510. from C:/Qt/Qt5.11.3/5.11.3/mingw53_32/include/QtCore/qobject.h:49,
  511. from C:/Qt/Qt5.11.3/5.11.3/mingw53_32/include/QtCore/qcoreapplication.h:46,
  512. from C:/Qt14/6.1.2/mingw81_64/include/QtWidgets/qapplication.h:44,
  513. from C:/Qt14/6.1.2/mingw81_64/include/QtWidgets/QApplication:1,
  514. from ../Qt-Frameless-Window-DarkStyle/DarkStyle.h:19,
  515. from ../Qt-Frameless-Window-DarkStyle/DarkStyle.cpp:14:
  516. c:/Qt14/Tools/mingw810_64/lib/gcc/x86_64-w64-mingw32/8.1.0/include/c++/bits/stl_list.h:2027:5: note: candidate: 'template<class _Tp, class _Alloc> bool std::operator!=(const std::__cxx11::list<_Tp, _Alloc>&, const std::__cxx11::list<_Tp, _Alloc>&)'
  517. operator!=(const list<_Tp, _Alloc>& __x, const list<_Tp, _Alloc>& __y)
  518. ^~~~~~~~
  519. c:/Qt14/Tools/mingw810_64/lib/gcc/x86_64-w64-mingw32/8.1.0/include/c++/bits/stl_list.h:2027:5: note: template argument deduction/substitution failed:
  520. In file included from c:/Qt14/Tools/mingw810_64/lib/gcc/x86_64-w64-mingw32/8.1.0/include/c++/filesystem:37,
  521. from C:/Qt14/6.1.2/mingw81_64/include/QtCore/qfile.h:49,
  522. from C:/Qt14/6.1.2/mingw81_64/include/QtCore/QFile:1,
  523. from ../Qt-Frameless-Window-DarkStyle/DarkStyle.h:20,
  524. from ../Qt-Frameless-Window-DarkStyle/DarkStyle.cpp:14:
  525. c:/Qt14/Tools/mingw810_64/lib/gcc/x86_64-w64-mingw32/8.1.0/include/c++/bits/fs_path.h:237:60: note: 'std::filesystem::__cxx11::path' is not derived from 'const std::__cxx11::list<_Tp, _Alloc>'
  526. || (__p.has_root_name() && __p.root_name() != root_name()))
  527. ^
  528. In file included from c:/Qt14/Tools/mingw810_64/lib/gcc/x86_64-w64-mingw32/8.1.0/include/c++/vector:64,
  529. from C:/Qt/Qt5.11.3/5.11.3/mingw53_32/include/QtCore/qmetatype.h:53,
  530. from C:/Qt/Qt5.11.3/5.11.3/mingw53_32/include/QtCore/qobject.h:54,
  531. from C:/Qt/Qt5.11.3/5.11.3/mingw53_32/include/QtCore/qcoreapplication.h:46,
  532. from C:/Qt14/6.1.2/mingw81_64/include/QtWidgets/qapplication.h:44,
  533. from C:/Qt14/6.1.2/mingw81_64/include/QtWidgets/QApplication:1,
  534. from ../Qt-Frameless-Window-DarkStyle/DarkStyle.h:19,
  535. from ../Qt-Frameless-Window-DarkStyle/DarkStyle.cpp:14:
  536. c:/Qt14/Tools/mingw810_64/lib/gcc/x86_64-w64-mingw32/8.1.0/include/c++/bits/stl_vector.h:1772:5: note: candidate: 'template<class _Tp, class _Alloc> bool std::operator!=(const std::vector<_Tp, _Alloc>&, const std::vector<_Tp, _Alloc>&)'
  537. operator!=(const vector<_Tp, _Alloc>& __x, const vector<_Tp, _Alloc>& __y)
  538. ^~~~~~~~
  539. c:/Qt14/Tools/mingw810_64/lib/gcc/x86_64-w64-mingw32/8.1.0/include/c++/bits/stl_vector.h:1772:5: note: template argument deduction/substitution failed:
  540. In file included from c:/Qt14/Tools/mingw810_64/lib/gcc/x86_64-w64-mingw32/8.1.0/include/c++/filesystem:37,
  541. from C:/Qt14/6.1.2/mingw81_64/include/QtCore/qfile.h:49,
  542. from C:/Qt14/6.1.2/mingw81_64/include/QtCore/QFile:1,
  543. from ../Qt-Frameless-Window-DarkStyle/DarkStyle.h:20,
  544. from ../Qt-Frameless-Window-DarkStyle/DarkStyle.cpp:14:
  545. c:/Qt14/Tools/mingw810_64/lib/gcc/x86_64-w64-mingw32/8.1.0/include/c++/bits/fs_path.h:237:60: note: 'std::filesystem::__cxx11::path' is not derived from 'const std::vector<_Tp, _Alloc>'
  546. || (__p.has_root_name() && __p.root_name() != root_name()))
  547. ^
  548. In file included from c:/Qt14/Tools/mingw810_64/lib/gcc/x86_64-w64-mingw32/8.1.0/include/c++/bits/node_handle.h:39,
  549. from c:/Qt14/Tools/mingw810_64/lib/gcc/x86_64-w64-mingw32/8.1.0/include/c++/bits/stl_tree.h:72,
  550. from c:/Qt14/Tools/mingw810_64/lib/gcc/x86_64-w64-mingw32/8.1.0/include/c++/map:60,
  551. from C:/Qt/Qt5.11.3/5.11.3/mingw53_32/include/QtCore/qmetatype.h:55,
  552. from C:/Qt/Qt5.11.3/5.11.3/mingw53_32/include/QtCore/qobject.h:54,
  553. from C:/Qt/Qt5.11.3/5.11.3/mingw53_32/include/QtCore/qcoreapplication.h:46,
  554. from C:/Qt14/6.1.2/mingw81_64/include/QtWidgets/qapplication.h:44,
  555. from C:/Qt14/6.1.2/mingw81_64/include/QtWidgets/QApplication:1,
  556. from ../Qt-Frameless-Window-DarkStyle/DarkStyle.h:19,
  557. from ../Qt-Frameless-Window-DarkStyle/DarkStyle.cpp:14:
  558. c:/Qt14/Tools/mingw810_64/lib/gcc/x86_64-w64-mingw32/8.1.0/include/c++/optional:1324:5: note: candidate: 'template<class _Tp, class _Up> constexpr std::__optional_relop_t<decltype ((declval<_Tp>() != declval<_Up>()))> std::operator!=(const std::optional<_Tp>&, const std::optional<_Up>&)'
  559. operator!=(const optional<_Tp>& __lhs, const optional<_Up>& __rhs)
  560. ^~~~~~~~
  561. c:/Qt14/Tools/mingw810_64/lib/gcc/x86_64-w64-mingw32/8.1.0/include/c++/optional:1324:5: note: template argument deduction/substitution failed:
  562. In file included from c:/Qt14/Tools/mingw810_64/lib/gcc/x86_64-w64-mingw32/8.1.0/include/c++/filesystem:37,
  563. from C:/Qt14/6.1.2/mingw81_64/include/QtCore/qfile.h:49,
  564. from C:/Qt14/6.1.2/mingw81_64/include/QtCore/QFile:1,
  565. from ../Qt-Frameless-Window-DarkStyle/DarkStyle.h:20,
  566. from ../Qt-Frameless-Window-DarkStyle/DarkStyle.cpp:14:
  567. c:/Qt14/Tools/mingw810_64/lib/gcc/x86_64-w64-mingw32/8.1.0/include/c++/bits/fs_path.h:237:60: note: 'std::filesystem::__cxx11::path' is not derived from 'const std::optional<_Tp>'
  568. || (__p.has_root_name() && __p.root_name() != root_name()))
  569. ^
  570. In file included from c:/Qt14/Tools/mingw810_64/lib/gcc/x86_64-w64-mingw32/8.1.0/include/c++/bits/node_handle.h:39,
  571. from c:/Qt14/Tools/mingw810_64/lib/gcc/x86_64-w64-mingw32/8.1.0/include/c++/bits/stl_tree.h:72,
  572. from c:/Qt14/Tools/mingw810_64/lib/gcc/x86_64-w64-mingw32/8.1.0/include/c++/map:60,
  573. from C:/Qt/Qt5.11.3/5.11.3/mingw53_32/include/QtCore/qmetatype.h:55,
  574. from C:/Qt/Qt5.11.3/5.11.3/mingw53_32/include/QtCore/qobject.h:54,
  575. from C:/Qt/Qt5.11.3/5.11.3/mingw53_32/include/QtCore/qcoreapplication.h:46,
  576. from C:/Qt14/6.1.2/mingw81_64/include/QtWidgets/qapplication.h:44,
  577. from C:/Qt14/6.1.2/mingw81_64/include/QtWidgets/QApplication:1,
  578. from ../Qt-Frameless-Window-DarkStyle/DarkStyle.h:19,
  579. from ../Qt-Frameless-Window-DarkStyle/DarkStyle.cpp:14:
  580. c:/Qt14/Tools/mingw810_64/lib/gcc/x86_64-w64-mingw32/8.1.0/include/c++/optional:1376:5: note: candidate: 'template<class _Tp> constexpr bool std::operator!=(const std::optional<_Tp>&, std::nullopt_t)'
  581. operator!=(const optional<_Tp>& __lhs, nullopt_t) noexcept
  582. ^~~~~~~~
  583. c:/Qt14/Tools/mingw810_64/lib/gcc/x86_64-w64-mingw32/8.1.0/include/c++/optional:1376:5: note: template argument deduction/substitution failed:
  584. In file included from c:/Qt14/Tools/mingw810_64/lib/gcc/x86_64-w64-mingw32/8.1.0/include/c++/filesystem:37,
  585. from C:/Qt14/6.1.2/mingw81_64/include/QtCore/qfile.h:49,
  586. from C:/Qt14/6.1.2/mingw81_64/include/QtCore/QFile:1,
  587. from ../Qt-Frameless-Window-DarkStyle/DarkStyle.h:20,
  588. from ../Qt-Frameless-Window-DarkStyle/DarkStyle.cpp:14:
  589. c:/Qt14/Tools/mingw810_64/lib/gcc/x86_64-w64-mingw32/8.1.0/include/c++/bits/fs_path.h:237:60: note: 'std::filesystem::__cxx11::path' is not derived from 'const std::optional<_Tp>'
  590. || (__p.has_root_name() && __p.root_name() != root_name()))
  591. ^
  592. In file included from c:/Qt14/Tools/mingw810_64/lib/gcc/x86_64-w64-mingw32/8.1.0/include/c++/bits/node_handle.h:39,
  593. from c:/Qt14/Tools/mingw810_64/lib/gcc/x86_64-w64-mingw32/8.1.0/include/c++/bits/stl_tree.h:72,
  594. from c:/Qt14/Tools/mingw810_64/lib/gcc/x86_64-w64-mingw32/8.1.0/include/c++/map:60,
  595. from C:/Qt/Qt5.11.3/5.11.3/mingw53_32/include/QtCore/qmetatype.h:55,
  596. from C:/Qt/Qt5.11.3/5.11.3/mingw53_32/include/QtCore/qobject.h:54,
  597. from C:/Qt/Qt5.11.3/5.11.3/mingw53_32/include/QtCore/qcoreapplication.h:46,
  598. from C:/Qt14/6.1.2/mingw81_64/include/QtWidgets/qapplication.h:44,
  599. from C:/Qt14/6.1.2/mingw81_64/include/QtWidgets/QApplication:1,
  600. from ../Qt-Frameless-Window-DarkStyle/DarkStyle.h:19,
  601. from ../Qt-Frameless-Window-DarkStyle/DarkStyle.cpp:14:
  602. c:/Qt14/Tools/mingw810_64/lib/gcc/x86_64-w64-mingw32/8.1.0/include/c++/optional:1381:5: note: candidate: 'template<class _Tp> constexpr bool std::operator!=(std::nullopt_t, const std::optional<_Tp>&)'
  603. operator!=(nullopt_t, const optional<_Tp>& __rhs) noexcept
  604. ^~~~~~~~
  605. c:/Qt14/Tools/mingw810_64/lib/gcc/x86_64-w64-mingw32/8.1.0/include/c++/optional:1381:5: note: template argument deduction/substitution failed:
  606. In file included from c:/Qt14/Tools/mingw810_64/lib/gcc/x86_64-w64-mingw32/8.1.0/include/c++/filesystem:37,
  607. from C:/Qt14/6.1.2/mingw81_64/include/QtCore/qfile.h:49,
  608. from C:/Qt14/6.1.2/mingw81_64/include/QtCore/QFile:1,
  609. from ../Qt-Frameless-Window-DarkStyle/DarkStyle.h:20,
  610. from ../Qt-Frameless-Window-DarkStyle/DarkStyle.cpp:14:
  611. c:/Qt14/Tools/mingw810_64/lib/gcc/x86_64-w64-mingw32/8.1.0/include/c++/bits/fs_path.h:237:60: note: 'std::filesystem::__cxx11::path' is not derived from 'const std::optional<_Tp>'
  612. || (__p.has_root_name() && __p.root_name() != root_name()))
  613. ^
  614. In file included from c:/Qt14/Tools/mingw810_64/lib/gcc/x86_64-w64-mingw32/8.1.0/include/c++/bits/node_handle.h:39,
  615. from c:/Qt14/Tools/mingw810_64/lib/gcc/x86_64-w64-mingw32/8.1.0/include/c++/bits/stl_tree.h:72,
  616. from c:/Qt14/Tools/mingw810_64/lib/gcc/x86_64-w64-mingw32/8.1.0/include/c++/map:60,
  617. from C:/Qt/Qt5.11.3/5.11.3/mingw53_32/include/QtCore/qmetatype.h:55,
  618. from C:/Qt/Qt5.11.3/5.11.3/mingw53_32/include/QtCore/qobject.h:54,
  619. from C:/Qt/Qt5.11.3/5.11.3/mingw53_32/include/QtCore/qcoreapplication.h:46,
  620. from C:/Qt14/6.1.2/mingw81_64/include/QtWidgets/qapplication.h:44,
  621. from C:/Qt14/6.1.2/mingw81_64/include/QtWidgets/QApplication:1,
  622. from ../Qt-Frameless-Window-DarkStyle/DarkStyle.h:19,
  623. from ../Qt-Frameless-Window-DarkStyle/DarkStyle.cpp:14:
  624. c:/Qt14/Tools/mingw810_64/lib/gcc/x86_64-w64-mingw32/8.1.0/include/c++/optional:1439:5: note: candidate: 'template<class _Tp, class _Up> constexpr std::__optional_relop_t<decltype ((declval<_Tp>() != declval<_Up>()))> std::operator!=(const std::optional<_Tp>&, const _Up&)'
  625. operator!=(const optional<_Tp>& __lhs, const _Up& __rhs)
  626. ^~~~~~~~
  627. c:/Qt14/Tools/mingw810_64/lib/gcc/x86_64-w64-mingw32/8.1.0/include/c++/optional:1439:5: note: template argument deduction/substitution failed:
  628. In file included from c:/Qt14/Tools/mingw810_64/lib/gcc/x86_64-w64-mingw32/8.1.0/include/c++/filesystem:37,
  629. from C:/Qt14/6.1.2/mingw81_64/include/QtCore/qfile.h:49,
  630. from C:/Qt14/6.1.2/mingw81_64/include/QtCore/QFile:1,
  631. from ../Qt-Frameless-Window-DarkStyle/DarkStyle.h:20,
  632. from ../Qt-Frameless-Window-DarkStyle/DarkStyle.cpp:14:
  633. c:/Qt14/Tools/mingw810_64/lib/gcc/x86_64-w64-mingw32/8.1.0/include/c++/bits/fs_path.h:237:60: note: 'std::filesystem::__cxx11::path' is not derived from 'const std::optional<_Tp>'
  634. || (__p.has_root_name() && __p.root_name() != root_name()))
  635. ^
  636. In file included from c:/Qt14/Tools/mingw810_64/lib/gcc/x86_64-w64-mingw32/8.1.0/include/c++/bits/node_handle.h:39,
  637. from c:/Qt14/Tools/mingw810_64/lib/gcc/x86_64-w64-mingw32/8.1.0/include/c++/bits/stl_tree.h:72,
  638. from c:/Qt14/Tools/mingw810_64/lib/gcc/x86_64-w64-mingw32/8.1.0/include/c++/map:60,
  639. from C:/Qt/Qt5.11.3/5.11.3/mingw53_32/include/QtCore/qmetatype.h:55,
  640. from C:/Qt/Qt5.11.3/5.11.3/mingw53_32/include/QtCore/qobject.h:54,
  641. from C:/Qt/Qt5.11.3/5.11.3/mingw53_32/include/QtCore/qcoreapplication.h:46,
  642. from C:/Qt14/6.1.2/mingw81_64/include/QtWidgets/qapplication.h:44,
  643. from C:/Qt14/6.1.2/mingw81_64/include/QtWidgets/QApplication:1,
  644. from ../Qt-Frameless-Window-DarkStyle/DarkStyle.h:19,
  645. from ../Qt-Frameless-Window-DarkStyle/DarkStyle.cpp:14:
  646. c:/Qt14/Tools/mingw810_64/lib/gcc/x86_64-w64-mingw32/8.1.0/include/c++/optional:1445:5: note: candidate: 'template<class _Tp, class _Up> constexpr std::__optional_relop_t<decltype ((declval<_Up>() != declval<_Tp>()))> std::operator!=(const _Up&, const std::optional<_Tp>&)'
  647. operator!=(const _Up& __lhs, const optional<_Tp>& __rhs)
  648. ^~~~~~~~
  649. c:/Qt14/Tools/mingw810_64/lib/gcc/x86_64-w64-mingw32/8.1.0/include/c++/optional:1445:5: note: template argument deduction/substitution failed:
  650. In file included from c:/Qt14/Tools/mingw810_64/lib/gcc/x86_64-w64-mingw32/8.1.0/include/c++/filesystem:37,
  651. from C:/Qt14/6.1.2/mingw81_64/include/QtCore/qfile.h:49,
  652. from C:/Qt14/6.1.2/mingw81_64/include/QtCore/QFile:1,
  653. from ../Qt-Frameless-Window-DarkStyle/DarkStyle.h:20,
  654. from ../Qt-Frameless-Window-DarkStyle/DarkStyle.cpp:14:
  655. c:/Qt14/Tools/mingw810_64/lib/gcc/x86_64-w64-mingw32/8.1.0/include/c++/bits/fs_path.h:237:60: note: 'std::filesystem::__cxx11::path' is not derived from 'const std::optional<_Tp>'
  656. || (__p.has_root_name() && __p.root_name() != root_name()))
  657. ^
  658. In file included from c:/Qt14/Tools/mingw810_64/lib/gcc/x86_64-w64-mingw32/8.1.0/include/c++/map:60,
  659. from C:/Qt/Qt5.11.3/5.11.3/mingw53_32/include/QtCore/qmetatype.h:55,
  660. from C:/Qt/Qt5.11.3/5.11.3/mingw53_32/include/QtCore/qobject.h:54,
  661. from C:/Qt/Qt5.11.3/5.11.3/mingw53_32/include/QtCore/qcoreapplication.h:46,
  662. from C:/Qt14/6.1.2/mingw81_64/include/QtWidgets/qapplication.h:44,
  663. from C:/Qt14/6.1.2/mingw81_64/include/QtWidgets/QApplication:1,
  664. from ../Qt-Frameless-Window-DarkStyle/DarkStyle.h:19,
  665. from ../Qt-Frameless-Window-DarkStyle/DarkStyle.cpp:14:
  666. c:/Qt14/Tools/mingw810_64/lib/gcc/x86_64-w64-mingw32/8.1.0/include/c++/bits/stl_tree.h:412:5: note: candidate: 'template<class _Val> bool std::operator!=(const std::_Rb_tree_iterator<_Tp>&, const std::_Rb_tree_const_iterator<_Val>&)'
  667. operator!=(const _Rb_tree_iterator<_Val>& __x,
  668. ^~~~~~~~
  669. c:/Qt14/Tools/mingw810_64/lib/gcc/x86_64-w64-mingw32/8.1.0/include/c++/bits/stl_tree.h:412:5: note: template argument deduction/substitution failed:
  670. In file included from c:/Qt14/Tools/mingw810_64/lib/gcc/x86_64-w64-mingw32/8.1.0/include/c++/filesystem:37,
  671. from C:/Qt14/6.1.2/mingw81_64/include/QtCore/qfile.h:49,
  672. from C:/Qt14/6.1.2/mingw81_64/include/QtCore/QFile:1,
  673. from ../Qt-Frameless-Window-DarkStyle/DarkStyle.h:20,
  674. from ../Qt-Frameless-Window-DarkStyle/DarkStyle.cpp:14:
  675. c:/Qt14/Tools/mingw810_64/lib/gcc/x86_64-w64-mingw32/8.1.0/include/c++/bits/fs_path.h:237:60: note: 'std::filesystem::__cxx11::path' is not derived from 'const std::_Rb_tree_iterator<_Tp>'
  676. || (__p.has_root_name() && __p.root_name() != root_name()))
  677. ^
  678. In file included from c:/Qt14/Tools/mingw810_64/lib/gcc/x86_64-w64-mingw32/8.1.0/include/c++/map:60,
  679. from C:/Qt/Qt5.11.3/5.11.3/mingw53_32/include/QtCore/qmetatype.h:55,
  680. from C:/Qt/Qt5.11.3/5.11.3/mingw53_32/include/QtCore/qobject.h:54,
  681. from C:/Qt/Qt5.11.3/5.11.3/mingw53_32/include/QtCore/qcoreapplication.h:46,
  682. from C:/Qt14/6.1.2/mingw81_64/include/QtWidgets/qapplication.h:44,
  683. from C:/Qt14/6.1.2/mingw81_64/include/QtWidgets/QApplication:1,
  684. from ../Qt-Frameless-Window-DarkStyle/DarkStyle.h:19,
  685. from ../Qt-Frameless-Window-DarkStyle/DarkStyle.cpp:14:
  686. c:/Qt14/Tools/mingw810_64/lib/gcc/x86_64-w64-mingw32/8.1.0/include/c++/bits/stl_tree.h:1569:5: note: candidate: 'template<class _Key, class _Val, class _KeyOfValue, class _Compare, class _Alloc> bool std::operator!=(const std::_Rb_tree<_Key, _Val, _KeyOfValue, _Compare, _Alloc>&, const std::_Rb_tree<_Key, _Val, _KeyOfValue, _Compare, _Alloc>&)'
  687. operator!=(const _Rb_tree<_Key, _Val, _KeyOfValue, _Compare, _Alloc>& __x,
  688. ^~~~~~~~
  689. c:/Qt14/Tools/mingw810_64/lib/gcc/x86_64-w64-mingw32/8.1.0/include/c++/bits/stl_tree.h:1569:5: note: template argument deduction/substitution failed:
  690. In file included from c:/Qt14/Tools/mingw810_64/lib/gcc/x86_64-w64-mingw32/8.1.0/include/c++/filesystem:37,
  691. from C:/Qt14/6.1.2/mingw81_64/include/QtCore/qfile.h:49,
  692. from C:/Qt14/6.1.2/mingw81_64/include/QtCore/QFile:1,
  693. from ../Qt-Frameless-Window-DarkStyle/DarkStyle.h:20,
  694. from ../Qt-Frameless-Window-DarkStyle/DarkStyle.cpp:14:
  695. c:/Qt14/Tools/mingw810_64/lib/gcc/x86_64-w64-mingw32/8.1.0/include/c++/bits/fs_path.h:237:60: note: 'std::filesystem::__cxx11::path' is not derived from 'const std::_Rb_tree<_Key, _Val, _KeyOfValue, _Compare, _Alloc>'
  696. || (__p.has_root_name() && __p.root_name() != root_name()))
  697. ^
  698. In file included from c:/Qt14/Tools/mingw810_64/lib/gcc/x86_64-w64-mingw32/8.1.0/include/c++/tuple:39,
  699. from c:/Qt14/Tools/mingw810_64/lib/gcc/x86_64-w64-mingw32/8.1.0/include/c++/bits/stl_map.h:63,
  700. from c:/Qt14/Tools/mingw810_64/lib/gcc/x86_64-w64-mingw32/8.1.0/include/c++/map:61,
  701. from C:/Qt/Qt5.11.3/5.11.3/mingw53_32/include/QtCore/qmetatype.h:55,
  702. from C:/Qt/Qt5.11.3/5.11.3/mingw53_32/include/QtCore/qobject.h:54,
  703. from C:/Qt/Qt5.11.3/5.11.3/mingw53_32/include/QtCore/qcoreapplication.h:46,
  704. from C:/Qt14/6.1.2/mingw81_64/include/QtWidgets/qapplication.h:44,
  705. from C:/Qt14/6.1.2/mingw81_64/include/QtWidgets/QApplication:1,
  706. from ../Qt-Frameless-Window-DarkStyle/DarkStyle.h:19,
  707. from ../Qt-Frameless-Window-DarkStyle/DarkStyle.cpp:14:
  708. c:/Qt14/Tools/mingw810_64/lib/gcc/x86_64-w64-mingw32/8.1.0/include/c++/array:257:5: note: candidate: 'template<class _Tp, long long unsigned int _Nm> bool std::operator!=(const std::array<_Tp, _Nm>&, const std::array<_Tp, _Nm>&)'
  709. operator!=(const array<_Tp, _Nm>& __one, const array<_Tp, _Nm>& __two)
  710. ^~~~~~~~
  711. c:/Qt14/Tools/mingw810_64/lib/gcc/x86_64-w64-mingw32/8.1.0/include/c++/array:257:5: note: template argument deduction/substitution failed:
  712. In file included from c:/Qt14/Tools/mingw810_64/lib/gcc/x86_64-w64-mingw32/8.1.0/include/c++/filesystem:37,
  713. from C:/Qt14/6.1.2/mingw81_64/include/QtCore/qfile.h:49,
  714. from C:/Qt14/6.1.2/mingw81_64/include/QtCore/QFile:1,
  715. from ../Qt-Frameless-Window-DarkStyle/DarkStyle.h:20,
  716. from ../Qt-Frameless-Window-DarkStyle/DarkStyle.cpp:14:
  717. c:/Qt14/Tools/mingw810_64/lib/gcc/x86_64-w64-mingw32/8.1.0/include/c++/bits/fs_path.h:237:60: note: 'std::filesystem::__cxx11::path' is not derived from 'const std::array<_Tp, _Nm>'
  718. || (__p.has_root_name() && __p.root_name() != root_name()))
  719. ^
  720. In file included from c:/Qt14/Tools/mingw810_64/lib/gcc/x86_64-w64-mingw32/8.1.0/include/c++/bits/stl_map.h:63,
  721. from c:/Qt14/Tools/mingw810_64/lib/gcc/x86_64-w64-mingw32/8.1.0/include/c++/map:61,
  722. from C:/Qt/Qt5.11.3/5.11.3/mingw53_32/include/QtCore/qmetatype.h:55,
  723. from C:/Qt/Qt5.11.3/5.11.3/mingw53_32/include/QtCore/qobject.h:54,
  724. from C:/Qt/Qt5.11.3/5.11.3/mingw53_32/include/QtCore/qcoreapplication.h:46,
  725. from C:/Qt14/6.1.2/mingw81_64/include/QtWidgets/qapplication.h:44,
  726. from C:/Qt14/6.1.2/mingw81_64/include/QtWidgets/QApplication:1,
  727. from ../Qt-Frameless-Window-DarkStyle/DarkStyle.h:19,
  728. from ../Qt-Frameless-Window-DarkStyle/DarkStyle.cpp:14:
  729. c:/Qt14/Tools/mingw810_64/lib/gcc/x86_64-w64-mingw32/8.1.0/include/c++/tuple:1439:5: note: candidate: 'template<class ... _TElements, class ... _UElements> constexpr bool std::operator!=(const std::tuple<_Tps ...>&, const std::tuple<_Args2 ...>&)'
  730. operator!=(const tuple<_TElements...>& __t,
  731. ^~~~~~~~
  732. c:/Qt14/Tools/mingw810_64/lib/gcc/x86_64-w64-mingw32/8.1.0/include/c++/tuple:1439:5: note: template argument deduction/substitution failed:
  733. In file included from c:/Qt14/Tools/mingw810_64/lib/gcc/x86_64-w64-mingw32/8.1.0/include/c++/filesystem:37,
  734. from C:/Qt14/6.1.2/mingw81_64/include/QtCore/qfile.h:49,
  735. from C:/Qt14/6.1.2/mingw81_64/include/QtCore/QFile:1,
  736. from ../Qt-Frameless-Window-DarkStyle/DarkStyle.h:20,
  737. from ../Qt-Frameless-Window-DarkStyle/DarkStyle.cpp:14:
  738. c:/Qt14/Tools/mingw810_64/lib/gcc/x86_64-w64-mingw32/8.1.0/include/c++/bits/fs_path.h:237:60: note: 'std::filesystem::__cxx11::path' is not derived from 'const std::tuple<_Tps ...>'
  739. || (__p.has_root_name() && __p.root_name() != root_name()))
  740. ^
  741. In file included from c:/Qt14/Tools/mingw810_64/lib/gcc/x86_64-w64-mingw32/8.1.0/include/c++/map:61,
  742. from C:/Qt/Qt5.11.3/5.11.3/mingw53_32/include/QtCore/qmetatype.h:55,
  743. from C:/Qt/Qt5.11.3/5.11.3/mingw53_32/include/QtCore/qobject.h:54,
  744. from C:/Qt/Qt5.11.3/5.11.3/mingw53_32/include/QtCore/qcoreapplication.h:46,
  745. from C:/Qt14/6.1.2/mingw81_64/include/QtWidgets/qapplication.h:44,
  746. from C:/Qt14/6.1.2/mingw81_64/include/QtWidgets/QApplication:1,
  747. from ../Qt-Frameless-Window-DarkStyle/DarkStyle.h:19,
  748. from ../Qt-Frameless-Window-DarkStyle/DarkStyle.cpp:14:
  749. c:/Qt14/Tools/mingw810_64/lib/gcc/x86_64-w64-mingw32/8.1.0/include/c++/bits/stl_map.h:1459:5: note: candidate: 'template<class _Key, class _Tp, class _Compare, class _Alloc> bool std::operator!=(const std::map<_Key, _Tp, _Compare, _Allocator>&, const std::map<_Key, _Tp, _Compare, _Allocator>&)'
  750. operator!=(const map<_Key, _Tp, _Compare, _Alloc>& __x,
  751. ^~~~~~~~
  752. c:/Qt14/Tools/mingw810_64/lib/gcc/x86_64-w64-mingw32/8.1.0/include/c++/bits/stl_map.h:1459:5: note: template argument deduction/substitution failed:
  753. In file included from c:/Qt14/Tools/mingw810_64/lib/gcc/x86_64-w64-mingw32/8.1.0/include/c++/filesystem:37,
  754. from C:/Qt14/6.1.2/mingw81_64/include/QtCore/qfile.h:49,
  755. from C:/Qt14/6.1.2/mingw81_64/include/QtCore/QFile:1,
  756. from ../Qt-Frameless-Window-DarkStyle/DarkStyle.h:20,
  757. from ../Qt-Frameless-Window-DarkStyle/DarkStyle.cpp:14:
  758. c:/Qt14/Tools/mingw810_64/lib/gcc/x86_64-w64-mingw32/8.1.0/include/c++/bits/fs_path.h:237:60: note: 'std::filesystem::__cxx11::path' is not derived from 'const std::map<_Key, _Tp, _Compare, _Allocator>'
  759. || (__p.has_root_name() && __p.root_name() != root_name()))
  760. ^
  761. In file included from c:/Qt14/Tools/mingw810_64/lib/gcc/x86_64-w64-mingw32/8.1.0/include/c++/map:62,
  762. from C:/Qt/Qt5.11.3/5.11.3/mingw53_32/include/QtCore/qmetatype.h:55,
  763. from C:/Qt/Qt5.11.3/5.11.3/mingw53_32/include/QtCore/qobject.h:54,
  764. from C:/Qt/Qt5.11.3/5.11.3/mingw53_32/include/QtCore/qcoreapplication.h:46,
  765. from C:/Qt14/6.1.2/mingw81_64/include/QtWidgets/qapplication.h:44,
  766. from C:/Qt14/6.1.2/mingw81_64/include/QtWidgets/QApplication:1,
  767. from ../Qt-Frameless-Window-DarkStyle/DarkStyle.h:19,
  768. from ../Qt-Frameless-Window-DarkStyle/DarkStyle.cpp:14:
  769. c:/Qt14/Tools/mingw810_64/lib/gcc/x86_64-w64-mingw32/8.1.0/include/c++/bits/stl_multimap.h:1124:5: note: candidate: 'template<class _Key, class _Tp, class _Compare, class _Alloc> bool std::operator!=(const std::multimap<_Key, _Tp, _Compare, _Allocator>&, const std::multimap<_Key, _Tp, _Compare, _Allocator>&)'
  770. operator!=(const multimap<_Key, _Tp, _Compare, _Alloc>& __x,
  771. ^~~~~~~~
  772. c:/Qt14/Tools/mingw810_64/lib/gcc/x86_64-w64-mingw32/8.1.0/include/c++/bits/stl_multimap.h:1124:5: note: template argument deduction/substitution failed:
  773. In file included from c:/Qt14/Tools/mingw810_64/lib/gcc/x86_64-w64-mingw32/8.1.0/include/c++/filesystem:37,
  774. from C:/Qt14/6.1.2/mingw81_64/include/QtCore/qfile.h:49,
  775. from C:/Qt14/6.1.2/mingw81_64/include/QtCore/QFile:1,
  776. from ../Qt-Frameless-Window-DarkStyle/DarkStyle.h:20,
  777. from ../Qt-Frameless-Window-DarkStyle/DarkStyle.cpp:14:
  778. c:/Qt14/Tools/mingw810_64/lib/gcc/x86_64-w64-mingw32/8.1.0/include/c++/bits/fs_path.h:237:60: note: 'std::filesystem::__cxx11::path' is not derived from 'const std::multimap<_Key, _Tp, _Compare, _Allocator>'
  779. || (__p.has_root_name() && __p.root_name() != root_name()))
  780. ^
  781. In file included from c:/Qt14/Tools/mingw810_64/lib/gcc/x86_64-w64-mingw32/8.1.0/include/c++/functional:59,
  782. from C:/Qt/Qt5.11.3/5.11.3/mingw53_32/include/QtCore/qmap.h:54,
  783. from C:/Qt/Qt5.11.3/5.11.3/mingw53_32/include/QtCore/qvariant.h:47,
  784. from C:/Qt/Qt5.11.3/5.11.3/mingw53_32/include/QtCore/qlocale.h:43,
  785. from C:/Qt/Qt5.11.3/5.11.3/mingw53_32/include/QtGui/qguiapplication.h:47,
  786. from C:/Qt14/6.1.2/mingw81_64/include/QtWidgets/qapplication.h:49,
  787. from C:/Qt14/6.1.2/mingw81_64/include/QtWidgets/QApplication:1,
  788. from ../Qt-Frameless-Window-DarkStyle/DarkStyle.h:19,
  789. from ../Qt-Frameless-Window-DarkStyle/DarkStyle.cpp:14:
  790. c:/Qt14/Tools/mingw810_64/lib/gcc/x86_64-w64-mingw32/8.1.0/include/c++/bits/std_function.h:763:5: note: candidate: 'template<class _Res, class ... _Args> bool std::operator!=(const std::function<_Res(_ArgTypes ...)>&, std::nullptr_t)'
  791. operator!=(const function<_Res(_Args...)>& __f, nullptr_t) noexcept
  792. ^~~~~~~~
  793. c:/Qt14/Tools/mingw810_64/lib/gcc/x86_64-w64-mingw32/8.1.0/include/c++/bits/std_function.h:763:5: note: template argument deduction/substitution failed:
  794. In file included from c:/Qt14/Tools/mingw810_64/lib/gcc/x86_64-w64-mingw32/8.1.0/include/c++/filesystem:37,
  795. from C:/Qt14/6.1.2/mingw81_64/include/QtCore/qfile.h:49,
  796. from C:/Qt14/6.1.2/mingw81_64/include/QtCore/QFile:1,
  797. from ../Qt-Frameless-Window-DarkStyle/DarkStyle.h:20,
  798. from ../Qt-Frameless-Window-DarkStyle/DarkStyle.cpp:14:
  799. c:/Qt14/Tools/mingw810_64/lib/gcc/x86_64-w64-mingw32/8.1.0/include/c++/bits/fs_path.h:237:60: note: 'std::filesystem::__cxx11::path' is not derived from 'const std::function<_Res(_ArgTypes ...)>'
  800. || (__p.has_root_name() && __p.root_name() != root_name()))
  801. ^
  802. In file included from c:/Qt14/Tools/mingw810_64/lib/gcc/x86_64-w64-mingw32/8.1.0/include/c++/functional:59,
  803. from C:/Qt/Qt5.11.3/5.11.3/mingw53_32/include/QtCore/qmap.h:54,
  804. from C:/Qt/Qt5.11.3/5.11.3/mingw53_32/include/QtCore/qvariant.h:47,
  805. from C:/Qt/Qt5.11.3/5.11.3/mingw53_32/include/QtCore/qlocale.h:43,
  806. from C:/Qt/Qt5.11.3/5.11.3/mingw53_32/include/QtGui/qguiapplication.h:47,
  807. from C:/Qt14/6.1.2/mingw81_64/include/QtWidgets/qapplication.h:49,
  808. from C:/Qt14/6.1.2/mingw81_64/include/QtWidgets/QApplication:1,
  809. from ../Qt-Frameless-Window-DarkStyle/DarkStyle.h:19,
  810. from ../Qt-Frameless-Window-DarkStyle/DarkStyle.cpp:14:
  811. c:/Qt14/Tools/mingw810_64/lib/gcc/x86_64-w64-mingw32/8.1.0/include/c++/bits/std_function.h:769:5: note: candidate: 'template<class _Res, class ... _Args> bool std::operator!=(std::nullptr_t, const std::function<_Res(_ArgTypes ...)>&)'
  812. operator!=(nullptr_t, const function<_Res(_Args...)>& __f) noexcept
  813. ^~~~~~~~
  814. c:/Qt14/Tools/mingw810_64/lib/gcc/x86_64-w64-mingw32/8.1.0/include/c++/bits/std_function.h:769:5: note: template argument deduction/substitution failed:
  815. In file included from c:/Qt14/Tools/mingw810_64/lib/gcc/x86_64-w64-mingw32/8.1.0/include/c++/filesystem:37,
  816. from C:/Qt14/6.1.2/mingw81_64/include/QtCore/qfile.h:49,
  817. from C:/Qt14/6.1.2/mingw81_64/include/QtCore/QFile:1,
  818. from ../Qt-Frameless-Window-DarkStyle/DarkStyle.h:20,
  819. from ../Qt-Frameless-Window-DarkStyle/DarkStyle.cpp:14:
  820. c:/Qt14/Tools/mingw810_64/lib/gcc/x86_64-w64-mingw32/8.1.0/include/c++/bits/fs_path.h:237:60: note: 'std::filesystem::__cxx11::path' is not derived from 'const std::function<_Res(_ArgTypes ...)>'
  821. || (__p.has_root_name() && __p.root_name() != root_name()))
  822. ^
  823. In file included from c:/Qt14/Tools/mingw810_64/lib/gcc/x86_64-w64-mingw32/8.1.0/include/c++/unordered_map:47,
  824. from c:/Qt14/Tools/mingw810_64/lib/gcc/x86_64-w64-mingw32/8.1.0/include/c++/functional:61,
  825. from C:/Qt/Qt5.11.3/5.11.3/mingw53_32/include/QtCore/qmap.h:54,
  826. from C:/Qt/Qt5.11.3/5.11.3/mingw53_32/include/QtCore/qvariant.h:47,
  827. from C:/Qt/Qt5.11.3/5.11.3/mingw53_32/include/QtCore/qlocale.h:43,
  828. from C:/Qt/Qt5.11.3/5.11.3/mingw53_32/include/QtGui/qguiapplication.h:47,
  829. from C:/Qt14/6.1.2/mingw81_64/include/QtWidgets/qapplication.h:49,
  830. from C:/Qt14/6.1.2/mingw81_64/include/QtWidgets/QApplication:1,
  831. from ../Qt-Frameless-Window-DarkStyle/DarkStyle.h:19,
  832. from ../Qt-Frameless-Window-DarkStyle/DarkStyle.cpp:14:
  833. c:/Qt14/Tools/mingw810_64/lib/gcc/x86_64-w64-mingw32/8.1.0/include/c++/bits/unordered_map.h:2070:5: note: candidate: 'template<class _Key, class _Tp, class _Hash, class _Pred, class _Alloc> bool std::operator!=(const std::unordered_map<_Key1, _Tp1, _Hash1, _Pred1, _Alloc1>&, const std::unordered_map<_Key1, _Tp1, _Hash1, _Pred1, _Alloc1>&)'
  834. operator!=(const unordered_map<_Key, _Tp, _Hash, _Pred, _Alloc>& __x,
  835. ^~~~~~~~
  836. c:/Qt14/Tools/mingw810_64/lib/gcc/x86_64-w64-mingw32/8.1.0/include/c++/bits/unordered_map.h:2070:5: note: template argument deduction/substitution failed:
  837. In file included from c:/Qt14/Tools/mingw810_64/lib/gcc/x86_64-w64-mingw32/8.1.0/include/c++/filesystem:37,
  838. from C:/Qt14/6.1.2/mingw81_64/include/QtCore/qfile.h:49,
  839. from C:/Qt14/6.1.2/mingw81_64/include/QtCore/QFile:1,
  840. from ../Qt-Frameless-Window-DarkStyle/DarkStyle.h:20,
  841. from ../Qt-Frameless-Window-DarkStyle/DarkStyle.cpp:14:
  842. c:/Qt14/Tools/mingw810_64/lib/gcc/x86_64-w64-mingw32/8.1.0/include/c++/bits/fs_path.h:237:60: note: 'std::filesystem::__cxx11::path' is not derived from 'const std::unordered_map<_Key1, _Tp1, _Hash1, _Pred1, _Alloc1>'
  843. || (__p.has_root_name() && __p.root_name() != root_name()))
  844. ^
  845. In file included from c:/Qt14/Tools/mingw810_64/lib/gcc/x86_64-w64-mingw32/8.1.0/include/c++/unordered_map:47,
  846. from c:/Qt14/Tools/mingw810_64/lib/gcc/x86_64-w64-mingw32/8.1.0/include/c++/functional:61,
  847. from C:/Qt/Qt5.11.3/5.11.3/mingw53_32/include/QtCore/qmap.h:54,
  848. from C:/Qt/Qt5.11.3/5.11.3/mingw53_32/include/QtCore/qvariant.h:47,
  849. from C:/Qt/Qt5.11.3/5.11.3/mingw53_32/include/QtCore/qlocale.h:43,
  850. from C:/Qt/Qt5.11.3/5.11.3/mingw53_32/include/QtGui/qguiapplication.h:47,
  851. from C:/Qt14/6.1.2/mingw81_64/include/QtWidgets/qapplication.h:49,
  852. from C:/Qt14/6.1.2/mingw81_64/include/QtWidgets/QApplication:1,
  853. from ../Qt-Frameless-Window-DarkStyle/DarkStyle.h:19,
  854. from ../Qt-Frameless-Window-DarkStyle/DarkStyle.cpp:14:
  855. c:/Qt14/Tools/mingw810_64/lib/gcc/x86_64-w64-mingw32/8.1.0/include/c++/bits/unordered_map.h:2082:5: note: candidate: 'template<class _Key, class _Tp, class _Hash, class _Pred, class _Alloc> bool std::operator!=(const std::unordered_multimap<_Key1, _Tp1, _Hash1, _Pred1, _Alloc1>&, const std::unordered_multimap<_Key1, _Tp1, _Hash1, _Pred1, _Alloc1>&)'
  856. operator!=(const unordered_multimap<_Key, _Tp, _Hash, _Pred, _Alloc>& __x,
  857. ^~~~~~~~
  858. c:/Qt14/Tools/mingw810_64/lib/gcc/x86_64-w64-mingw32/8.1.0/include/c++/bits/unordered_map.h:2082:5: note: template argument deduction/substitution failed:
  859. In file included from c:/Qt14/Tools/mingw810_64/lib/gcc/x86_64-w64-mingw32/8.1.0/include/c++/filesystem:37,
  860. from C:/Qt14/6.1.2/mingw81_64/include/QtCore/qfile.h:49,
  861. from C:/Qt14/6.1.2/mingw81_64/include/QtCore/QFile:1,
  862. from ../Qt-Frameless-Window-DarkStyle/DarkStyle.h:20,
  863. from ../Qt-Frameless-Window-DarkStyle/DarkStyle.cpp:14:
  864. c:/Qt14/Tools/mingw810_64/lib/gcc/x86_64-w64-mingw32/8.1.0/include/c++/bits/fs_path.h:237:60: note: 'std::filesystem::__cxx11::path' is not derived from 'const std::unordered_multimap<_Key1, _Tp1, _Hash1, _Pred1, _Alloc1>'
  865. || (__p.has_root_name() && __p.root_name() != root_name()))
  866. ^
  867. In file included from C:/Qt/Qt5.11.3/5.11.3/mingw53_32/include/QtCore/qvariant.h:57,
  868. from C:/Qt/Qt5.11.3/5.11.3/mingw53_32/include/QtCore/qlocale.h:43,
  869. from C:/Qt/Qt5.11.3/5.11.3/mingw53_32/include/QtGui/qguiapplication.h:47,
  870. from C:/Qt14/6.1.2/mingw81_64/include/QtWidgets/qapplication.h:49,
  871. from C:/Qt14/6.1.2/mingw81_64/include/QtWidgets/QApplication:1,
  872. from ../Qt-Frameless-Window-DarkStyle/DarkStyle.h:19,
  873. from ../Qt-Frameless-Window-DarkStyle/DarkStyle.cpp:14:
  874. c:/Qt14/Tools/mingw810_64/lib/gcc/x86_64-w64-mingw32/8.1.0/include/c++/variant:997:3: note: candidate: 'template<class ... _Types> constexpr bool std::operator!=(const std::variant<_Types ...>&, const std::variant<_Types ...>&)'
  875. _VARIANT_RELATION_FUNCTION_TEMPLATE(!=, not_equal)
  876. ^~~~~~~~~~~~~~~~~~~~~~~~~~~~~~~~~~~
  877. c:/Qt14/Tools/mingw810_64/lib/gcc/x86_64-w64-mingw32/8.1.0/include/c++/variant:997:3: note: template argument deduction/substitution failed:
  878. In file included from c:/Qt14/Tools/mingw810_64/lib/gcc/x86_64-w64-mingw32/8.1.0/include/c++/filesystem:37,
  879. from C:/Qt14/6.1.2/mingw81_64/include/QtCore/qfile.h:49,
  880. from C:/Qt14/6.1.2/mingw81_64/include/QtCore/QFile:1,
  881. from ../Qt-Frameless-Window-DarkStyle/DarkStyle.h:20,
  882. from ../Qt-Frameless-Window-DarkStyle/DarkStyle.cpp:14:
  883. c:/Qt14/Tools/mingw810_64/lib/gcc/x86_64-w64-mingw32/8.1.0/include/c++/bits/fs_path.h:237:60: note: 'std::filesystem::__cxx11::path' is not derived from 'const std::variant<_Types ...>'
  884. || (__p.has_root_name() && __p.root_name() != root_name()))
  885. ^
  886. In file included from C:/Qt/Qt5.11.3/5.11.3/mingw53_32/include/QtCore/qvariant.h:57,
  887. from C:/Qt/Qt5.11.3/5.11.3/mingw53_32/include/QtCore/qlocale.h:43,
  888. from C:/Qt/Qt5.11.3/5.11.3/mingw53_32/include/QtGui/qguiapplication.h:47,
  889. from C:/Qt14/6.1.2/mingw81_64/include/QtWidgets/qapplication.h:49,
  890. from C:/Qt14/6.1.2/mingw81_64/include/QtWidgets/QApplication:1,
  891. from ../Qt-Frameless-Window-DarkStyle/DarkStyle.h:19,
  892. from ../Qt-Frameless-Window-DarkStyle/DarkStyle.cpp:14:
  893. c:/Qt14/Tools/mingw810_64/lib/gcc/x86_64-w64-mingw32/8.1.0/include/c++/variant:997:3: note: candidate: 'constexpr bool std::operator!=(std::monostate, std::monostate)'
  894. _VARIANT_RELATION_FUNCTION_TEMPLATE(!=, not_equal)
  895. ^~~~~~~~~~~~~~~~~~~~~~~~~~~~~~~~~~~
  896. c:/Qt14/Tools/mingw810_64/lib/gcc/x86_64-w64-mingw32/8.1.0/include/c++/variant:997:3: note: no known conversion for argument 1 from 'std::filesystem::__cxx11::path' to 'std::monostate'
  897. In file included from c:/Qt14/Tools/mingw810_64/lib/gcc/x86_64-w64-mingw32/8.1.0/include/c++/bits/locale_conv.h:41,
  898. from c:/Qt14/Tools/mingw810_64/lib/gcc/x86_64-w64-mingw32/8.1.0/include/c++/locale:43,
  899. from c:/Qt14/Tools/mingw810_64/lib/gcc/x86_64-w64-mingw32/8.1.0/include/c++/bits/fs_path.h:38,
  900. from c:/Qt14/Tools/mingw810_64/lib/gcc/x86_64-w64-mingw32/8.1.0/include/c++/filesystem:37,
  901. from C:/Qt14/6.1.2/mingw81_64/include/QtCore/qfile.h:49,
  902. from C:/Qt14/6.1.2/mingw81_64/include/QtCore/QFile:1,
  903. from ../Qt-Frameless-Window-DarkStyle/DarkStyle.h:20,
  904. from ../Qt-Frameless-Window-DarkStyle/DarkStyle.cpp:14:
  905. c:/Qt14/Tools/mingw810_64/lib/gcc/x86_64-w64-mingw32/8.1.0/include/c++/bits/unique_ptr.h:706:5: note: candidate: 'template<class _Tp, class _Dp, class _Up, class _Ep> bool std::operator!=(const std::unique_ptr<_Tp, _Dp>&, const std::unique_ptr<_Up, _Ep>&)'
  906. operator!=(const unique_ptr<_Tp, _Dp>& __x,
  907. ^~~~~~~~
  908. c:/Qt14/Tools/mingw810_64/lib/gcc/x86_64-w64-mingw32/8.1.0/include/c++/bits/unique_ptr.h:706:5: note: template argument deduction/substitution failed:
  909. In file included from c:/Qt14/Tools/mingw810_64/lib/gcc/x86_64-w64-mingw32/8.1.0/include/c++/filesystem:37,
  910. from C:/Qt14/6.1.2/mingw81_64/include/QtCore/qfile.h:49,
  911. from C:/Qt14/6.1.2/mingw81_64/include/QtCore/QFile:1,
  912. from ../Qt-Frameless-Window-DarkStyle/DarkStyle.h:20,
  913. from ../Qt-Frameless-Window-DarkStyle/DarkStyle.cpp:14:
  914. c:/Qt14/Tools/mingw810_64/lib/gcc/x86_64-w64-mingw32/8.1.0/include/c++/bits/fs_path.h:237:60: note: 'std::filesystem::__cxx11::path' is not derived from 'const std::unique_ptr<_Tp, _Dp>'
  915. || (__p.has_root_name() && __p.root_name() != root_name()))
  916. ^
  917. In file included from c:/Qt14/Tools/mingw810_64/lib/gcc/x86_64-w64-mingw32/8.1.0/include/c++/bits/locale_conv.h:41,
  918. from c:/Qt14/Tools/mingw810_64/lib/gcc/x86_64-w64-mingw32/8.1.0/include/c++/locale:43,
  919. from c:/Qt14/Tools/mingw810_64/lib/gcc/x86_64-w64-mingw32/8.1.0/include/c++/bits/fs_path.h:38,
  920. from c:/Qt14/Tools/mingw810_64/lib/gcc/x86_64-w64-mingw32/8.1.0/include/c++/filesystem:37,
  921. from C:/Qt14/6.1.2/mingw81_64/include/QtCore/qfile.h:49,
  922. from C:/Qt14/6.1.2/mingw81_64/include/QtCore/QFile:1,
  923. from ../Qt-Frameless-Window-DarkStyle/DarkStyle.h:20,
  924. from ../Qt-Frameless-Window-DarkStyle/DarkStyle.cpp:14:
  925. c:/Qt14/Tools/mingw810_64/lib/gcc/x86_64-w64-mingw32/8.1.0/include/c++/bits/unique_ptr.h:712:5: note: candidate: 'template<class _Tp, class _Dp> bool std::operator!=(const std::unique_ptr<_Tp, _Dp>&, std::nullptr_t)'
  926. operator!=(const unique_ptr<_Tp, _Dp>& __x, nullptr_t) noexcept
  927. ^~~~~~~~
  928. c:/Qt14/Tools/mingw810_64/lib/gcc/x86_64-w64-mingw32/8.1.0/include/c++/bits/unique_ptr.h:712:5: note: template argument deduction/substitution failed:
  929. In file included from c:/Qt14/Tools/mingw810_64/lib/gcc/x86_64-w64-mingw32/8.1.0/include/c++/filesystem:37,
  930. from C:/Qt14/6.1.2/mingw81_64/include/QtCore/qfile.h:49,
  931. from C:/Qt14/6.1.2/mingw81_64/include/QtCore/QFile:1,
  932. from ../Qt-Frameless-Window-DarkStyle/DarkStyle.h:20,
  933. from ../Qt-Frameless-Window-DarkStyle/DarkStyle.cpp:14:
  934. c:/Qt14/Tools/mingw810_64/lib/gcc/x86_64-w64-mingw32/8.1.0/include/c++/bits/fs_path.h:237:60: note: 'std::filesystem::__cxx11::path' is not derived from 'const std::unique_ptr<_Tp, _Dp>'
  935. || (__p.has_root_name() && __p.root_name() != root_name()))
  936. ^
  937. In file included from c:/Qt14/Tools/mingw810_64/lib/gcc/x86_64-w64-mingw32/8.1.0/include/c++/bits/locale_conv.h:41,
  938. from c:/Qt14/Tools/mingw810_64/lib/gcc/x86_64-w64-mingw32/8.1.0/include/c++/locale:43,
  939. from c:/Qt14/Tools/mingw810_64/lib/gcc/x86_64-w64-mingw32/8.1.0/include/c++/bits/fs_path.h:38,
  940. from c:/Qt14/Tools/mingw810_64/lib/gcc/x86_64-w64-mingw32/8.1.0/include/c++/filesystem:37,
  941. from C:/Qt14/6.1.2/mingw81_64/include/QtCore/qfile.h:49,
  942. from C:/Qt14/6.1.2/mingw81_64/include/QtCore/QFile:1,
  943. from ../Qt-Frameless-Window-DarkStyle/DarkStyle.h:20,
  944. from ../Qt-Frameless-Window-DarkStyle/DarkStyle.cpp:14:
  945. c:/Qt14/Tools/mingw810_64/lib/gcc/x86_64-w64-mingw32/8.1.0/include/c++/bits/unique_ptr.h:717:5: note: candidate: 'template<class _Tp, class _Dp> bool std::operator!=(std::nullptr_t, const std::unique_ptr<_Tp, _Dp>&)'
  946. operator!=(nullptr_t, const unique_ptr<_Tp, _Dp>& __x) noexcept
  947. ^~~~~~~~
  948. c:/Qt14/Tools/mingw810_64/lib/gcc/x86_64-w64-mingw32/8.1.0/include/c++/bits/unique_ptr.h:717:5: note: template argument deduction/substitution failed:
  949. In file included from c:/Qt14/Tools/mingw810_64/lib/gcc/x86_64-w64-mingw32/8.1.0/include/c++/filesystem:37,
  950. from C:/Qt14/6.1.2/mingw81_64/include/QtCore/qfile.h:49,
  951. from C:/Qt14/6.1.2/mingw81_64/include/QtCore/QFile:1,
  952. from ../Qt-Frameless-Window-DarkStyle/DarkStyle.h:20,
  953. from ../Qt-Frameless-Window-DarkStyle/DarkStyle.cpp:14:
  954. c:/Qt14/Tools/mingw810_64/lib/gcc/x86_64-w64-mingw32/8.1.0/include/c++/bits/fs_path.h:237:60: note: 'std::filesystem::__cxx11::path' is not derived from 'const std::unique_ptr<_Tp, _Dp>'
  955. || (__p.has_root_name() && __p.root_name() != root_name()))
  956. ^
  957. c:/Qt14/Tools/mingw810_64/lib/gcc/x86_64-w64-mingw32/8.1.0/include/c++/bits/fs_path.h: At global scope:
  958. c:/Qt14/Tools/mingw810_64/lib/gcc/x86_64-w64-mingw32/8.1.0/include/c++/bits/fs_path.h:511:18: error: specialization of 'std::filesystem::__cxx11::path::__is_encoded_char<wchar_t>' after instantiation
  959. struct path::__is_encoded_char<wchar_t> : std::true_type
  960. ^~~~~~~~~~~~~~~~~~~~~~~~~~
  961. c:/Qt14/Tools/mingw810_64/lib/gcc/x86_64-w64-mingw32/8.1.0/include/c++/bits/fs_path.h: In function 'decltype (std::filesystem::__cxx11::path(__source, std::locale::classic())) std::filesystem::__cxx11::u8path(const _Source&)':
  962. c:/Qt14/Tools/mingw810_64/lib/gcc/x86_64-w64-mingw32/8.1.0/include/c++/bits/fs_path.h:589:68: error: no matching function for call to 'u8path(std::__cxx11::basic_string<char>::const_iterator, std::__cxx11::basic_string<char>::const_iterator)'
  963. return std::filesystem::u8path(__u8str.begin(), __u8str.end());
  964. ^
  965. c:/Qt14/Tools/mingw810_64/lib/gcc/x86_64-w64-mingw32/8.1.0/include/c++/bits/fs_path.h:584:5: note: candidate: 'template<class _Source> decltype (std::filesystem::__cxx11::path(__source, std::locale::classic())) std::filesystem::__cxx11::u8path(const _Source&)'
  966. u8path(const _Source& __source)
  967. ^~~~~~
  968. c:/Qt14/Tools/mingw810_64/lib/gcc/x86_64-w64-mingw32/8.1.0/include/c++/bits/fs_path.h:584:5: note: template argument deduction/substitution failed:
  969. c:/Qt14/Tools/mingw810_64/lib/gcc/x86_64-w64-mingw32/8.1.0/include/c++/bits/fs_path.h:589:68: note: candidate expects 1 argument, 2 provided
  970. return std::filesystem::u8path(__u8str.begin(), __u8str.end());
  971. ^
  972. c:/Qt14/Tools/mingw810_64/lib/gcc/x86_64-w64-mingw32/8.1.0/include/c++/bits/fs_path.h: In function 'decltype (std::filesystem::__cxx11::path(__first, __last, std::locale::classic())) std::filesystem::__cxx11::u8path(_InputIterator, _InputIterator)':
  973. c:/Qt14/Tools/mingw810_64/lib/gcc/x86_64-w64-mingw32/8.1.0/include/c++/bits/fs_path.h:601:20: error: 'value_type' was not declared in this scope
  974. codecvt_utf8<value_type> __cvt;
  975. ^~~~~~~~~~
  976. c:/Qt14/Tools/mingw810_64/lib/gcc/x86_64-w64-mingw32/8.1.0/include/c++/bits/fs_path.h:601:20: note: suggested alternative: 'false_type'
  977. codecvt_utf8<value_type> __cvt;
  978. ^~~~~~~~~~
  979. false_type
  980. c:/Qt14/Tools/mingw810_64/lib/gcc/x86_64-w64-mingw32/8.1.0/include/c++/bits/fs_path.h:601:30: error: template argument 1 is invalid
  981. codecvt_utf8<value_type> __cvt;
  982. ^
  983. c:/Qt14/Tools/mingw810_64/lib/gcc/x86_64-w64-mingw32/8.1.0/include/c++/bits/fs_path.h:602:7: error: 'string_type' was not declared in this scope
  984. string_type __tmp;
  985. ^~~~~~~~~~~
  986. c:/Qt14/Tools/mingw810_64/lib/gcc/x86_64-w64-mingw32/8.1.0/include/c++/bits/fs_path.h:602:7: note: suggested alternative: 'string_view'
  987. string_type __tmp;
  988. ^~~~~~~~~~~
  989. string_view
  990. c:/Qt14/Tools/mingw810_64/lib/gcc/x86_64-w64-mingw32/8.1.0/include/c++/bits/fs_path.h:603:45: error: '__tmp' was not declared in this scope
  991. if (__str_codecvt_in(__first, __last, __tmp, __cvt))
  992. ^~~~~
  993. c:/Qt14/Tools/mingw810_64/lib/gcc/x86_64-w64-mingw32/8.1.0/include/c++/bits/fs_path.h:603:45: note: suggested alternative: 'rmtmp'
  994. if (__str_codecvt_in(__first, __last, __tmp, __cvt))
  995. ^~~~~
  996. rmtmp
  997. c:/Qt14/Tools/mingw810_64/lib/gcc/x86_64-w64-mingw32/8.1.0/include/c++/bits/fs_path.h: In member function 'int std::filesystem::__cxx11::path::compare(const string_type&) const':
  998. c:/Qt14/Tools/mingw810_64/lib/gcc/x86_64-w64-mingw32/8.1.0/include/c++/bits/fs_path.h:1014:72: error: no matching function for call to 'std::filesystem::__cxx11::path::path(const string_type&)'
  999. path::compare(const string_type& __s) const { return compare(path(__s)); }
  1000. ^
  1001. c:/Qt14/Tools/mingw810_64/lib/gcc/x86_64-w64-mingw32/8.1.0/include/c++/bits/fs_path.h:402:5: note: candidate: 'std::filesystem::__cxx11::path::path(std::filesystem::__cxx11::path::string_type, std::filesystem::__cxx11::path::_Type)'
  1002. path(string_type __str, _Type __type) : _M_pathname(__str), _M_type(__type)
  1003. ^~~~
  1004. c:/Qt14/Tools/mingw810_64/lib/gcc/x86_64-w64-mingw32/8.1.0/include/c++/bits/fs_path.h:402:5: note: candidate expects 2 arguments, 1 provided
  1005. c:/Qt14/Tools/mingw810_64/lib/gcc/x86_64-w64-mingw32/8.1.0/include/c++/bits/fs_path.h:202:7: note: candidate: 'template<class _InputIterator, class _Require, class _Require2> std::filesystem::__cxx11::path::path(_InputIterator, _InputIterator, const std::locale&, std::filesystem::__cxx11::path::format)'
  1006. path(_InputIterator __first, _InputIterator __last, const locale& __loc,
  1007. ^~~~
  1008. c:/Qt14/Tools/mingw810_64/lib/gcc/x86_64-w64-mingw32/8.1.0/include/c++/bits/fs_path.h:202:7: note: template argument deduction/substitution failed:
  1009. c:/Qt14/Tools/mingw810_64/lib/gcc/x86_64-w64-mingw32/8.1.0/include/c++/bits/fs_path.h:1014:72: note: candidate expects 4 arguments, 1 provided
  1010. path::compare(const string_type& __s) const { return compare(path(__s)); }
  1011. ^
  1012. c:/Qt14/Tools/mingw810_64/lib/gcc/x86_64-w64-mingw32/8.1.0/include/c++/bits/fs_path.h:194:7: note: candidate: 'template<class _Source, class _Require, class _Require2> std::filesystem::__cxx11::path::path(const _Source&, const std::locale&, std::filesystem::__cxx11::path::format)'
  1013. path(_Source const& __source, const locale& __loc, format = auto_format)
  1014. ^~~~
  1015. c:/Qt14/Tools/mingw810_64/lib/gcc/x86_64-w64-mingw32/8.1.0/include/c++/bits/fs_path.h:194:7: note: template argument deduction/substitution failed:
  1016. c:/Qt14/Tools/mingw810_64/lib/gcc/x86_64-w64-mingw32/8.1.0/include/c++/bits/fs_path.h:1014:72: note: candidate expects 3 arguments, 1 provided
  1017. path::compare(const string_type& __s) const { return compare(path(__s)); }
  1018. ^
  1019. c:/Qt14/Tools/mingw810_64/lib/gcc/x86_64-w64-mingw32/8.1.0/include/c++/bits/fs_path.h:187:7: note: candidate: 'template<class _InputIterator, class _Require> std::filesystem::__cxx11::path::path(_InputIterator, _InputIterator, std::filesystem::__cxx11::path::format)'
  1020. path(_InputIterator __first, _InputIterator __last, format = auto_format)
  1021. ^~~~
  1022. c:/Qt14/Tools/mingw810_64/lib/gcc/x86_64-w64-mingw32/8.1.0/include/c++/bits/fs_path.h:187:7: note: template argument deduction/substitution failed:
  1023. c:/Qt14/Tools/mingw810_64/lib/gcc/x86_64-w64-mingw32/8.1.0/include/c++/bits/fs_path.h:1014:72: note: candidate expects 3 arguments, 1 provided
  1024. path::compare(const string_type& __s) const { return compare(path(__s)); }
  1025. ^
  1026. c:/Qt14/Tools/mingw810_64/lib/gcc/x86_64-w64-mingw32/8.1.0/include/c++/bits/fs_path.h:180:7: note: candidate: 'template<class _Source, class _Require> std::filesystem::__cxx11::path::path(const _Source&, std::filesystem::__cxx11::path::format)'
  1027. path(_Source const& __source, format = auto_format)
  1028. ^~~~
  1029. c:/Qt14/Tools/mingw810_64/lib/gcc/x86_64-w64-mingw32/8.1.0/include/c++/bits/fs_path.h:180:7: note: template argument deduction/substitution failed:
  1030. c:/Qt14/Tools/mingw810_64/lib/gcc/x86_64-w64-mingw32/8.1.0/include/c++/bits/fs_path.h:174:5: note: candidate: 'std::filesystem::__cxx11::path::path(std::filesystem::__cxx11::path::string_type&&, std::filesystem::__cxx11::path::format)' <near match>
  1031. path(string_type&& __source, format = auto_format)
  1032. ^~~~
  1033. c:/Qt14/Tools/mingw810_64/lib/gcc/x86_64-w64-mingw32/8.1.0/include/c++/bits/fs_path.h:174:5: note: conversion of argument 1 would be ill-formed:
  1034. c:/Qt14/Tools/mingw810_64/lib/gcc/x86_64-w64-mingw32/8.1.0/include/c++/bits/fs_path.h:1014:69: error: cannot bind rvalue reference of type 'std::filesystem::__cxx11::path::string_type&&' {aka 'std::__cxx11::basic_string<wchar_t>&&'} to lvalue of type 'const string_type' {aka 'const std::__cxx11::basic_string<wchar_t>'}
  1035. path::compare(const string_type& __s) const { return compare(path(__s)); }
  1036. ^~~
  1037. c:/Qt14/Tools/mingw810_64/lib/gcc/x86_64-w64-mingw32/8.1.0/include/c++/bits/fs_path.h:167:5: note: candidate: 'std::filesystem::__cxx11::path::path(std::filesystem::__cxx11::path&&)'
  1038. path(path&& __p) noexcept
  1039. ^~~~
  1040. c:/Qt14/Tools/mingw810_64/lib/gcc/x86_64-w64-mingw32/8.1.0/include/c++/bits/fs_path.h:167:5: note: no known conversion for argument 1 from 'const string_type' {aka 'const std::__cxx11::basic_string<wchar_t>'} to 'std::filesystem::__cxx11::path&&'
  1041. c:/Qt14/Tools/mingw810_64/lib/gcc/x86_64-w64-mingw32/8.1.0/include/c++/bits/fs_path.h:165:5: note: candidate: 'std::filesystem::__cxx11::path::path(const std::filesystem::__cxx11::path&)'
  1042. path(const path& __p) = default;
  1043. ^~~~
  1044. c:/Qt14/Tools/mingw810_64/lib/gcc/x86_64-w64-mingw32/8.1.0/include/c++/bits/fs_path.h:165:5: note: no known conversion for argument 1 from 'const string_type' {aka 'const std::__cxx11::basic_string<wchar_t>'} to 'const std::filesystem::__cxx11::path&'
  1045. c:/Qt14/Tools/mingw810_64/lib/gcc/x86_64-w64-mingw32/8.1.0/include/c++/bits/fs_path.h:163:5: note: candidate: 'std::filesystem::__cxx11::path::path()'
  1046. path() noexcept { }
  1047. ^~~~
  1048. c:/Qt14/Tools/mingw810_64/lib/gcc/x86_64-w64-mingw32/8.1.0/include/c++/bits/fs_path.h:163:5: note: candidate expects 0 arguments, 1 provided
  1049. c:/Qt14/Tools/mingw810_64/lib/gcc/x86_64-w64-mingw32/8.1.0/include/c++/bits/fs_path.h: In member function 'int std::filesystem::__cxx11::path::compare(std::basic_string_view<wchar_t>) const':
  1050. c:/Qt14/Tools/mingw810_64/lib/gcc/x86_64-w64-mingw32/8.1.0/include/c++/bits/fs_path.h:1021:28: error: no matching function for call to 'std::filesystem::__cxx11::path::path(std::basic_string_view<wchar_t>&)'
  1051. { return compare(path(__s)); }
  1052. ^
  1053. c:/Qt14/Tools/mingw810_64/lib/gcc/x86_64-w64-mingw32/8.1.0/include/c++/bits/fs_path.h:402:5: note: candidate: 'std::filesystem::__cxx11::path::path(std::filesystem::__cxx11::path::string_type, std::filesystem::__cxx11::path::_Type)'
  1054. path(string_type __str, _Type __type) : _M_pathname(__str), _M_type(__type)
  1055. ^~~~
  1056. c:/Qt14/Tools/mingw810_64/lib/gcc/x86_64-w64-mingw32/8.1.0/include/c++/bits/fs_path.h:402:5: note: candidate expects 2 arguments, 1 provided
  1057. c:/Qt14/Tools/mingw810_64/lib/gcc/x86_64-w64-mingw32/8.1.0/include/c++/bits/fs_path.h:202:7: note: candidate: 'template<class _InputIterator, class _Require, class _Require2> std::filesystem::__cxx11::path::path(_InputIterator, _InputIterator, const std::locale&, std::filesystem::__cxx11::path::format)'
  1058. path(_InputIterator __first, _InputIterator __last, const locale& __loc,
  1059. ^~~~
  1060. c:/Qt14/Tools/mingw810_64/lib/gcc/x86_64-w64-mingw32/8.1.0/include/c++/bits/fs_path.h:202:7: note: template argument deduction/substitution failed:
  1061. c:/Qt14/Tools/mingw810_64/lib/gcc/x86_64-w64-mingw32/8.1.0/include/c++/bits/fs_path.h:1021:28: note: candidate expects 4 arguments, 1 provided
  1062. { return compare(path(__s)); }
  1063. ^
  1064. c:/Qt14/Tools/mingw810_64/lib/gcc/x86_64-w64-mingw32/8.1.0/include/c++/bits/fs_path.h:194:7: note: candidate: 'template<class _Source, class _Require, class _Require2> std::filesystem::__cxx11::path::path(const _Source&, const std::locale&, std::filesystem::__cxx11::path::format)'
  1065. path(_Source const& __source, const locale& __loc, format = auto_format)
  1066. ^~~~
  1067. c:/Qt14/Tools/mingw810_64/lib/gcc/x86_64-w64-mingw32/8.1.0/include/c++/bits/fs_path.h:194:7: note: template argument deduction/substitution failed:
  1068. c:/Qt14/Tools/mingw810_64/lib/gcc/x86_64-w64-mingw32/8.1.0/include/c++/bits/fs_path.h:1021:28: note: candidate expects 3 arguments, 1 provided
  1069. { return compare(path(__s)); }
  1070. ^
  1071. c:/Qt14/Tools/mingw810_64/lib/gcc/x86_64-w64-mingw32/8.1.0/include/c++/bits/fs_path.h:187:7: note: candidate: 'template<class _InputIterator, class _Require> std::filesystem::__cxx11::path::path(_InputIterator, _InputIterator, std::filesystem::__cxx11::path::format)'
  1072. path(_InputIterator __first, _InputIterator __last, format = auto_format)
  1073. ^~~~
  1074. c:/Qt14/Tools/mingw810_64/lib/gcc/x86_64-w64-mingw32/8.1.0/include/c++/bits/fs_path.h:187:7: note: template argument deduction/substitution failed:
  1075. c:/Qt14/Tools/mingw810_64/lib/gcc/x86_64-w64-mingw32/8.1.0/include/c++/bits/fs_path.h:1021:28: note: candidate expects 3 arguments, 1 provided
  1076. { return compare(path(__s)); }
  1077. ^
  1078. c:/Qt14/Tools/mingw810_64/lib/gcc/x86_64-w64-mingw32/8.1.0/include/c++/bits/fs_path.h:180:7: note: candidate: 'template<class _Source, class _Require> std::filesystem::__cxx11::path::path(const _Source&, std::filesystem::__cxx11::path::format)'
  1079. path(_Source const& __source, format = auto_format)
  1080. ^~~~
  1081. c:/Qt14/Tools/mingw810_64/lib/gcc/x86_64-w64-mingw32/8.1.0/include/c++/bits/fs_path.h:180:7: note: template argument deduction/substitution failed:
  1082. c:/Qt14/Tools/mingw810_64/lib/gcc/x86_64-w64-mingw32/8.1.0/include/c++/bits/fs_path.h:174:5: note: candidate: 'std::filesystem::__cxx11::path::path(std::filesystem::__cxx11::path::string_type&&, std::filesystem::__cxx11::path::format)'
  1083. path(string_type&& __source, format = auto_format)
  1084. ^~~~
  1085. c:/Qt14/Tools/mingw810_64/lib/gcc/x86_64-w64-mingw32/8.1.0/include/c++/bits/fs_path.h:174:5: note: no known conversion for argument 1 from 'std::basic_string_view<wchar_t>' to 'std::filesystem::__cxx11::path::string_type&&' {aka 'std::__cxx11::basic_string<wchar_t>&&'}
  1086. c:/Qt14/Tools/mingw810_64/lib/gcc/x86_64-w64-mingw32/8.1.0/include/c++/bits/fs_path.h:167:5: note: candidate: 'std::filesystem::__cxx11::path::path(std::filesystem::__cxx11::path&&)'
  1087. path(path&& __p) noexcept
  1088. ^~~~
  1089. c:/Qt14/Tools/mingw810_64/lib/gcc/x86_64-w64-mingw32/8.1.0/include/c++/bits/fs_path.h:167:5: note: no known conversion for argument 1 from 'std::basic_string_view<wchar_t>' to 'std::filesystem::__cxx11::path&&'
  1090. c:/Qt14/Tools/mingw810_64/lib/gcc/x86_64-w64-mingw32/8.1.0/include/c++/bits/fs_path.h:165:5: note: candidate: 'std::filesystem::__cxx11::path::path(const std::filesystem::__cxx11::path&)'
  1091. path(const path& __p) = default;
  1092. ^~~~
  1093. c:/Qt14/Tools/mingw810_64/lib/gcc/x86_64-w64-mingw32/8.1.0/include/c++/bits/fs_path.h:165:5: note: no known conversion for argument 1 from 'std::basic_string_view<wchar_t>' to 'const std::filesystem::__cxx11::path&'
  1094. c:/Qt14/Tools/mingw810_64/lib/gcc/x86_64-w64-mingw32/8.1.0/include/c++/bits/fs_path.h:163:5: note: candidate: 'std::filesystem::__cxx11::path::path()'
  1095. path() noexcept { }
  1096. ^~~~
  1097. c:/Qt14/Tools/mingw810_64/lib/gcc/x86_64-w64-mingw32/8.1.0/include/c++/bits/fs_path.h:163:5: note: candidate expects 0 arguments, 1 provided
  1098. In file included from C:/Qt14/6.1.2/mingw81_64/include/QtGui/QFont:1,
  1099. from ../Qt-Frameless-Window-DarkStyle/DarkStyle.h:21,
  1100. from ../Qt-Frameless-Window-DarkStyle/DarkStyle.cpp:14:
  1101. C:/Qt14/6.1.2/mingw81_64/include/QtGui/qfont.h: At global scope:
  1102. C:/Qt14/6.1.2/mingw81_64/include/QtGui/qfont.h:256:57: error: expected ';' at end of member declaration
  1103. QT_MOVE_ASSIGNMENT_OPERATOR_IMPL_VIA_PURE_SWAP(QFont)
  1104. ^
  1105. ;
  1106. C:/Qt14/6.1.2/mingw81_64/include/QtGui/qfont.h:280:33: error: expected identifier before string constant
  1107. QT_DEPRECATED_VERSION_X_6_0("Use setWeight() instead") void setLegacyWeight(int legacyWeight);
  1108. ^~~~~~~~~~~~~~~~~~~~~~~~~
  1109. C:/Qt14/6.1.2/mingw81_64/include/QtGui/qfont.h:280:33: error: expected ',' or '...' before string constant
  1110. C:/Qt14/6.1.2/mingw81_64/include/QtGui/qfont.h:280:58: error: expected ';' at end of member declaration
  1111. QT_DEPRECATED_VERSION_X_6_0("Use setWeight() instead") void setLegacyWeight(int legacyWeight);
  1112. ^
  1113. ;
  1114. C:/Qt14/6.1.2/mingw81_64/include/QtGui/qfont.h:281:33: error: expected identifier before string constant
  1115. QT_DEPRECATED_VERSION_X_6_0("Use weight() instead") int legacyWeight() const;
  1116. ^~~~~~~~~~~~~~~~~~~~~~
  1117. C:/Qt14/6.1.2/mingw81_64/include/QtGui/qfont.h:281:33: error: expected ',' or '...' before string constant
  1118. C:/Qt14/6.1.2/mingw81_64/include/QtGui/qfont.h:281:55: error: expected ';' at end of member declaration
  1119. QT_DEPRECATED_VERSION_X_6_0("Use weight() instead") int legacyWeight() const;
  1120. ^
  1121. ;
  1122. C:/Qt14/6.1.2/mingw81_64/include/QtGui/qfont.h:281:5: error: 'int QFont::QT_DEPRECATED_VERSION_X_6_0(int)' cannot be overloaded with 'int QFont::QT_DEPRECATED_VERSION_X_6_0(int)'
  1123. QT_DEPRECATED_VERSION_X_6_0("Use weight() instead") int legacyWeight() const;
  1124. ^~~~~~~~~~~~~~~~~~~~~~~~~~~
  1125. C:/Qt14/6.1.2/mingw81_64/include/QtGui/qfont.h:280:5: note: previous declaration 'int QFont::QT_DEPRECATED_VERSION_X_6_0(int)'
  1126. QT_DEPRECATED_VERSION_X_6_0("Use setWeight() instead") void setLegacyWeight(int legacyWeight);
  1127. ^~~~~~~~~~~~~~~~~~~~~~~~~~~
  1128. make.exe[2]: *** [build/Debug/MinGW64__Qt_6.1.2-Windows/DarkStyle.o] Error 1
  1129. make.exe[2]: Leaving directory `/c/Users/Patron/Desktop/Code Projects/Sistema_Silo'
  1130. make.exe[1]: *** [.build-conf] Error 2
  1131. make.exe[1]: Leaving directory `/c/Users/Patron/Desktop/Code Projects/Sistema_Silo'
  1132. make.exe": *** [.build-impl] Error 2
  1133.  
  1134. BUILD FAILED (exit value 2, total time: 22s)
  1135.  
Advertisement
Add Comment
Please, Sign In to add comment