tterrag1098

Untitled

Dec 7th, 2016
162
0
Never
Not a member of Pastebin yet? Sign Up, it unlocks many cool features!
text 16.95 KB | None | 0 0
  1. son-2.2.4.jar is up-to-date (lastModified: Mon May 13 17:56:50 EDT 2013).
  2. Cached resource https://libraries.minecraft.net/com/mojang/authlib/1.5.24/authli
  3. b-1.5.24.jar is up-to-date (lastModified: Wed Sep 14 05:40:54 EDT 2016).
  4. Cached resource https://libraries.minecraft.net/com/mojang/realms/1.10.4/realms-
  5. 1.10.4.jar is up-to-date (lastModified: Wed Nov 16 09:39:32 EST 2016).
  6. Cached resource https://repo1.maven.org/maven2/org/apache/commons/commons-compre
  7. ss/1.8.1/commons-compress-1.8.1.jar is up-to-date (lastModified: Fri May 09 15:1
  8. 7:52 EDT 2014).
  9. Cached resource https://repo1.maven.org/maven2/org/apache/httpcomponents/httpcli
  10. ent/4.3.3/httpclient-4.3.3.jar is up-to-date (lastModified: Sat Feb 22 09:05:30
  11. EST 2014).
  12. Cached resource https://repo1.maven.org/maven2/commons-logging/commons-logging/1
  13. .1.3/commons-logging-1.1.3.jar is up-to-date (lastModified: Thu May 16 16:05:21
  14. EDT 2013).
  15. Cached resource https://repo1.maven.org/maven2/org/apache/httpcomponents/httpcor
  16. e/4.3.2/httpcore-4.3.2.jar is up-to-date (lastModified: Wed Feb 12 15:44:06 EST
  17. 2014).
  18. Cached resource https://libraries.minecraft.net/it/unimi/dsi/fastutil/7.0.12_moj
  19. ang/fastutil-7.0.12_mojang.jar is up-to-date (lastModified: Wed Apr 13 09:09:26
  20. EDT 2016).
  21. Cached resource https://repo1.maven.org/maven2/org/apache/logging/log4j/log4j-ap
  22. i/2.0-beta9/log4j-api-2.0-beta9.jar is up-to-date (lastModified: Sat Sep 14 10:1
  23. 6:57 EDT 2013).
  24. Cached resource https://repo1.maven.org/maven2/org/apache/logging/log4j/log4j-co
  25. re/2.0-beta9/log4j-core-2.0-beta9.jar is up-to-date (lastModified: Sat Sep 14 10
  26. :20:45 EDT 2013).
  27. Cached resource https://libraries.minecraft.net/net/minecraft/launchwrapper/1.12
  28. /launchwrapper-1.12.jar is up-to-date (lastModified: Sat Jun 20 13:11:42 EDT 201
  29. 5).
  30. Cached resource https://repo1.maven.org/maven2/jline/jline/2.13/jline-2.13.jar i
  31. s up-to-date (lastModified: Mon Aug 10 12:38:54 EDT 2015).
  32. Cached resource https://repo1.maven.org/maven2/org/ow2/asm/asm-debug-all/5.0.3/a
  33. sm-debug-all-5.0.3.jar is up-to-date (lastModified: Sat May 24 04:31:24 EDT 2014
  34. ).
  35. Cached resource https://repo1.maven.org/maven2/com/typesafe/akka/akka-actor_2.11
  36. /2.3.3/akka-actor_2.11-2.3.3.jar is up-to-date (lastModified: Tue May 20 15:12:3
  37. 0 EDT 2014).
  38. Cached resource https://repo1.maven.org/maven2/com/typesafe/config/1.2.1/config-
  39. 1.2.1.jar is up-to-date (lastModified: Fri May 02 10:54:14 EDT 2014).
  40. Cached resource https://repo1.maven.org/maven2/org/scala-lang/scala-actors-migra
  41. tion_2.11/1.1.0/scala-actors-migration_2.11-1.1.0.jar is up-to-date (lastModifie
  42. d: Wed Apr 16 05:28:46 EDT 2014).
  43. Cached resource https://repo1.maven.org/maven2/org/scala-lang/scala-compiler/2.1
  44. 1.1/scala-compiler-2.11.1.jar is up-to-date (lastModified: Tue May 20 04:03:06 E
  45. DT 2014).
  46. Cached resource https://repo1.maven.org/maven2/org/scala-lang/plugins/scala-cont
  47. inuations-library_2.11/1.0.2/scala-continuations-library_2.11-1.0.2.jar is up-to
  48. -date (lastModified: Tue May 20 04:13:27 EDT 2014).
  49. Cached resource https://repo1.maven.org/maven2/org/scala-lang/plugins/scala-cont
  50. inuations-plugin_2.11.1/1.0.2/scala-continuations-plugin_2.11.1-1.0.2.jar is up-
  51. to-date (lastModified: Tue May 20 04:13:50 EDT 2014).
  52. Cached resource https://repo1.maven.org/maven2/org/scala-lang/scala-library/2.11
  53. .1/scala-library-2.11.1.jar is up-to-date (lastModified: Tue May 20 04:02:18 EDT
  54. 2014).
  55. Cached resource https://repo1.maven.org/maven2/org/scala-lang/modules/scala-pars
  56. er-combinators_2.11/1.0.1/scala-parser-combinators_2.11-1.0.1.jar is up-to-date
  57. (lastModified: Wed Apr 16 05:22:19 EDT 2014).
  58. Cached resource https://repo1.maven.org/maven2/org/scala-lang/scala-reflect/2.11
  59. .1/scala-reflect-2.11.1.jar is up-to-date (lastModified: Tue May 20 04:02:45 EDT
  60. 2014).
  61. Cached resource https://repo1.maven.org/maven2/org/scala-lang/modules/scala-swin
  62. g_2.11/1.0.1/scala-swing_2.11-1.0.1.jar is up-to-date (lastModified: Wed Apr 16
  63. 05:26:26 EDT 2014).
  64. Cached resource https://repo1.maven.org/maven2/org/scala-lang/modules/scala-xml_
  65. 2.11/1.0.2/scala-xml_2.11-1.0.2.jar is up-to-date (lastModified: Tue May 20 04:1
  66. 0:45 EDT 2014).
  67. Cached resource https://libraries.minecraft.net/lzma/lzma/0.0.1/lzma-0.0.1.jar i
  68. s up-to-date (lastModified: Tue Nov 26 10:58:34 EST 2013).
  69. Cached resource https://libraries.minecraft.net/com/paulscode/codecjorbis/201010
  70. 23/codecjorbis-20101023.jar is up-to-date (lastModified: Tue Nov 26 10:59:42 EST
  71. 2013).
  72. Cached resource https://libraries.minecraft.net/com/paulscode/codecwav/20101023/
  73. codecwav-20101023.jar is up-to-date (lastModified: Tue Nov 26 10:59:43 EST 2013)
  74. .
  75. Cached resource https://libraries.minecraft.net/com/paulscode/libraryjavasound/2
  76. 0101123/libraryjavasound-20101123.jar is up-to-date (lastModified: Tue Nov 26 10
  77. :59:44 EST 2013).
  78. Cached resource https://libraries.minecraft.net/com/paulscode/librarylwjglopenal
  79. /20100824/librarylwjglopenal-20100824.jar is up-to-date (lastModified: Tue Nov 2
  80. 6 10:59:46 EST 2013).
  81. Cached resource https://libraries.minecraft.net/com/paulscode/soundsystem/201201
  82. 07/soundsystem-20120107.jar is up-to-date (lastModified: Tue Nov 26 10:59:47 EST
  83. 2013).
  84. Cached resource https://repo1.maven.org/maven2/net/java/jinput/jinput/2.0.5/jinp
  85. ut-2.0.5.jar is up-to-date (lastModified: Wed Mar 23 14:18:49 EDT 2011).
  86. Cached resource https://libraries.minecraft.net/org/lwjgl/lwjgl/lwjgl/2.9.4-nigh
  87. tly-20150209/lwjgl-2.9.4-nightly-20150209.jar is up-to-date (lastModified: Tue F
  88. eb 10 02:43:47 EST 2015).
  89. Cached resource https://libraries.minecraft.net/org/lwjgl/lwjgl/lwjgl_util/2.9.4
  90. -nightly-20150209/lwjgl_util-2.9.4-nightly-20150209.jar is up-to-date (lastModif
  91. ied: Tue Feb 10 02:43:46 EST 2015).
  92. Cached resource https://libraries.minecraft.net/java3d/vecmath/1.5.2/vecmath-1.5
  93. .2.jar is up-to-date (lastModified: Sun Mar 09 12:44:53 EDT 2014).
  94. Cached resource https://repo1.maven.org/maven2/org/fusesource/jansi/jansi/1.11/j
  95. ansi-1.11.jar is up-to-date (lastModified: Mon May 13 09:21:22 EDT 2013).
  96. Cached resource https://repo1.maven.org/maven2/org/scala-lang/scala-actors/2.11.
  97. 0/scala-actors-2.11.0.jar is up-to-date (lastModified: Wed Apr 16 05:14:16 EDT 2
  98. 014).
  99. Cached resource https://repo1.maven.org/maven2/net/java/jinput/jinput-platform/2
  100. .0.5/jinput-platform-2.0.5-natives-linux.jar is up-to-date (lastModified: Wed Ma
  101. r 23 14:19:22 EDT 2011).
  102. Cached resource https://repo1.maven.org/maven2/net/java/jinput/jinput-platform/2
  103. .0.5/jinput-platform-2.0.5-natives-windows.jar is up-to-date (lastModified: Wed
  104. Mar 23 14:19:11 EDT 2011).
  105. Cached resource https://repo1.maven.org/maven2/net/java/jinput/jinput-platform/2
  106. .0.5/jinput-platform-2.0.5-natives-osx.jar is up-to-date (lastModified: Wed Mar
  107. 23 14:19:26 EDT 2011).
  108. Cached resource https://libraries.minecraft.net/org/lwjgl/lwjgl/lwjgl-platform/2
  109. .9.4-nightly-20150209/lwjgl-platform-2.9.4-nightly-20150209-natives-windows.jar
  110. is up-to-date (lastModified: Tue Feb 10 02:43:46 EST 2015).
  111. Cached resource https://libraries.minecraft.net/org/lwjgl/lwjgl/lwjgl-platform/2
  112. .9.4-nightly-20150209/lwjgl-platform-2.9.4-nightly-20150209-natives-linux.jar is
  113. up-to-date (lastModified: Tue Feb 10 02:43:44 EST 2015).
  114. Cached resource https://libraries.minecraft.net/org/lwjgl/lwjgl/lwjgl-platform/2
  115. .9.4-nightly-20150209/lwjgl-platform-2.9.4-nightly-20150209-natives-osx.jar is u
  116. p-to-date (lastModified: Tue Feb 10 02:43:45 EST 2015).
  117. [ant:javac] Compiling 2646 source files to X:\Development\MC_1_11\Chisel\build\t
  118. mp\recompileMc\compiled
  119. [ant:javac] warning: [options] bootstrap class path not set in conjunction with
  120. -source 1.6
  121. [ant:javac] X:\Development\MC_1_11\Chisel\build\tmp\recompileMc\sources\net\mine
  122. craft\block\Block.java:2283: error: method addInformation(ItemStack,EntityPlayer
  123. ,List<String>,boolean) is already defined in class Block
  124. [ant:javac] public void addInformation(ItemStack stack, EntityPlayer player,
  125. List<String> tooltip, boolean advanced)
  126. [ant:javac] ^
  127. [ant:javac] Note: Some input files use or override a deprecated API.
  128. [ant:javac] Note: Recompile with -Xlint:deprecation for details.
  129. [ant:javac] Note: Some input files use unchecked or unsafe operations.
  130. [ant:javac] Note: Recompile with -Xlint:unchecked for details.
  131. [ant:javac] 1 error
  132. [ant:javac] 1 warning
  133. :recompileMc FAILED
  134. :recompileMc (Thread[main,5,main]) completed. Took 28.51 secs.
  135.  
  136. FAILURE: Build failed with an exception.
  137.  
  138. * What went wrong:
  139. Execution failed for task ':recompileMc'.
  140. > Compile failed; see the compiler error output for details.
  141.  
  142. * Try:
  143. Run with --debug option to get more log output.
  144.  
  145. * Exception is:
  146. org.gradle.api.tasks.TaskExecutionException: Execution failed for task ':recompi
  147. leMc'.
  148. at org.gradle.api.internal.tasks.execution.ExecuteActionsTaskExecuter.ex
  149. ecuteActions(ExecuteActionsTaskExecuter.java:84)
  150. at org.gradle.api.internal.tasks.execution.ExecuteActionsTaskExecuter.ex
  151. ecute(ExecuteActionsTaskExecuter.java:55)
  152. at org.gradle.api.internal.tasks.execution.SkipUpToDateTaskExecuter.exec
  153. ute(SkipUpToDateTaskExecuter.java:61)
  154. at org.gradle.api.internal.tasks.execution.ValidatingTaskExecuter.execut
  155. e(ValidatingTaskExecuter.java:58)
  156. at org.gradle.api.internal.tasks.execution.SkipEmptySourceFilesTaskExecu
  157. ter.execute(SkipEmptySourceFilesTaskExecuter.java:88)
  158. at org.gradle.api.internal.tasks.execution.ResolveTaskArtifactStateTaskE
  159. xecuter.execute(ResolveTaskArtifactStateTaskExecuter.java:45)
  160. at org.gradle.api.internal.tasks.execution.SkipTaskWithNoActionsExecuter
  161. .execute(SkipTaskWithNoActionsExecuter.java:51)
  162. at org.gradle.api.internal.tasks.execution.SkipOnlyIfTaskExecuter.execut
  163. e(SkipOnlyIfTaskExecuter.java:54)
  164. at org.gradle.api.internal.tasks.execution.ExecuteAtMostOnceTaskExecuter
  165. .execute(ExecuteAtMostOnceTaskExecuter.java:43)
  166. at org.gradle.api.internal.tasks.execution.CatchExceptionTaskExecuter.ex
  167. ecute(CatchExceptionTaskExecuter.java:34)
  168. at org.gradle.execution.taskgraph.DefaultTaskGraphExecuter$EventFiringTa
  169. skWorker.execute(DefaultTaskGraphExecuter.java:233)
  170. at org.gradle.execution.taskgraph.DefaultTaskGraphExecuter$EventFiringTa
  171. skWorker.execute(DefaultTaskGraphExecuter.java:215)
  172. at org.gradle.execution.taskgraph.AbstractTaskPlanExecutor$TaskExecutorW
  173. orker.processTask(AbstractTaskPlanExecutor.java:74)
  174. at org.gradle.execution.taskgraph.AbstractTaskPlanExecutor$TaskExecutorW
  175. orker.run(AbstractTaskPlanExecutor.java:55)
  176. at org.gradle.execution.taskgraph.DefaultTaskPlanExecutor.process(Defaul
  177. tTaskPlanExecutor.java:32)
  178. at org.gradle.execution.taskgraph.DefaultTaskGraphExecuter.execute(Defau
  179. ltTaskGraphExecuter.java:113)
  180. at org.gradle.execution.SelectedTaskExecutionAction.execute(SelectedTask
  181. ExecutionAction.java:37)
  182. at org.gradle.execution.DefaultBuildExecuter.execute(DefaultBuildExecute
  183. r.java:37)
  184. at org.gradle.execution.DefaultBuildExecuter.access$000(DefaultBuildExec
  185. uter.java:23)
  186. at org.gradle.execution.DefaultBuildExecuter$1.proceed(DefaultBuildExecu
  187. ter.java:43)
  188. at org.gradle.execution.DryRunBuildExecutionAction.execute(DryRunBuildEx
  189. ecutionAction.java:32)
  190. at org.gradle.execution.DefaultBuildExecuter.execute(DefaultBuildExecute
  191. r.java:37)
  192. at org.gradle.execution.DefaultBuildExecuter.execute(DefaultBuildExecute
  193. r.java:30)
  194. at org.gradle.initialization.DefaultGradleLauncher$4.run(DefaultGradleLa
  195. uncher.java:197)
  196. at org.gradle.internal.Factories$1.create(Factories.java:25)
  197. at org.gradle.internal.progress.DefaultBuildOperationExecutor.run(Defaul
  198. tBuildOperationExecutor.java:91)
  199. at org.gradle.internal.progress.DefaultBuildOperationExecutor.run(Defaul
  200. tBuildOperationExecutor.java:53)
  201. at org.gradle.initialization.DefaultGradleLauncher.doBuildStages(Default
  202. GradleLauncher.java:194)
  203. at org.gradle.initialization.DefaultGradleLauncher.access$200(DefaultGra
  204. dleLauncher.java:36)
  205. at org.gradle.initialization.DefaultGradleLauncher$1.create(DefaultGradl
  206. eLauncher.java:118)
  207. at org.gradle.initialization.DefaultGradleLauncher$1.create(DefaultGradl
  208. eLauncher.java:112)
  209. at org.gradle.internal.progress.DefaultBuildOperationExecutor.run(Defaul
  210. tBuildOperationExecutor.java:91)
  211. at org.gradle.internal.progress.DefaultBuildOperationExecutor.run(Defaul
  212. tBuildOperationExecutor.java:63)
  213. at org.gradle.initialization.DefaultGradleLauncher.doBuild(DefaultGradle
  214. Launcher.java:112)
  215. at org.gradle.initialization.DefaultGradleLauncher.run(DefaultGradleLaun
  216. cher.java:98)
  217. at org.gradle.launcher.exec.GradleBuildController.run(GradleBuildControl
  218. ler.java:66)
  219. at org.gradle.tooling.internal.provider.ExecuteBuildActionRunner.run(Exe
  220. cuteBuildActionRunner.java:28)
  221. at org.gradle.launcher.exec.ChainingBuildActionRunner.run(ChainingBuildA
  222. ctionRunner.java:35)
  223. at org.gradle.launcher.exec.InProcessBuildActionExecuter.execute(InProce
  224. ssBuildActionExecuter.java:41)
  225. at org.gradle.launcher.exec.InProcessBuildActionExecuter.execute(InProce
  226. ssBuildActionExecuter.java:26)
  227. at org.gradle.tooling.internal.provider.ContinuousBuildActionExecuter.ex
  228. ecute(ContinuousBuildActionExecuter.java:75)
  229. at org.gradle.tooling.internal.provider.ContinuousBuildActionExecuter.ex
  230. ecute(ContinuousBuildActionExecuter.java:49)
  231. at org.gradle.tooling.internal.provider.ServicesSetupBuildActionExecuter
  232. .execute(ServicesSetupBuildActionExecuter.java:44)
  233. at org.gradle.tooling.internal.provider.ServicesSetupBuildActionExecuter
  234. .execute(ServicesSetupBuildActionExecuter.java:29)
  235. at org.gradle.launcher.cli.RunBuildAction.run(RunBuildAction.java:51)
  236. at org.gradle.internal.Actions$RunnableActionAdapter.execute(Actions.jav
  237. a:173)
  238. at org.gradle.launcher.cli.CommandLineActionFactory$ParseAndBuildAction.
  239. execute(CommandLineActionFactory.java:244)
  240. at org.gradle.launcher.cli.CommandLineActionFactory$ParseAndBuildAction.
  241. execute(CommandLineActionFactory.java:217)
  242. at org.gradle.launcher.cli.JavaRuntimeValidationAction.execute(JavaRunti
  243. meValidationAction.java:33)
  244. at org.gradle.launcher.cli.JavaRuntimeValidationAction.execute(JavaRunti
  245. meValidationAction.java:24)
  246. at org.gradle.launcher.cli.ExceptionReportingAction.execute(ExceptionRep
  247. ortingAction.java:33)
  248. at org.gradle.launcher.cli.ExceptionReportingAction.execute(ExceptionRep
  249. ortingAction.java:22)
  250. at org.gradle.launcher.cli.CommandLineActionFactory$WithLogging.execute(
  251. CommandLineActionFactory.java:210)
  252. at org.gradle.launcher.cli.CommandLineActionFactory$WithLogging.execute(
  253. CommandLineActionFactory.java:174)
  254. at org.gradle.launcher.Main.doAction(Main.java:33)
  255. at org.gradle.launcher.bootstrap.EntryPoint.run(EntryPoint.java:45)
  256. at org.gradle.launcher.bootstrap.ProcessBootstrap.runNoExit(ProcessBoots
  257. trap.java:60)
  258. at org.gradle.launcher.bootstrap.ProcessBootstrap.run(ProcessBootstrap.j
  259. ava:37)
  260. at org.gradle.launcher.GradleMain.main(GradleMain.java:23)
  261. at org.gradle.wrapper.BootstrapMainStarter.start(BootstrapMainStarter.ja
  262. va:30)
  263. at org.gradle.wrapper.WrapperExecutor.execute(WrapperExecutor.java:129)
  264. at org.gradle.wrapper.GradleWrapperMain.main(GradleWrapperMain.java:61)
  265. Caused by: : Compile failed; see the compiler error output for details.
  266. at org.apache.tools.ant.taskdefs.Javac.compile(Javac.java:1181)
  267. at org.apache.tools.ant.taskdefs.Javac.execute(Javac.java:936)
  268. at org.apache.tools.ant.UnknownElement.execute(UnknownElement.java:293)
  269. at org.apache.tools.ant.dispatch.DispatchUtils.execute(DispatchUtils.jav
  270. a:106)
  271. at org.gradle.api.internal.project.ant.BasicAntBuilder.nodeCompleted(Bas
  272. icAntBuilder.java:78)
  273. at org.gradle.api.internal.project.ant.BasicAntBuilder.doInvokeMethod(Ba
  274. sicAntBuilder.java:103)
  275. at net.minecraftforge.gradle.user.TaskRecompileMc.doStuff(TaskRecompileM
  276. c.java:85)
  277. at org.gradle.internal.reflect.JavaMethod.invoke(JavaMethod.java:73)
  278. at org.gradle.api.internal.project.taskfactory.DefaultTaskClassInfoStore
  279. $StandardTaskAction.doExecute(DefaultTaskClassInfoStore.java:141)
  280. at org.gradle.api.internal.project.taskfactory.DefaultTaskClassInfoStore
  281. $StandardTaskAction.execute(DefaultTaskClassInfoStore.java:134)
  282. at org.gradle.api.internal.project.taskfactory.DefaultTaskClassInfoStore
  283. $StandardTaskAction.execute(DefaultTaskClassInfoStore.java:123)
  284. at org.gradle.api.internal.AbstractTask$TaskActionWrapper.execute(Abstra
  285. ctTask.java:624)
  286. at org.gradle.api.internal.AbstractTask$TaskActionWrapper.execute(Abstra
  287. ctTask.java:607)
  288. at org.gradle.api.internal.tasks.execution.ExecuteActionsTaskExecuter.ex
  289. ecuteAction(ExecuteActionsTaskExecuter.java:95)
  290. at org.gradle.api.internal.tasks.execution.ExecuteActionsTaskExecuter.ex
  291. ecuteActions(ExecuteActionsTaskExecuter.java:76)
  292. ... 61 more
  293.  
  294.  
  295. BUILD FAILED
  296.  
  297. Total time: 51.832 secs
  298. Stopped 0 compiler daemon(s).
  299.  
  300. X:\Development\MC_1_11\Chisel>
Advertisement
Add Comment
Please, Sign In to add comment