Guest User

Untitled

a guest
Jun 19th, 2019
171
0
Never
Not a member of Pastebin yet? Sign Up, it unlocks many cool features!
text 50.78 KB | None | 0 0
  1. COPY Release/configureLibssh2.node
  2. CC(target) Release/obj.target/libgit2/vendor/libgit2/src/annotated_commit.o
  3. CC(target) Release/obj.target/libgit2/vendor/libgit2/src/apply.o
  4. CC(target) Release/obj.target/libgit2/vendor/libgit2/src/attr_file.o
  5. CC(target) Release/obj.target/libgit2/vendor/libgit2/src/attr.o
  6. CC(target) Release/obj.target/libgit2/vendor/libgit2/src/attrcache.o
  7. CC(target) Release/obj.target/libgit2/vendor/libgit2/src/blame_git.o
  8. CC(target) Release/obj.target/libgit2/vendor/libgit2/src/blame.o
  9. CC(target) Release/obj.target/libgit2/vendor/libgit2/src/blob.o
  10. CC(target) Release/obj.target/libgit2/vendor/libgit2/src/branch.o
  11. CC(target) Release/obj.target/libgit2/vendor/libgit2/src/buf_text.o
  12. CC(target) Release/obj.target/libgit2/vendor/libgit2/src/buffer.o
  13. CC(target) Release/obj.target/libgit2/vendor/libgit2/src/cache.o
  14. CC(target) Release/obj.target/libgit2/vendor/libgit2/src/checkout.o
  15. CC(target) Release/obj.target/libgit2/vendor/libgit2/src/cherrypick.o
  16. CC(target) Release/obj.target/libgit2/vendor/libgit2/src/clone.o
  17. CC(target) Release/obj.target/libgit2/vendor/libgit2/src/commit_list.o
  18. CC(target) Release/obj.target/libgit2/vendor/libgit2/src/commit.o
  19. CC(target) Release/obj.target/libgit2/vendor/libgit2/src/config_cache.o
  20. CC(target) Release/obj.target/libgit2/vendor/libgit2/src/config_file.o
  21. CC(target) Release/obj.target/libgit2/vendor/libgit2/src/config_parse.o
  22. CC(target) Release/obj.target/libgit2/vendor/libgit2/src/config.o
  23. CC(target) Release/obj.target/libgit2/vendor/libgit2/src/crlf.o
  24. CC(target) Release/obj.target/libgit2/vendor/libgit2/src/streams/curl.o
  25. CC(target) Release/obj.target/libgit2/vendor/libgit2/src/date.o
  26. CC(target) Release/obj.target/libgit2/vendor/libgit2/src/delta.o
  27. CC(target) Release/obj.target/libgit2/vendor/libgit2/src/diff_driver.o
  28. CC(target) Release/obj.target/libgit2/vendor/libgit2/src/diff_file.o
  29. CC(target) Release/obj.target/libgit2/vendor/libgit2/src/diff_generate.o
  30. CC(target) Release/obj.target/libgit2/vendor/libgit2/src/diff_parse.o
  31. CC(target) Release/obj.target/libgit2/vendor/libgit2/src/diff_print.o
  32. CC(target) Release/obj.target/libgit2/vendor/libgit2/src/diff_stats.o
  33. CC(target) Release/obj.target/libgit2/vendor/libgit2/src/diff_tform.o
  34. CC(target) Release/obj.target/libgit2/vendor/libgit2/src/diff_xdiff.o
  35. CC(target) Release/obj.target/libgit2/vendor/libgit2/src/diff.o
  36. CC(target) Release/obj.target/libgit2/vendor/libgit2/src/errors.o
  37. CC(target) Release/obj.target/libgit2/vendor/libgit2/src/fetch.o
  38. CC(target) Release/obj.target/libgit2/vendor/libgit2/src/fetchhead.o
  39. CC(target) Release/obj.target/libgit2/vendor/libgit2/src/filebuf.o
  40. CC(target) Release/obj.target/libgit2/vendor/libgit2/src/fileops.o
  41. CC(target) Release/obj.target/libgit2/vendor/libgit2/src/filter.o
  42. CC(target) Release/obj.target/libgit2/vendor/libgit2/src/fnmatch.o
  43. CC(target) Release/obj.target/libgit2/vendor/libgit2/src/global.o
  44. CC(target) Release/obj.target/libgit2/vendor/libgit2/src/graph.o
  45. CC(target) Release/obj.target/libgit2/vendor/libgit2/src/hash.o
  46. CC(target) Release/obj.target/libgit2/vendor/libgit2/src/hash/sha1dc/sha1.o
  47. CC(target) Release/obj.target/libgit2/vendor/libgit2/src/hash/sha1dc/ubc_check.o
  48. CC(target) Release/obj.target/libgit2/vendor/libgit2/src/hashsig.o
  49. CC(target) Release/obj.target/libgit2/vendor/libgit2/src/ident.o
  50. CC(target) Release/obj.target/libgit2/vendor/libgit2/src/idxmap.o
  51. CC(target) Release/obj.target/libgit2/vendor/libgit2/src/ignore.o
  52. CC(target) Release/obj.target/libgit2/vendor/libgit2/src/index.o
  53. CC(target) Release/obj.target/libgit2/vendor/libgit2/src/indexer.o
  54. CC(target) Release/obj.target/libgit2/vendor/libgit2/src/iterator.o
  55. CC(target) Release/obj.target/libgit2/vendor/libgit2/src/merge_driver.o
  56. CC(target) Release/obj.target/libgit2/vendor/libgit2/src/merge_file.o
  57. CC(target) Release/obj.target/libgit2/vendor/libgit2/src/merge.o
  58. CC(target) Release/obj.target/libgit2/vendor/libgit2/src/message.o
  59. CC(target) Release/obj.target/libgit2/vendor/libgit2/src/mwindow.o
  60. CC(target) Release/obj.target/libgit2/vendor/libgit2/src/netops.o
  61. CC(target) Release/obj.target/libgit2/vendor/libgit2/src/notes.o
  62. CC(target) Release/obj.target/libgit2/vendor/libgit2/src/object_api.o
  63. CC(target) Release/obj.target/libgit2/vendor/libgit2/src/object.o
  64. CC(target) Release/obj.target/libgit2/vendor/libgit2/src/odb_loose.o
  65. CC(target) Release/obj.target/libgit2/vendor/libgit2/src/odb_mempack.o
  66. CC(target) Release/obj.target/libgit2/vendor/libgit2/src/odb_pack.o
  67. CC(target) Release/obj.target/libgit2/vendor/libgit2/src/odb.o
  68. CC(target) Release/obj.target/libgit2/vendor/libgit2/src/offmap.o
  69. CC(target) Release/obj.target/libgit2/vendor/libgit2/src/oid.o
  70. CC(target) Release/obj.target/libgit2/vendor/libgit2/src/oidarray.o
  71. CC(target) Release/obj.target/libgit2/vendor/libgit2/src/oidmap.o
  72. CC(target) Release/obj.target/libgit2/vendor/libgit2/src/streams/openssl.o
  73. CC(target) Release/obj.target/libgit2/vendor/libgit2/src/pack-objects.o
  74. CC(target) Release/obj.target/libgit2/vendor/libgit2/src/pack.o
  75. CC(target) Release/obj.target/libgit2/vendor/libgit2/src/parse.o
  76. CC(target) Release/obj.target/libgit2/vendor/libgit2/src/patch_generate.o
  77. CC(target) Release/obj.target/libgit2/vendor/libgit2/src/patch_parse.o
  78. CC(target) Release/obj.target/libgit2/vendor/libgit2/src/patch.o
  79. CC(target) Release/obj.target/libgit2/vendor/libgit2/src/path.o
  80. CC(target) Release/obj.target/libgit2/vendor/libgit2/src/pathspec.o
  81. CC(target) Release/obj.target/libgit2/vendor/libgit2/src/pool.o
  82. CC(target) Release/obj.target/libgit2/vendor/libgit2/src/posix.o
  83. CC(target) Release/obj.target/libgit2/vendor/libgit2/src/pqueue.o
  84. CC(target) Release/obj.target/libgit2/vendor/libgit2/src/proxy.o
  85. CC(target) Release/obj.target/libgit2/vendor/libgit2/src/push.o
  86. CC(target) Release/obj.target/libgit2/vendor/libgit2/src/rebase.o
  87. CC(target) Release/obj.target/libgit2/vendor/libgit2/src/refdb_fs.o
  88. CC(target) Release/obj.target/libgit2/vendor/libgit2/src/refdb.o
  89. CC(target) Release/obj.target/libgit2/vendor/libgit2/src/reflog.o
  90. CC(target) Release/obj.target/libgit2/vendor/libgit2/src/refs.o
  91. CC(target) Release/obj.target/libgit2/vendor/libgit2/src/refspec.o
  92. CC(target) Release/obj.target/libgit2/vendor/libgit2/src/remote.o
  93. CC(target) Release/obj.target/libgit2/vendor/libgit2/src/repository.o
  94. CC(target) Release/obj.target/libgit2/vendor/libgit2/src/reset.o
  95. CC(target) Release/obj.target/libgit2/vendor/libgit2/src/revert.o
  96. CC(target) Release/obj.target/libgit2/vendor/libgit2/src/revparse.o
  97. CC(target) Release/obj.target/libgit2/vendor/libgit2/src/revwalk.o
  98. CC(target) Release/obj.target/libgit2/vendor/libgit2/src/settings.o
  99. CC(target) Release/obj.target/libgit2/vendor/libgit2/src/sha1_lookup.o
  100. CC(target) Release/obj.target/libgit2/vendor/libgit2/src/signature.o
  101. CC(target) Release/obj.target/libgit2/vendor/libgit2/src/streams/socket.o
  102. CC(target) Release/obj.target/libgit2/vendor/libgit2/src/sortedcache.o
  103. CC(target) Release/obj.target/libgit2/vendor/libgit2/src/stash.o
  104. CC(target) Release/obj.target/libgit2/vendor/libgit2/src/status.o
  105. CC(target) Release/obj.target/libgit2/vendor/libgit2/src/strmap.o
  106. CC(target) Release/obj.target/libgit2/vendor/libgit2/src/submodule.o
  107. CC(target) Release/obj.target/libgit2/vendor/libgit2/src/sysdir.o
  108. CC(target) Release/obj.target/libgit2/vendor/libgit2/src/tag.o
  109. CC(target) Release/obj.target/libgit2/vendor/libgit2/src/thread-utils.o
  110. CC(target) Release/obj.target/libgit2/vendor/libgit2/src/trace.o
  111. CC(target) Release/obj.target/libgit2/vendor/libgit2/src/trailer.o
  112. CC(target) Release/obj.target/libgit2/vendor/libgit2/src/transaction.o
  113. CC(target) Release/obj.target/libgit2/vendor/libgit2/src/transport.o
  114. CC(target) Release/obj.target/libgit2/vendor/libgit2/src/transports/auth.o
  115. CC(target) Release/obj.target/libgit2/vendor/libgit2/src/transports/cred_helpers.o
  116. CC(target) Release/obj.target/libgit2/vendor/libgit2/src/transports/cred.o
  117. CC(target) Release/obj.target/libgit2/vendor/libgit2/src/transports/git.o
  118. CC(target) Release/obj.target/libgit2/vendor/libgit2/src/transports/http.o
  119. CC(target) Release/obj.target/libgit2/vendor/libgit2/src/transports/local.o
  120. CC(target) Release/obj.target/libgit2/vendor/libgit2/src/transports/smart_pkt.o
  121. CC(target) Release/obj.target/libgit2/vendor/libgit2/src/transports/smart_protocol.o
  122. CC(target) Release/obj.target/libgit2/vendor/libgit2/src/transports/smart.o
  123. CC(target) Release/obj.target/libgit2/vendor/libgit2/src/transports/ssh.o
  124. CC(target) Release/obj.target/libgit2/vendor/libgit2/src/tree-cache.o
  125. CC(target) Release/obj.target/libgit2/vendor/libgit2/src/tree.o
  126. CC(target) Release/obj.target/libgit2/vendor/libgit2/src/tsort.o
  127. CC(target) Release/obj.target/libgit2/vendor/libgit2/src/util.o
  128. CC(target) Release/obj.target/libgit2/vendor/libgit2/src/varint.o
  129. CC(target) Release/obj.target/libgit2/vendor/libgit2/src/vector.o
  130. CC(target) Release/obj.target/libgit2/vendor/libgit2/src/worktree.o
  131. CC(target) Release/obj.target/libgit2/vendor/libgit2/src/xdiff/xdiffi.o
  132. CC(target) Release/obj.target/libgit2/vendor/libgit2/src/xdiff/xemit.o
  133. CC(target) Release/obj.target/libgit2/vendor/libgit2/src/xdiff/xhistogram.o
  134. CC(target) Release/obj.target/libgit2/vendor/libgit2/src/xdiff/xmerge.o
  135. CC(target) Release/obj.target/libgit2/vendor/libgit2/src/xdiff/xpatience.o
  136. CC(target) Release/obj.target/libgit2/vendor/libgit2/src/xdiff/xprepare.o
  137. CC(target) Release/obj.target/libgit2/vendor/libgit2/src/xdiff/xutils.o
  138. CC(target) Release/obj.target/libgit2/vendor/libgit2/src/zstream.o
  139. CC(target) Release/obj.target/libgit2/vendor/libgit2/src/streams/tls.o
  140. CC(target) Release/obj.target/libgit2/vendor/libgit2/src/unix/map.o
  141. CC(target) Release/obj.target/libgit2/vendor/libgit2/src/unix/realpath.o
  142. AR(target) Release/obj.target/vendor/git2.a
  143. COPY Release/git2.a
  144. CC(target) Release/obj.target/zlib/vendor/libgit2/deps/zlib/adler32.o
  145. CC(target) Release/obj.target/zlib/vendor/libgit2/deps/zlib/crc32.o
  146. CC(target) Release/obj.target/zlib/vendor/libgit2/deps/zlib/deflate.o
  147. CC(target) Release/obj.target/zlib/vendor/libgit2/deps/zlib/inffast.o
  148. CC(target) Release/obj.target/zlib/vendor/libgit2/deps/zlib/inflate.o
  149. ../vendor/libgit2/deps/zlib/inflate.c: In function ‘inflate’:
  150. ../vendor/libgit2/deps/zlib/inflate.c:841:25: warning: this statement may fall through [-Wimplicit-fallthrough=]
  151. 841 | state->mode = DICT;
  152. | ~~~~~~~~~~~~^~~~~~
  153. ../vendor/libgit2/deps/zlib/inflate.c:842:9: note: here
  154. 842 | case DICT:
  155. | ^~~~
  156. ../vendor/libgit2/deps/zlib/inflate.c:848:25: warning: this statement may fall through [-Wimplicit-fallthrough=]
  157. 848 | state->mode = TYPE;
  158. | ~~~~~~~~~~~~^~~~~~
  159. ../vendor/libgit2/deps/zlib/inflate.c:849:9: note: here
  160. 849 | case TYPE:
  161. | ^~~~
  162. ../vendor/libgit2/deps/zlib/inflate.c:850:16: warning: this statement may fall through [-Wimplicit-fallthrough=]
  163. 850 | if (flush == Z_BLOCK || flush == Z_TREES) goto inf_leave;
  164. | ^
  165. ../vendor/libgit2/deps/zlib/inflate.c:851:9: note: here
  166. 851 | case TYPEDO:
  167. | ^~~~
  168. ../vendor/libgit2/deps/zlib/inflate.c:900:16: warning: this statement may fall through [-Wimplicit-fallthrough=]
  169. 900 | if (flush == Z_TREES) goto inf_leave;
  170. | ^
  171. ../vendor/libgit2/deps/zlib/inflate.c:901:9: note: here
  172. 901 | case COPY_:
  173. | ^~~~
  174. ../vendor/libgit2/deps/zlib/inflate.c:902:25: warning: this statement may fall through [-Wimplicit-fallthrough=]
  175. 902 | state->mode = COPY;
  176. | ~~~~~~~~~~~~^~~~~~
  177. ../vendor/libgit2/deps/zlib/inflate.c:903:9: note: here
  178. 903 | case COPY:
  179. | ^~~~
  180. ../vendor/libgit2/deps/zlib/inflate.c:1041:16: warning: this statement may fall through [-Wimplicit-fallthrough=]
  181. 1041 | if (flush == Z_TREES) goto inf_leave;
  182. | ^
  183. ../vendor/libgit2/deps/zlib/inflate.c:1042:9: note: here
  184. 1042 | case LEN_:
  185. | ^~~~
  186. ../vendor/libgit2/deps/zlib/inflate.c:1043:25: warning: this statement may fall through [-Wimplicit-fallthrough=]
  187. 1043 | state->mode = LEN;
  188. | ~~~~~~~~~~~~^~~~~
  189. ../vendor/libgit2/deps/zlib/inflate.c:1044:9: note: here
  190. 1044 | case LEN:
  191. | ^~~~
  192. ../vendor/libgit2/deps/zlib/inflate.c:1092:25: warning: this statement may fall through [-Wimplicit-fallthrough=]
  193. 1092 | state->mode = LENEXT;
  194. | ~~~~~~~~~~~~^~~~~~~~
  195. ../vendor/libgit2/deps/zlib/inflate.c:1093:9: note: here
  196. 1093 | case LENEXT:
  197. | ^~~~
  198. ../vendor/libgit2/deps/zlib/inflate.c:1102:25: warning: this statement may fall through [-Wimplicit-fallthrough=]
  199. 1102 | state->mode = DIST;
  200. | ~~~~~~~~~~~~^~~~~~
  201. ../vendor/libgit2/deps/zlib/inflate.c:1103:9: note: here
  202. 1103 | case DIST:
  203. | ^~~~
  204. ../vendor/libgit2/deps/zlib/inflate.c:1129:25: warning: this statement may fall through [-Wimplicit-fallthrough=]
  205. 1129 | state->mode = DISTEXT;
  206. | ~~~~~~~~~~~~^~~~~~~~~
  207. ../vendor/libgit2/deps/zlib/inflate.c:1130:9: note: here
  208. 1130 | case DISTEXT:
  209. | ^~~~
  210. ../vendor/libgit2/deps/zlib/inflate.c:1145:25: warning: this statement may fall through [-Wimplicit-fallthrough=]
  211. 1145 | state->mode = MATCH;
  212. | ~~~~~~~~~~~~^~~~~~~
  213. ../vendor/libgit2/deps/zlib/inflate.c:1146:9: note: here
  214. 1146 | case MATCH:
  215. | ^~~~
  216. ../vendor/libgit2/deps/zlib/inflate.c:1233:25: warning: this statement may fall through [-Wimplicit-fallthrough=]
  217. 1233 | state->mode = DONE;
  218. | ~~~~~~~~~~~~^~~~~~
  219. ../vendor/libgit2/deps/zlib/inflate.c:1234:9: note: here
  220. 1234 | case DONE:
  221. | ^~~~
  222. CC(target) Release/obj.target/zlib/vendor/libgit2/deps/zlib/inftrees.o
  223. CC(target) Release/obj.target/zlib/vendor/libgit2/deps/zlib/trees.o
  224. CC(target) Release/obj.target/zlib/vendor/libgit2/deps/zlib/zutil.o
  225. AR(target) Release/obj.target/vendor/zlib.a
  226. COPY Release/zlib.a
  227. CC(target) Release/obj.target/http_parser/vendor/http_parser/http_parser.o
  228. ../vendor/http_parser/http_parser.c: In function ‘http_parser_parse_url’:
  229. ../vendor/http_parser/http_parser.c:2340:18: warning: this statement may fall through [-Wimplicit-fallthrough=]
  230. 2340 | found_at = 1;
  231. | ~~~~~~~~~^~~
  232. ../vendor/http_parser/http_parser.c:2343:7: note: here
  233. 2343 | case s_req_server:
  234. | ^~~~
  235. AR(target) Release/obj.target/vendor/http_parser/http_parser.a
  236. COPY Release/http_parser.a
  237. CC(target) Release/obj.target/libssh2/vendor/libssh2/src/agent.o
  238. CC(target) Release/obj.target/libssh2/vendor/libssh2/src/crypt.o
  239. CC(target) Release/obj.target/libssh2/vendor/libssh2/src/keepalive.o
  240. CC(target) Release/obj.target/libssh2/vendor/libssh2/src/libgcrypt.o
  241. CC(target) Release/obj.target/libssh2/vendor/libssh2/src/openssl.o
  242. In file included from /home/jack/.node-gyp/12.4.0/include/node/openssl/asn1.h:16,
  243. from /home/jack/.node-gyp/12.4.0/include/node/openssl/rsa.h:16,
  244. from ../vendor/libssh2/src/openssl.h:42,
  245. from ../vendor/libssh2/src/crypto.h:42,
  246. from ../vendor/libssh2/src/libssh2_priv.h:140,
  247. from ../vendor/libssh2/src/openssl.c:41:
  248. ../vendor/libssh2/src/openssl.c: In function ‘_libssh2_pub_priv_keyfile’:
  249. /home/jack/.node-gyp/12.4.0/include/node/openssl/bio.h:483:34: warning: value computed is not used [-Wunused-value]
  250. 483 | # define BIO_reset(b) (int)BIO_ctrl(b,BIO_CTRL_RESET,0,NULL)
  251. | ^~~~~~~~~~~~~~~~~~~~~~~~~~~~~~~~~~~~~~
  252. ../vendor/libssh2/src/openssl.c:1073:5: note: in expansion of macro ‘BIO_reset’
  253. 1073 | BIO_reset(bp);
  254. | ^~~~~~~~~
  255. ../vendor/libssh2/src/openssl.c: In function ‘_libssh2_pub_priv_keyfilememory’:
  256. /home/jack/.node-gyp/12.4.0/include/node/openssl/bio.h:483:34: warning: value computed is not used [-Wunused-value]
  257. 483 | # define BIO_reset(b) (int)BIO_ctrl(b,BIO_CTRL_RESET,0,NULL)
  258. | ^~~~~~~~~~~~~~~~~~~~~~~~~~~~~~~~~~~~~~
  259. ../vendor/libssh2/src/openssl.c:1149:5: note: in expansion of macro ‘BIO_reset’
  260. 1149 | BIO_reset(bp);
  261. | ^~~~~~~~~
  262. CC(target) Release/obj.target/libssh2/vendor/libssh2/src/publickey.o
  263. CC(target) Release/obj.target/libssh2/vendor/libssh2/src/sftp.o
  264. ../vendor/libssh2/src/sftp.c: In function ‘sftp_read’:
  265. ../vendor/libssh2/src/sftp.c:1368:14: warning: this statement may fall through [-Wimplicit-fallthrough=]
  266. 1368 | while(count > 0) {
  267. | ^
  268. ../vendor/libssh2/src/sftp.c:1414:5: note: here
  269. 1414 | case libssh2_NB_state_sent:
  270. | ^~~~
  271. ../vendor/libssh2/src/sftp.c:1422:14: warning: this statement may fall through [-Wimplicit-fallthrough=]
  272. 1422 | while(chunk) {
  273. | ^
  274. ../vendor/libssh2/src/sftp.c:1453:5: note: here
  275. 1453 | case libssh2_NB_state_sent2:
  276. | ^~~~
  277. CC(target) Release/obj.target/libssh2/vendor/libssh2/src/version.o
  278. CC(target) Release/obj.target/libssh2/vendor/libssh2/src/channel.o
  279. CC(target) Release/obj.target/libssh2/vendor/libssh2/src/global.o
  280. CC(target) Release/obj.target/libssh2/vendor/libssh2/src/kex.o
  281. CC(target) Release/obj.target/libssh2/vendor/libssh2/src/mac.o
  282. CC(target) Release/obj.target/libssh2/vendor/libssh2/src/packet.o
  283. CC(target) Release/obj.target/libssh2/vendor/libssh2/src/scp.o
  284. CC(target) Release/obj.target/libssh2/vendor/libssh2/src/transport.o
  285. ../vendor/libssh2/src/transport.c: In function ‘_libssh2_transport_send’:
  286. ../vendor/libssh2/src/transport.c:721:79: warning: suggest braces around empty body in an ‘if’ statement [-Wempty-body]
  287. 721 | debugdump(session, "libssh2_transport_write plain2", data2, data2_len);
  288. | ^
  289. CC(target) Release/obj.target/libssh2/vendor/libssh2/src/comp.o
  290. CC(target) Release/obj.target/libssh2/vendor/libssh2/src/hostkey.o
  291. CC(target) Release/obj.target/libssh2/vendor/libssh2/src/knownhost.o
  292. ../vendor/libssh2/src/knownhost.c: In function ‘knownhost_writeline’:
  293. ../vendor/libssh2/src/knownhost.c:1021:12: warning: this statement may fall through [-Wimplicit-fallthrough=]
  294. 1021 | if (key_type_name) {
  295. | ^
  296. ../vendor/libssh2/src/knownhost.c:1026:5: note: here
  297. 1026 | default:
  298. | ^~~~~~~
  299. CC(target) Release/obj.target/libssh2/vendor/libssh2/src/misc.o
  300. CC(target) Release/obj.target/libssh2/vendor/libssh2/src/pem.o
  301. CC(target) Release/obj.target/libssh2/vendor/libssh2/src/session.o
  302. CC(target) Release/obj.target/libssh2/vendor/libssh2/src/userauth.o
  303. AR(target) Release/obj.target/vendor/ssh2.a
  304. COPY Release/ssh2.a
  305. CXX(target) Release/obj.target/nodegit/src/async_baton.o
  306. In file included from ../src/../include/async_baton.h:5,
  307. from ../src/async_baton.cc:1:
  308. ../../nan/nan.h: In function ‘void Nan::AsyncQueueWorker(Nan::AsyncWorker*)’:
  309. ../../nan/nan.h:2298:62: warning: cast between incompatible function types from ‘void (*)(uv_work_t*)’ {aka ‘void (*)(uv_work_s*)’} to ‘uv_after_work_cb’ {aka ‘void (*)(uv_work_s*, int)’} [-Wcast-function-type]
  310. 2298 | , reinterpret_cast<uv_after_work_cb>(AsyncExecuteComplete)
  311. | ^
  312. In file included from /home/jack/.node-gyp/12.4.0/include/node/node.h:63,
  313. from ../../nan/nan.h:54,
  314. from ../src/../include/async_baton.h:5,
  315. from ../src/async_baton.cc:1:
  316. /home/jack/.node-gyp/12.4.0/include/node/v8.h: In instantiation of ‘void v8::PersistentBase<T>::SetWeak(P*, typename v8::WeakCallbackInfo<P>::Callback, v8::WeakCallbackType) [with P = node::ObjectWrap; T = v8::Object; typename v8::WeakCallbackInfo<P>::Callback = void (*)(const v8::WeakCallbackInfo<node::ObjectWrap>&)]’:
  317. /home/jack/.node-gyp/12.4.0/include/node/node_object_wrap.h:84:78: required from here
  318. /home/jack/.node-gyp/12.4.0/include/node/v8.h:9817:16: warning: cast between incompatible function types from ‘v8::WeakCallbackInfo<node::ObjectWrap>::Callback’ {aka ‘void (*)(const v8::WeakCallbackInfo<node::ObjectWrap>&)’} to ‘Callback’ {aka ‘void (*)(const v8::WeakCallbackInfo<void>&)’} [-Wcast-function-type]
  319. 9817 | reinterpret_cast<Callback>(callback), type);
  320. | ^~~~~~~~~~~~~~~~~~~~~~~~~~~~~~~~~~~~
  321. /home/jack/.node-gyp/12.4.0/include/node/v8.h: In instantiation of ‘void v8::PersistentBase<T>::SetWeak(P*, typename v8::WeakCallbackInfo<P>::Callback, v8::WeakCallbackType) [with P = Nan::ObjectWrap; T = v8::Object; typename v8::WeakCallbackInfo<P>::Callback = void (*)(const v8::WeakCallbackInfo<Nan::ObjectWrap>&)]’:
  322. ../../nan/nan_object_wrap.h:65:61: required from here
  323. /home/jack/.node-gyp/12.4.0/include/node/v8.h:9817:16: warning: cast between incompatible function types from ‘v8::WeakCallbackInfo<Nan::ObjectWrap>::Callback’ {aka ‘void (*)(const v8::WeakCallbackInfo<Nan::ObjectWrap>&)’} to ‘Callback’ {aka ‘void (*)(const v8::WeakCallbackInfo<void>&)’} [-Wcast-function-type]
  324. CXX(target) Release/obj.target/nodegit/src/lock_master.o
  325. In file included from ../src/lock_master.cc:1:
  326. ../../nan/nan.h: In function ‘void Nan::AsyncQueueWorker(Nan::AsyncWorker*)’:
  327. ../../nan/nan.h:2298:62: warning: cast between incompatible function types from ‘void (*)(uv_work_t*)’ {aka ‘void (*)(uv_work_s*)’} to ‘uv_after_work_cb’ {aka ‘void (*)(uv_work_s*, int)’} [-Wcast-function-type]
  328. 2298 | , reinterpret_cast<uv_after_work_cb>(AsyncExecuteComplete)
  329. | ^
  330. In file included from /home/jack/.node-gyp/12.4.0/include/node/node.h:63,
  331. from ../../nan/nan.h:54,
  332. from ../src/lock_master.cc:1:
  333. /home/jack/.node-gyp/12.4.0/include/node/v8.h: In instantiation of ‘void v8::PersistentBase<T>::SetWeak(P*, typename v8::WeakCallbackInfo<P>::Callback, v8::WeakCallbackType) [with P = node::ObjectWrap; T = v8::Object; typename v8::WeakCallbackInfo<P>::Callback = void (*)(const v8::WeakCallbackInfo<node::ObjectWrap>&)]’:
  334. /home/jack/.node-gyp/12.4.0/include/node/node_object_wrap.h:84:78: required from here
  335. /home/jack/.node-gyp/12.4.0/include/node/v8.h:9817:16: warning: cast between incompatible function types from ‘v8::WeakCallbackInfo<node::ObjectWrap>::Callback’ {aka ‘void (*)(const v8::WeakCallbackInfo<node::ObjectWrap>&)’} to ‘Callback’ {aka ‘void (*)(const v8::WeakCallbackInfo<void>&)’} [-Wcast-function-type]
  336. 9817 | reinterpret_cast<Callback>(callback), type);
  337. | ^~~~~~~~~~~~~~~~~~~~~~~~~~~~~~~~~~~~
  338. /home/jack/.node-gyp/12.4.0/include/node/v8.h: In instantiation of ‘void v8::PersistentBase<T>::SetWeak(P*, typename v8::WeakCallbackInfo<P>::Callback, v8::WeakCallbackType) [with P = Nan::ObjectWrap; T = v8::Object; typename v8::WeakCallbackInfo<P>::Callback = void (*)(const v8::WeakCallbackInfo<Nan::ObjectWrap>&)]’:
  339. ../../nan/nan_object_wrap.h:65:61: required from here
  340. /home/jack/.node-gyp/12.4.0/include/node/v8.h:9817:16: warning: cast between incompatible function types from ‘v8::WeakCallbackInfo<Nan::ObjectWrap>::Callback’ {aka ‘void (*)(const v8::WeakCallbackInfo<Nan::ObjectWrap>&)’} to ‘Callback’ {aka ‘void (*)(const v8::WeakCallbackInfo<void>&)’} [-Wcast-function-type]
  341. CXX(target) Release/obj.target/nodegit/src/reference_counter.o
  342. CXX(target) Release/obj.target/nodegit/src/nodegit.o
  343. In file included from ../src/../include/wrapper.h:11,
  344. from ../src/nodegit.cc:16:
  345. ../../nan/nan.h: In function ‘void Nan::AsyncQueueWorker(Nan::AsyncWorker*)’:
  346. ../../nan/nan.h:2298:62: warning: cast between incompatible function types from ‘void (*)(uv_work_t*)’ {aka ‘void (*)(uv_work_s*)’} to ‘uv_after_work_cb’ {aka ‘void (*)(uv_work_s*, int)’} [-Wcast-function-type]
  347. 2298 | , reinterpret_cast<uv_after_work_cb>(AsyncExecuteComplete)
  348. | ^
  349. ../src/nodegit.cc: In function ‘void LockMasterSetStatus(const v8::FunctionCallbackInfo<v8::Value>&)’:
  350. ../src/nodegit.cc:195:76: warning: ‘v8::Local<v8::Int32> v8::Value::ToInt32(v8::Isolate*) const’ is deprecated: Use maybe version [-Wdeprecated-declarations]
  351. 195 | v8::Local<v8::Int32> value = info[0]->ToInt32(v8::Isolate::GetCurrent());
  352. | ^
  353. In file included from /home/jack/.node-gyp/12.4.0/include/node/v8-internal.h:14,
  354. from /home/jack/.node-gyp/12.4.0/include/node/v8.h:25,
  355. from /home/jack/.node-gyp/12.4.0/include/node/node.h:63,
  356. from ../src/nodegit.cc:3:
  357. /home/jack/.node-gyp/12.4.0/include/node/v8.h:2550:34: note: declared here
  358. 2550 | Local<Int32> ToInt32(Isolate* isolate) const);
  359. | ^~~~~~~
  360. /home/jack/.node-gyp/12.4.0/include/node/v8config.h:322:3: note: in definition of macro ‘V8_DEPRECATE_SOON’
  361. 322 | declarator __attribute__((deprecated(message)))
  362. | ^~~~~~~~~~
  363. ../src/nodegit.cc: In function ‘void LockMasterGetDiagnostics(const v8::FunctionCallbackInfo<v8::Value>&)’:
  364. ../src/nodegit.cc:216:104: warning: ‘bool v8::Object::Set(v8::Local<v8::Value>, v8::Local<v8::Value>)’ is deprecated: Use maybe version [-Wdeprecated-declarations]
  365. 216 | result->Set(Nan::New("storedMutexesCount").ToLocalChecked(), Nan::New(diagnostics.storedMutexesCount));
  366. | ^
  367. In file included from /home/jack/.node-gyp/12.4.0/include/node/v8-internal.h:14,
  368. from /home/jack/.node-gyp/12.4.0/include/node/v8.h:25,
  369. from /home/jack/.node-gyp/12.4.0/include/node/node.h:63,
  370. from ../src/nodegit.cc:3:
  371. /home/jack/.node-gyp/12.4.0/include/node/v8.h:3359:26: note: declared here
  372. 3359 | bool Set(Local<Value> key, Local<Value> value));
  373. | ^~~
  374. /home/jack/.node-gyp/12.4.0/include/node/v8config.h:322:3: note: in definition of macro ‘V8_DEPRECATE_SOON’
  375. 322 | declarator __attribute__((deprecated(message)))
  376. | ^~~~~~~~~~
  377. In file included from ../src/nodegit.cc:11:
  378. ../src/nodegit.cc: In function ‘void OpenSSL_ThreadSetup()’:
  379. /home/jack/.node-gyp/12.4.0/include/node/openssl/crypto.h:235:58: warning: statement has no effect [-Wunused-value]
  380. 235 | # define CRYPTO_THREADID_set_callback(threadid_func) (0)
  381. | ~^~
  382. ../src/nodegit.cc:242:3: note: in expansion of macro ‘CRYPTO_THREADID_set_callback’
  383. 242 | CRYPTO_THREADID_set_callback(OpenSSL_IDCallback);
  384. | ^~~~~~~~~~~~~~~~~~~~~~~~~~~~
  385. ../src/nodegit.cc: In function ‘void init(v8::Local<v8::Object>)’:
  386. ../src/nodegit.cc:394:95: warning: ‘bool v8::Object::Set(v8::Local<v8::Value>, v8::Local<v8::Value>)’ is deprecated: Use maybe version [-Wdeprecated-declarations]
  387. 394 | threadSafety->Set(Nan::New("DISABLED").ToLocalChecked(), Nan::New((int)LockMaster::Disabled));
  388. | ^
  389. In file included from /home/jack/.node-gyp/12.4.0/include/node/v8-internal.h:14,
  390. from /home/jack/.node-gyp/12.4.0/include/node/v8.h:25,
  391. from /home/jack/.node-gyp/12.4.0/include/node/node.h:63,
  392. from ../src/nodegit.cc:3:
  393. /home/jack/.node-gyp/12.4.0/include/node/v8.h:3359:26: note: declared here
  394. 3359 | bool Set(Local<Value> key, Local<Value> value));
  395. | ^~~
  396. /home/jack/.node-gyp/12.4.0/include/node/v8config.h:322:3: note: in definition of macro ‘V8_DEPRECATE_SOON’
  397. 322 | declarator __attribute__((deprecated(message)))
  398. | ^~~~~~~~~~
  399. ../src/nodegit.cc:395:120: warning: ‘bool v8::Object::Set(v8::Local<v8::Value>, v8::Local<v8::Value>)’ is deprecated: Use maybe version [-Wdeprecated-declarations]
  400. 395 | threadSafety->Set(Nan::New("ENABLED_FOR_ASYNC_ONLY").ToLocalChecked(), Nan::New((int)LockMaster::EnabledForAsyncOnly));
  401. | ^
  402. In file included from /home/jack/.node-gyp/12.4.0/include/node/v8-internal.h:14,
  403. from /home/jack/.node-gyp/12.4.0/include/node/v8.h:25,
  404. from /home/jack/.node-gyp/12.4.0/include/node/node.h:63,
  405. from ../src/nodegit.cc:3:
  406. /home/jack/.node-gyp/12.4.0/include/node/v8.h:3359:26: note: declared here
  407. 3359 | bool Set(Local<Value> key, Local<Value> value));
  408. | ^~~
  409. /home/jack/.node-gyp/12.4.0/include/node/v8config.h:322:3: note: in definition of macro ‘V8_DEPRECATE_SOON’
  410. 322 | declarator __attribute__((deprecated(message)))
  411. | ^~~~~~~~~~
  412. ../src/nodegit.cc:396:93: warning: ‘bool v8::Object::Set(v8::Local<v8::Value>, v8::Local<v8::Value>)’ is deprecated: Use maybe version [-Wdeprecated-declarations]
  413. 396 | threadSafety->Set(Nan::New("ENABLED").ToLocalChecked(), Nan::New((int)LockMaster::Enabled));
  414. | ^
  415. In file included from /home/jack/.node-gyp/12.4.0/include/node/v8-internal.h:14,
  416. from /home/jack/.node-gyp/12.4.0/include/node/v8.h:25,
  417. from /home/jack/.node-gyp/12.4.0/include/node/node.h:63,
  418. from ../src/nodegit.cc:3:
  419. /home/jack/.node-gyp/12.4.0/include/node/v8.h:3359:26: note: declared here
  420. 3359 | bool Set(Local<Value> key, Local<Value> value));
  421. | ^~~
  422. /home/jack/.node-gyp/12.4.0/include/node/v8config.h:322:3: note: in definition of macro ‘V8_DEPRECATE_SOON’
  423. 322 | declarator __attribute__((deprecated(message)))
  424. | ^~~~~~~~~~
  425. ../src/nodegit.cc:398:71: warning: ‘bool v8::Object::Set(v8::Local<v8::Value>, v8::Local<v8::Value>)’ is deprecated: Use maybe version [-Wdeprecated-declarations]
  426. 398 | target->Set(Nan::New("THREAD_SAFETY").ToLocalChecked(), threadSafety);
  427. | ^
  428. In file included from /home/jack/.node-gyp/12.4.0/include/node/v8-internal.h:14,
  429. from /home/jack/.node-gyp/12.4.0/include/node/v8.h:25,
  430. from /home/jack/.node-gyp/12.4.0/include/node/node.h:63,
  431. from ../src/nodegit.cc:3:
  432. /home/jack/.node-gyp/12.4.0/include/node/v8.h:3359:26: note: declared here
  433. 3359 | bool Set(Local<Value> key, Local<Value> value));
  434. | ^~~
  435. /home/jack/.node-gyp/12.4.0/include/node/v8config.h:322:3: note: in definition of macro ‘V8_DEPRECATE_SOON’
  436. 322 | declarator __attribute__((deprecated(message)))
  437. | ^~~~~~~~~~
  438. In file included from ../src/nodegit.cc:3:
  439. ../src/nodegit.cc: At global scope:
  440. /home/jack/.node-gyp/12.4.0/include/node/node.h:556:43: warning: cast between incompatible function types from ‘void (*)(v8::Local<v8::Object>)’ to ‘node::addon_register_func’ {aka ‘void (*)(v8::Local<v8::Object>, v8::Local<v8::Value>, void*)’} [-Wcast-function-type]
  441. 556 | (node::addon_register_func) (regfunc), \
  442. | ^
  443. /home/jack/.node-gyp/12.4.0/include/node/node.h:590:3: note: in expansion of macro ‘NODE_MODULE_X’
  444. 590 | NODE_MODULE_X(modname, regfunc, NULL, 0) // NOLINT (readability/null_usage)
  445. | ^~~~~~~~~~~~~
  446. ../src/nodegit.cc:403:1: note: in expansion of macro ‘NODE_MODULE’
  447. 403 | NODE_MODULE(nodegit, init)
  448. | ^~~~~~~~~~~
  449. In file included from /home/jack/.node-gyp/12.4.0/include/node/node.h:63,
  450. from ../src/nodegit.cc:3:
  451. /home/jack/.node-gyp/12.4.0/include/node/v8.h: In instantiation of ‘void v8::PersistentBase<T>::SetWeak(P*, typename v8::WeakCallbackInfo<P>::Callback, v8::WeakCallbackType) [with P = node::ObjectWrap; T = v8::Object; typename v8::WeakCallbackInfo<P>::Callback = void (*)(const v8::WeakCallbackInfo<node::ObjectWrap>&)]’:
  452. /home/jack/.node-gyp/12.4.0/include/node/node_object_wrap.h:84:78: required from here
  453. /home/jack/.node-gyp/12.4.0/include/node/v8.h:9817:16: warning: cast between incompatible function types from ‘v8::WeakCallbackInfo<node::ObjectWrap>::Callback’ {aka ‘void (*)(const v8::WeakCallbackInfo<node::ObjectWrap>&)’} to ‘Callback’ {aka ‘void (*)(const v8::WeakCallbackInfo<void>&)’} [-Wcast-function-type]
  454. 9817 | reinterpret_cast<Callback>(callback), type);
  455. | ^~~~~~~~~~~~~~~~~~~~~~~~~~~~~~~~~~~~
  456. /home/jack/.node-gyp/12.4.0/include/node/v8.h: In instantiation of ‘void v8::PersistentBase<T>::SetWeak(P*, typename v8::WeakCallbackInfo<P>::Callback, v8::WeakCallbackType) [with P = Nan::ObjectWrap; T = v8::Object; typename v8::WeakCallbackInfo<P>::Callback = void (*)(const v8::WeakCallbackInfo<Nan::ObjectWrap>&)]’:
  457. ../../nan/nan_object_wrap.h:65:61: required from here
  458. /home/jack/.node-gyp/12.4.0/include/node/v8.h:9817:16: warning: cast between incompatible function types from ‘v8::WeakCallbackInfo<Nan::ObjectWrap>::Callback’ {aka ‘void (*)(const v8::WeakCallbackInfo<Nan::ObjectWrap>&)’} to ‘Callback’ {aka ‘void (*)(const v8::WeakCallbackInfo<void>&)’} [-Wcast-function-type]
  459. CXX(target) Release/obj.target/nodegit/src/init_ssh2.o
  460. CXX(target) Release/obj.target/nodegit/src/promise_completion.o
  461. In file included from ../src/../include/promise_completion.h:4,
  462. from ../src/promise_completion.cc:2:
  463. ../../nan/nan.h: In function ‘void Nan::AsyncQueueWorker(Nan::AsyncWorker*)’:
  464. ../../nan/nan.h:2298:62: warning: cast between incompatible function types from ‘void (*)(uv_work_t*)’ {aka ‘void (*)(uv_work_s*)’} to ‘uv_after_work_cb’ {aka ‘void (*)(uv_work_s*, int)’} [-Wcast-function-type]
  465. 2298 | , reinterpret_cast<uv_after_work_cb>(AsyncExecuteComplete)
  466. | ^
  467. ../src/promise_completion.cc: In static member function ‘static void PromiseCompletion::InitializeComponent()’:
  468. ../src/promise_completion.cc:12:40: error: no matching function for call to ‘v8::FunctionTemplate::GetFunction()’
  469. 12 | newFn.Reset(newTemplate->GetFunction());
  470. | ^
  471. In file included from /home/jack/.node-gyp/12.4.0/include/node/node.h:63,
  472. from ../../nan/nan.h:54,
  473. from ../src/../include/promise_completion.h:4,
  474. from ../src/promise_completion.cc:2:
  475. /home/jack/.node-gyp/12.4.0/include/node/v8.h:5947:46: note: candidate: ‘v8::MaybeLocal<v8::Function> v8::FunctionTemplate::GetFunction(v8::Local<v8::Context>)’
  476. 5947 | V8_WARN_UNUSED_RESULT MaybeLocal<Function> GetFunction(
  477. | ^~~~~~~~~~~
  478. /home/jack/.node-gyp/12.4.0/include/node/v8.h:5947:46: note: candidate expects 1 argument, 0 provided
  479. ../src/promise_completion.cc:14:88: error: no matching function for call to ‘v8::FunctionTemplate::GetFunction()’
  480. 14 | promiseFulfilled.Reset(Nan::New<v8::FunctionTemplate>(PromiseFulfilled)->GetFunction());
  481. | ^
  482. In file included from /home/jack/.node-gyp/12.4.0/include/node/node.h:63,
  483. from ../../nan/nan.h:54,
  484. from ../src/../include/promise_completion.h:4,
  485. from ../src/promise_completion.cc:2:
  486. /home/jack/.node-gyp/12.4.0/include/node/v8.h:5947:46: note: candidate: ‘v8::MaybeLocal<v8::Function> v8::FunctionTemplate::GetFunction(v8::Local<v8::Context>)’
  487. 5947 | V8_WARN_UNUSED_RESULT MaybeLocal<Function> GetFunction(
  488. | ^~~~~~~~~~~
  489. /home/jack/.node-gyp/12.4.0/include/node/v8.h:5947:46: note: candidate expects 1 argument, 0 provided
  490. ../src/promise_completion.cc:15:86: error: no matching function for call to ‘v8::FunctionTemplate::GetFunction()’
  491. 15 | promiseRejected.Reset(Nan::New<v8::FunctionTemplate>(PromiseRejected)->GetFunction());
  492. | ^
  493. In file included from /home/jack/.node-gyp/12.4.0/include/node/node.h:63,
  494. from ../../nan/nan.h:54,
  495. from ../src/../include/promise_completion.h:4,
  496. from ../src/promise_completion.cc:2:
  497. /home/jack/.node-gyp/12.4.0/include/node/v8.h:5947:46: note: candidate: ‘v8::MaybeLocal<v8::Function> v8::FunctionTemplate::GetFunction(v8::Local<v8::Context>)’
  498. 5947 | V8_WARN_UNUSED_RESULT MaybeLocal<Function> GetFunction(
  499. | ^~~~~~~~~~~
  500. /home/jack/.node-gyp/12.4.0/include/node/v8.h:5947:46: note: candidate expects 1 argument, 0 provided
  501. ../src/promise_completion.cc: In static member function ‘static bool PromiseCompletion::ForwardIfPromise(v8::Local<v8::Value>, AsyncBaton*, PromiseCompletion::Callback)’:
  502. ../src/promise_completion.cc:24:74: error: no matching function for call to ‘v8::Value::ToObject()’
  503. 24 | Nan::MaybeLocal<v8::Value> maybeThenProp = Nan::Get(result->ToObject(), Nan::New("then").ToLocalChecked());
  504. | ^
  505. In file included from /home/jack/.node-gyp/12.4.0/include/node/node.h:63,
  506. from ../../nan/nan.h:54,
  507. from ../src/../include/promise_completion.h:4,
  508. from ../src/promise_completion.cc:2:
  509. /home/jack/.node-gyp/12.4.0/include/node/v8.h:2532:44: note: candidate: ‘v8::MaybeLocal<v8::Object> v8::Value::ToObject(v8::Local<v8::Context>) const’
  510. 2532 | V8_WARN_UNUSED_RESULT MaybeLocal<Object> ToObject(
  511. | ^~~~~~~~
  512. /home/jack/.node-gyp/12.4.0/include/node/v8.h:2532:44: note: candidate expects 1 argument, 0 provided
  513. In file included from /home/jack/.node-gyp/12.4.0/include/node/v8-internal.h:14,
  514. from /home/jack/.node-gyp/12.4.0/include/node/v8.h:25,
  515. from /home/jack/.node-gyp/12.4.0/include/node/node.h:63,
  516. from ../../nan/nan.h:54,
  517. from ../src/../include/promise_completion.h:4,
  518. from ../src/promise_completion.cc:2:
  519. /home/jack/.node-gyp/12.4.0/include/node/v8.h:2546:35: note: candidate: ‘v8::Local<v8::Object> v8::Value::ToObject(v8::Isolate*) const’
  520. 2546 | Local<Object> ToObject(Isolate* isolate) const);
  521. | ^~~~~~~~
  522. /home/jack/.node-gyp/12.4.0/include/node/v8config.h:322:3: note: in definition of macro ‘V8_DEPRECATE_SOON’
  523. 322 | declarator __attribute__((deprecated(message)))
  524. | ^~~~~~~~~~
  525. /home/jack/.node-gyp/12.4.0/include/node/v8.h:2546:35: note: candidate expects 1 argument, 0 provided
  526. 2546 | Local<Object> ToObject(Isolate* isolate) const);
  527. | ^~~~~~~~
  528. /home/jack/.node-gyp/12.4.0/include/node/v8config.h:322:3: note: in definition of macro ‘V8_DEPRECATE_SOON’
  529. 322 | declarator __attribute__((deprecated(message)))
  530. | ^~~~~~~~~~
  531. ../src/promise_completion.cc: In member function ‘void PromiseCompletion::Setup(v8::Local<v8::Function>, v8::Local<v8::Value>, AsyncBaton*, PromiseCompletion::Callback)’:
  532. ../src/promise_completion.cc:57:52: error: no matching function for call to ‘v8::Value::ToObject()’
  533. 57 | v8::Local<v8::Object> promise = result->ToObject();
  534. | ^
  535. In file included from /home/jack/.node-gyp/12.4.0/include/node/node.h:63,
  536. from ../../nan/nan.h:54,
  537. from ../src/../include/promise_completion.h:4,
  538. from ../src/promise_completion.cc:2:
  539. /home/jack/.node-gyp/12.4.0/include/node/v8.h:2532:44: note: candidate: ‘v8::MaybeLocal<v8::Object> v8::Value::ToObject(v8::Local<v8::Context>) const’
  540. 2532 | V8_WARN_UNUSED_RESULT MaybeLocal<Object> ToObject(
  541. | ^~~~~~~~
  542. /home/jack/.node-gyp/12.4.0/include/node/v8.h:2532:44: note: candidate expects 1 argument, 0 provided
  543. In file included from /home/jack/.node-gyp/12.4.0/include/node/v8-internal.h:14,
  544. from /home/jack/.node-gyp/12.4.0/include/node/v8.h:25,
  545. from /home/jack/.node-gyp/12.4.0/include/node/node.h:63,
  546. from ../../nan/nan.h:54,
  547. from ../src/../include/promise_completion.h:4,
  548. from ../src/promise_completion.cc:2:
  549. /home/jack/.node-gyp/12.4.0/include/node/v8.h:2546:35: note: candidate: ‘v8::Local<v8::Object> v8::Value::ToObject(v8::Isolate*) const’
  550. 2546 | Local<Object> ToObject(Isolate* isolate) const);
  551. | ^~~~~~~~
  552. /home/jack/.node-gyp/12.4.0/include/node/v8config.h:322:3: note: in definition of macro ‘V8_DEPRECATE_SOON’
  553. 322 | declarator __attribute__((deprecated(message)))
  554. | ^~~~~~~~~~
  555. /home/jack/.node-gyp/12.4.0/include/node/v8.h:2546:35: note: candidate expects 1 argument, 0 provided
  556. 2546 | Local<Object> ToObject(Isolate* isolate) const);
  557. | ^~~~~~~~
  558. /home/jack/.node-gyp/12.4.0/include/node/v8config.h:322:3: note: in definition of macro ‘V8_DEPRECATE_SOON’
  559. 322 | declarator __attribute__((deprecated(message)))
  560. | ^~~~~~~~~~
  561. ../src/promise_completion.cc:67:46: warning: ‘v8::Local<v8::Value> Nan::Callback::Call(v8::Local<v8::Object>, int, v8::Local<v8::Value>*) const’ is deprecated [-Wdeprecated-declarations]
  562. 67 | Nan::Callback(thenFn).Call(promise, 2, argv);
  563. | ^
  564. In file included from ../src/../include/promise_completion.h:4,
  565. from ../src/promise_completion.cc:2:
  566. ../../nan/nan.h:1718:3: note: declared here
  567. 1718 | Call(v8::Local<v8::Object> target
  568. | ^~~~
  569. ../src/promise_completion.cc: In static member function ‘static v8::Local<v8::Value> PromiseCompletion::Bind(Nan::Persistent<v8::Function>&, v8::Local<v8::Object>)’:
  570. ../src/promise_completion.cc:81:61: error: no matching function for call to ‘v8::Function::Call(v8::Local<v8::Function>, int, v8::Local<v8::Value> [1])’
  571. 81 | return scope.Escape(bind->Call(Nan::New(function), 1, argv));
  572. | ^
  573. In file included from /home/jack/.node-gyp/12.4.0/include/node/node.h:63,
  574. from ../../nan/nan.h:54,
  575. from ../src/../include/promise_completion.h:4,
  576. from ../src/promise_completion.cc:2:
  577. /home/jack/.node-gyp/12.4.0/include/node/v8.h:4148:43: note: candidate: ‘v8::MaybeLocal<v8::Value> v8::Function::Call(v8::Local<v8::Context>, v8::Local<v8::Value>, int, v8::Local<v8::Value>*)’
  578. 4148 | V8_WARN_UNUSED_RESULT MaybeLocal<Value> Call(Local<Context> context,
  579. | ^~~~
  580. /home/jack/.node-gyp/12.4.0/include/node/v8.h:4148:43: note: candidate expects 4 arguments, 3 provided
  581. ../src/promise_completion.cc: In static member function ‘static void PromiseCompletion::CallCallback(bool, const Nan::FunctionCallbackInfo<v8::Value>&)’:
  582. ../src/promise_completion.cc:93:102: error: no matching function for call to ‘v8::Object::ToObject()’
  583. 93 | PromiseCompletion *promiseCompletion = ObjectWrap::Unwrap<PromiseCompletion>(info.This()->ToObject());
  584. | ^
  585. In file included from /home/jack/.node-gyp/12.4.0/include/node/node.h:63,
  586. from ../../nan/nan.h:54,
  587. from ../src/../include/promise_completion.h:4,
  588. from ../src/promise_completion.cc:2:
  589. /home/jack/.node-gyp/12.4.0/include/node/v8.h:2532:44: note: candidate: ‘v8::MaybeLocal<v8::Object> v8::Value::ToObject(v8::Local<v8::Context>) const’
  590. 2532 | V8_WARN_UNUSED_RESULT MaybeLocal<Object> ToObject(
  591. | ^~~~~~~~
  592. /home/jack/.node-gyp/12.4.0/include/node/v8.h:2532:44: note: candidate expects 1 argument, 0 provided
  593. In file included from /home/jack/.node-gyp/12.4.0/include/node/v8-internal.h:14,
  594. from /home/jack/.node-gyp/12.4.0/include/node/v8.h:25,
  595. from /home/jack/.node-gyp/12.4.0/include/node/node.h:63,
  596. from ../../nan/nan.h:54,
  597. from ../src/../include/promise_completion.h:4,
  598. from ../src/promise_completion.cc:2:
  599. /home/jack/.node-gyp/12.4.0/include/node/v8.h:2546:35: note: candidate: ‘v8::Local<v8::Object> v8::Value::ToObject(v8::Isolate*) const’
  600. 2546 | Local<Object> ToObject(Isolate* isolate) const);
  601. | ^~~~~~~~
  602. /home/jack/.node-gyp/12.4.0/include/node/v8config.h:322:3: note: in definition of macro ‘V8_DEPRECATE_SOON’
  603. 322 | declarator __attribute__((deprecated(message)))
  604. | ^~~~~~~~~~
  605. /home/jack/.node-gyp/12.4.0/include/node/v8.h:2546:35: note: candidate expects 1 argument, 0 provided
  606. 2546 | Local<Object> ToObject(Isolate* isolate) const);
  607. | ^~~~~~~~
  608. /home/jack/.node-gyp/12.4.0/include/node/v8config.h:322:3: note: in definition of macro ‘V8_DEPRECATE_SOON’
  609. 322 | declarator __attribute__((deprecated(message)))
  610. | ^~~~~~~~~~
  611. In file included from /home/jack/.node-gyp/12.4.0/include/node/node.h:63,
  612. from ../../nan/nan.h:54,
  613. from ../src/../include/promise_completion.h:4,
  614. from ../src/promise_completion.cc:2:
  615. /home/jack/.node-gyp/12.4.0/include/node/v8.h: In instantiation of ‘void v8::PersistentBase<T>::SetWeak(P*, typename v8::WeakCallbackInfo<P>::Callback, v8::WeakCallbackType) [with P = node::ObjectWrap; T = v8::Object; typename v8::WeakCallbackInfo<P>::Callback = void (*)(const v8::WeakCallbackInfo<node::ObjectWrap>&)]’:
  616. /home/jack/.node-gyp/12.4.0/include/node/node_object_wrap.h:84:78: required from here
  617. /home/jack/.node-gyp/12.4.0/include/node/v8.h:9817:16: warning: cast between incompatible function types from ‘v8::WeakCallbackInfo<node::ObjectWrap>::Callback’ {aka ‘void (*)(const v8::WeakCallbackInfo<node::ObjectWrap>&)’} to ‘Callback’ {aka ‘void (*)(const v8::WeakCallbackInfo<void>&)’} [-Wcast-function-type]
  618. 9817 | reinterpret_cast<Callback>(callback), type);
  619. | ^~~~~~~~~~~~~~~~~~~~~~~~~~~~~~~~~~~~
  620. /home/jack/.node-gyp/12.4.0/include/node/v8.h: In instantiation of ‘void v8::PersistentBase<T>::SetWeak(P*, typename v8::WeakCallbackInfo<P>::Callback, v8::WeakCallbackType) [with P = Nan::ObjectWrap; T = v8::Object; typename v8::WeakCallbackInfo<P>::Callback = void (*)(const v8::WeakCallbackInfo<Nan::ObjectWrap>&)]’:
  621. ../../nan/nan_object_wrap.h:65:61: required from here
  622. /home/jack/.node-gyp/12.4.0/include/node/v8.h:9817:16: warning: cast between incompatible function types from ‘v8::WeakCallbackInfo<Nan::ObjectWrap>::Callback’ {aka ‘void (*)(const v8::WeakCallbackInfo<Nan::ObjectWrap>&)’} to ‘Callback’ {aka ‘void (*)(const v8::WeakCallbackInfo<void>&)’} [-Wcast-function-type]
  623. make: *** [nodegit.target.mk:251: Release/obj.target/nodegit/src/promise_completion.o] Error 1
  624. make: Leaving directory '/home/jack/repos/site/site-content-server/node_modules/nodegit/build'
  625. gyp
  626. ERR! build error
  627. gyp ERR! stack Error: `make` failed with exit code: 2
  628. gyp
  629. ERR! stack at ChildProcess.onExit (/home/jack/.nvm/versions/node/v12.4.0/lib/node_modules/npm/node_modules/node-gyp/lib/build.js:262:23)
  630. gyp ERR! stack at ChildProcess.emit (events.js:200:13)
  631. gyp ERR!
  632. stack at Process.ChildProcess._handle.onexit (internal/child_process.js:272:12)
  633. gyp ERR!
  634. System Linux 5.1.11-arch1-1-ARCH
  635. gyp ERR! command "/home/jack/.nvm/versions/node/v12.4.0/bin/node" "/home/jack/.nvm/versions/node/v12.4.0/lib/node_modules/npm/node_modules/node-gyp/bin/node-gyp.js" "build" "--fallback-to-build" "--module=/home/jack/repos/site/site-content-server/node_modules/nodegit/build/Release/nodegit.node" "--module_name=nodegit" "--module_path=/home/jack/repos/site/site-content-server/node_modules/nodegit/build/Release" "--napi_version=4" "--node_abi_napi=napi" "--napi_build_version=0" "--node_napi_label=node-v72"
  636. gyp ERR! cwd /home/jack/repos/site/site-content-server/node_modules/nodegit
  637. gyp
  638. ERR! node -v v12.4.0
  639. gyp ERR!
  640. node-gyp -v v3.8.0
  641. gyp ERR! not ok
  642.  
  643. node-pre-gyp
  644. ERR! build error
  645. node-pre-gyp
  646. ERR! stack Error: Failed to execute '/home/jack/.nvm/versions/node/v12.4.0/bin/node /home/jack/.nvm/versions/node/v12.4.0/lib/node_modules/npm/node_modules/node-gyp/bin/node-gyp.js build --fallback-to-build --module=/home/jack/repos/site/site-content-server/node_modules/nodegit/build/Release/nodegit.node --module_name=nodegit --module_path=/home/jack/repos/site/site-content-server/node_modules/nodegit/build/Release --napi_version=4 --node_abi_napi=napi --napi_build_version=0 --node_napi_label=node-v72' (1)
  647. node-pre-gyp ERR! stack at ChildProcess.<anonymous> (/home/jack/repos/site/site-content-server/node_modules/node-pre-gyp/lib/util/compile.js:83:29)
  648. node-pre-gyp ERR!
  649. stack at ChildProcess.emit (events.js:200:13)
  650. node-pre-gyp ERR! stack at maybeClose (internal/child_process.js:1021:16)
  651. node-pre-gyp ERR! stack
  652. at Process.ChildProcess._handle.onexit (internal/child_process.js:283:5)
  653. node-pre-gyp
  654. ERR! System Linux 5.1.11-arch1-1-ARCH
  655. node-pre-gyp
  656. ERR! command "/home/jack/.nvm/versions/node/v12.4.0/bin/node" "/home/jack/repos/site/site-content-server/node_modules/.bin/node-pre-gyp" "install" "--fallback-to-build"
  657. node-pre-gyp ERR!
  658. cwd /home/jack/repos/site/site-content-server/node_modules/nodegit
  659. node-pre-gyp ERR!
  660. node -v v12.4.0
  661. node-pre-gyp ERR!
  662. node-pre-gyp -v v0.11.0
  663. node-pre-gyp ERR!
  664. not ok
  665. Failed to execute '/home/jack/.nvm/versions/node/v12.4.0/bin/node /home/jack/.nvm/versions/node/v12.4.0/lib/node_modules/npm/node_modules/node-gyp/bin/node-gyp.js build --fallback-to-build --module=/home/jack/repos/site/site-content-server/node_modules/nodegit/build/Release/nodegit.node --module_name=nodegit --module_path=/home/jack/repos/site/site-content-server/node_modules/nodegit/build/Release --napi_version=4 --node_abi_napi=napi --napi_build_version=0 --node_napi_label=node-v72' (1)
  666. [nodegit] ERROR - Could not finish install
  667. [nodegit] ERROR - finished with error code: 1
  668. npm ERR! code ELIFECYCLE
  669. npm ERR! errno 1
  670. npm ERR! [email protected] install: `node lifecycleScripts/preinstall && node lifecycleScripts/install`
  671. npm ERR! Exit status 1
  672. npm ERR!
  673. npm ERR! Failed at the [email protected] install script.
  674. npm ERR! This is probably not a problem with npm. There is likely additional logging output above.
  675.  
  676. npm ERR! A complete log of this run can be found in:
  677. npm ERR! /home/jack/.npm/_logs/2019-06-19T20_35_43_933Z-debug.log
Advertisement
Add Comment
Please, Sign In to add comment