longnguyenwp

npm run build:dev

Jul 23rd, 2024
124
0
Never
Not a member of Pastebin yet? Sign Up, it unlocks many cool features!
text 27.89 KB | None | 0 0
  1. > [email protected] build:dev /Applications/MAMP/htdocs/wpmldev/wp-content/plugins/sitepress-multilingual-cms
  2. > (cross-env WPML_BUILD_FRONTEND_CSS=1 webpack -p --mode development) && webpack --mode development
  3.  
  4. Browserslist: caniuse-lite is outdated. Please run:
  5. npx browserslist@latest --update-db
  6.  
  7. Why you should do it regularly:
  8. https://github.com/browserslist/browserslist#browsers-data-updating
  9. Hash: 60b041e6fb0273c1f14a
  10. Version: webpack 4.44.2
  11. Child
  12. Hash: 60b041e6fb0273c1f14a
  13. Time: 6793ms
  14. Built at: 07/23/2024 5:20:38 PM
  15. Asset Size Chunks Chunk Names
  16. js/language-switcher-navigation/app.js 1.53 KiB language-switcher-navigation [emitted] language-switcher-navigation
  17. js/language-switcher/app.js 1.47 KiB language-switcher [emitted] language-switcher
  18. js/styles/app.js 17.6 MiB styles [emitted] styles
  19. Entrypoint styles = js/language-switcher/app.js js/language-switcher-navigation/app.js js/styles/app.js
  20. [./src/js/blocks sync recursive ^(.*)index\.js$] ./src/js/blocks sync ^(.*)index\.js$ 234 bytes {styles} [built]
  21. [./src/js/blocks/LanguageSwitcher/attributes/advanced.js] 167 bytes {styles} [built]
  22. [./src/js/blocks/LanguageSwitcher/attributes/color.js] 5.11 KiB {styles} [built]
  23. [./src/js/blocks/LanguageSwitcher/attributes/dimensions.js] 11.2 KiB {styles} [built]
  24. [./src/js/blocks/LanguageSwitcher/attributes/display.js] 1.84 KiB {styles} [built]
  25. [./src/js/blocks/LanguageSwitcher/attributes/flag.js] 654 bytes {styles} [built]
  26. [./src/js/blocks/LanguageSwitcher/attributes/layout.js] 5.78 KiB {styles} [built]
  27. [./src/js/blocks/LanguageSwitcher/index.js] 2.74 KiB {styles} [built]
  28. [./src/js/blocks/NavigationLanguageSwitcher/index.js] 3.91 KiB {styles} [optional] [built]
  29. [./src/js/blocks/app.js] 594 bytes {styles} [built]
  30. [./src/js/blocks/categoryIcon.js] 821 bytes {styles} [built]
  31. [./src/js/blocks/constants.js] 198 bytes {styles} [built]
  32. [./src/js/blocks/editor-styles.scss] 874 bytes {styles} [built] [failed] [1 error]
  33. [@wordpress/blocks] external "window.wp.blocks" 42 bytes {styles} [built]
  34. [@wordpress/components] external "window.wp.components" 42 bytes {styles} [built]
  35. + 3177 hidden modules
  36.  
  37. ERROR in ./src/js/blocks/editor-styles.scss
  38. Module build failed (from ./node_modules/mini-css-extract-plugin/dist/loader.js):
  39. ModuleError: Module Error (from ./node_modules/sass-loader/dist/cjs.js):
  40. Node Sass does not yet support your current environment: OS X Unsupported architecture (arm64) with Node.js 14.x
  41. For more information on which environments are supported please see:
  42. https://github.com/sass/node-sass/releases/tag/v5.0.0
  43. at Object.emitError (/Applications/MAMP/htdocs/wpmldev/wp-content/plugins/sitepress-multilingual-cms/node_modules/webpack/lib/NormalModule.js:173:6)
  44. at getSassImplementation (/Applications/MAMP/htdocs/wpmldev/wp-content/plugins/sitepress-multilingual-cms/node_modules/sass-loader/dist/utils.js:59:21)
  45. at Object.loader (/Applications/MAMP/htdocs/wpmldev/wp-content/plugins/sitepress-multilingual-cms/node_modules/sass-loader/dist/index.js:35:59)
  46. @ ./src/js/blocks/app.js 2:0-30
  47.  
  48. ERROR in ./src/js/blocks/NavigationLanguageSwitcher/Styles/editor.scss
  49. Module build failed (from ./node_modules/mini-css-extract-plugin/dist/loader.js):
  50. ModuleError: Module Error (from ./node_modules/sass-loader/dist/cjs.js):
  51. Node Sass does not yet support your current environment: OS X Unsupported architecture (arm64) with Node.js 14.x
  52. For more information on which environments are supported please see:
  53. https://github.com/sass/node-sass/releases/tag/v5.0.0
  54. at Object.emitError (/Applications/MAMP/htdocs/wpmldev/wp-content/plugins/sitepress-multilingual-cms/node_modules/webpack/lib/NormalModule.js:173:6)
  55. at getSassImplementation (/Applications/MAMP/htdocs/wpmldev/wp-content/plugins/sitepress-multilingual-cms/node_modules/sass-loader/dist/utils.js:59:21)
  56. at Object.loader (/Applications/MAMP/htdocs/wpmldev/wp-content/plugins/sitepress-multilingual-cms/node_modules/sass-loader/dist/index.js:35:59)
  57. @ ./src/js/blocks/NavigationLanguageSwitcher/edit.js 19:0-30
  58. @ ./src/js/blocks/NavigationLanguageSwitcher/index.js
  59. @ ./src/js/blocks sync ^(.*)index\.js$
  60. @ ./src/js/blocks/app.js
  61.  
  62. ERROR in ./src/js/blocks/LanguageSwitcher/Styles/editor.scss
  63. Module build failed (from ./node_modules/mini-css-extract-plugin/dist/loader.js):
  64. ModuleError: Module Error (from ./node_modules/sass-loader/dist/cjs.js):
  65. Node Sass does not yet support your current environment: OS X Unsupported architecture (arm64) with Node.js 14.x
  66. For more information on which environments are supported please see:
  67. https://github.com/sass/node-sass/releases/tag/v5.0.0
  68. at Object.emitError (/Applications/MAMP/htdocs/wpmldev/wp-content/plugins/sitepress-multilingual-cms/node_modules/webpack/lib/NormalModule.js:173:6)
  69. at getSassImplementation (/Applications/MAMP/htdocs/wpmldev/wp-content/plugins/sitepress-multilingual-cms/node_modules/sass-loader/dist/utils.js:59:21)
  70. at Object.loader (/Applications/MAMP/htdocs/wpmldev/wp-content/plugins/sitepress-multilingual-cms/node_modules/sass-loader/dist/index.js:35:59)
  71. @ ./src/js/blocks/LanguageSwitcher/edit.js 14:0-30
  72. @ ./src/js/blocks/LanguageSwitcher/index.js
  73. @ ./src/js/blocks sync ^(.*)index\.js$
  74. @ ./src/js/blocks/app.js
  75.  
  76. ERROR in ./node_modules/antd/lib/slider/style/index.css
  77. Module build failed (from ./node_modules/mini-css-extract-plugin/dist/loader.js):
  78. ModuleError: Module Error (from ./node_modules/sass-loader/dist/cjs.js):
  79. Node Sass does not yet support your current environment: OS X Unsupported architecture (arm64) with Node.js 14.x
  80. For more information on which environments are supported please see:
  81. https://github.com/sass/node-sass/releases/tag/v5.0.0
  82. at Object.emitError (/Applications/MAMP/htdocs/wpmldev/wp-content/plugins/sitepress-multilingual-cms/node_modules/webpack/lib/NormalModule.js:173:6)
  83. at getSassImplementation (/Applications/MAMP/htdocs/wpmldev/wp-content/plugins/sitepress-multilingual-cms/node_modules/sass-loader/dist/utils.js:59:21)
  84. at Object.loader (/Applications/MAMP/htdocs/wpmldev/wp-content/plugins/sitepress-multilingual-cms/node_modules/sass-loader/dist/index.js:35:59)
  85. @ ./src/js/blocks/LanguageSwitcher/Components/Flag/Control.js 21:0-41
  86. @ ./src/js/blocks/NavigationLanguageSwitcher/edit.js
  87. @ ./src/js/blocks/NavigationLanguageSwitcher/index.js
  88. @ ./src/js/blocks sync ^(.*)index\.js$
  89. @ ./src/js/blocks/app.js
  90.  
  91. ERROR in ./node_modules/antd/lib/input-number/style/index.css
  92. Module build failed (from ./node_modules/mini-css-extract-plugin/dist/loader.js):
  93. ModuleError: Module Error (from ./node_modules/sass-loader/dist/cjs.js):
  94. Node Sass does not yet support your current environment: OS X Unsupported architecture (arm64) with Node.js 14.x
  95. For more information on which environments are supported please see:
  96. https://github.com/sass/node-sass/releases/tag/v5.0.0
  97. at Object.emitError (/Applications/MAMP/htdocs/wpmldev/wp-content/plugins/sitepress-multilingual-cms/node_modules/webpack/lib/NormalModule.js:173:6)
  98. at getSassImplementation (/Applications/MAMP/htdocs/wpmldev/wp-content/plugins/sitepress-multilingual-cms/node_modules/sass-loader/dist/utils.js:59:21)
  99. at Object.loader (/Applications/MAMP/htdocs/wpmldev/wp-content/plugins/sitepress-multilingual-cms/node_modules/sass-loader/dist/index.js:35:59)
  100. @ ./src/js/blocks/LanguageSwitcher/Components/Flag/Control.js 19:0-47
  101. @ ./src/js/blocks/NavigationLanguageSwitcher/edit.js
  102. @ ./src/js/blocks/NavigationLanguageSwitcher/index.js
  103. @ ./src/js/blocks sync ^(.*)index\.js$
  104. @ ./src/js/blocks/app.js
  105.  
  106. ERROR in ./node_modules/antd/lib/alert/style/index.css
  107. Module build failed (from ./node_modules/mini-css-extract-plugin/dist/loader.js):
  108. ModuleError: Module Error (from ./node_modules/sass-loader/dist/cjs.js):
  109. Node Sass does not yet support your current environment: OS X Unsupported architecture (arm64) with Node.js 14.x
  110. For more information on which environments are supported please see:
  111. https://github.com/sass/node-sass/releases/tag/v5.0.0
  112. at Object.emitError (/Applications/MAMP/htdocs/wpmldev/wp-content/plugins/sitepress-multilingual-cms/node_modules/webpack/lib/NormalModule.js:173:6)
  113. at getSassImplementation (/Applications/MAMP/htdocs/wpmldev/wp-content/plugins/sitepress-multilingual-cms/node_modules/sass-loader/dist/utils.js:59:21)
  114. at Object.loader (/Applications/MAMP/htdocs/wpmldev/wp-content/plugins/sitepress-multilingual-cms/node_modules/sass-loader/dist/index.js:35:59)
  115. @ ./src/js/blocks/LanguageSwitcher/Components/Flag/Control.js 22:0-40
  116. @ ./src/js/blocks/NavigationLanguageSwitcher/edit.js
  117. @ ./src/js/blocks/NavigationLanguageSwitcher/index.js
  118. @ ./src/js/blocks sync ^(.*)index\.js$
  119. @ ./src/js/blocks/app.js
  120.  
  121. ERROR in ./node_modules/antd/lib/select/style/index.css
  122. Module build failed (from ./node_modules/mini-css-extract-plugin/dist/loader.js):
  123. ModuleError: Module Error (from ./node_modules/sass-loader/dist/cjs.js):
  124. Node Sass does not yet support your current environment: OS X Unsupported architecture (arm64) with Node.js 14.x
  125. For more information on which environments are supported please see:
  126. https://github.com/sass/node-sass/releases/tag/v5.0.0
  127. at Object.emitError (/Applications/MAMP/htdocs/wpmldev/wp-content/plugins/sitepress-multilingual-cms/node_modules/webpack/lib/NormalModule.js:173:6)
  128. at getSassImplementation (/Applications/MAMP/htdocs/wpmldev/wp-content/plugins/sitepress-multilingual-cms/node_modules/sass-loader/dist/utils.js:59:21)
  129. at Object.loader (/Applications/MAMP/htdocs/wpmldev/wp-content/plugins/sitepress-multilingual-cms/node_modules/sass-loader/dist/index.js:35:59)
  130. @ ./src/js/blocks/LanguageSwitcher/Components/Flag/Control.js 20:0-41
  131. @ ./src/js/blocks/NavigationLanguageSwitcher/edit.js
  132. @ ./src/js/blocks/NavigationLanguageSwitcher/index.js
  133. @ ./src/js/blocks sync ^(.*)index\.js$
  134. @ ./src/js/blocks/app.js
  135. Child mini-css-extract-plugin node_modules/css-loader/dist/cjs.js??ref--9!node_modules/sass-loader/dist/cjs.js??ref--10!node_modules/postcss-loader/lib/index.js!node_modules/antd/lib/alert/style/index.css:
  136. Entrypoint mini-css-extract-plugin = *
  137. 1 module
  138.  
  139. ERROR in ./node_modules/antd/lib/alert/style/index.css (./node_modules/css-loader/dist/cjs.js??ref--9!./node_modules/sass-loader/dist/cjs.js??ref--10!./node_modules/postcss-loader/lib!./node_modules/antd/lib/alert/style/index.css)
  140. Module Error (from ./node_modules/sass-loader/dist/cjs.js):
  141. Node Sass does not yet support your current environment: OS X Unsupported architecture (arm64) with Node.js 14.x
  142. For more information on which environments are supported please see:
  143. https://github.com/sass/node-sass/releases/tag/v5.0.0
  144.  
  145. ERROR in ./node_modules/antd/lib/alert/style/index.css (./node_modules/css-loader/dist/cjs.js??ref--9!./node_modules/sass-loader/dist/cjs.js??ref--10!./node_modules/postcss-loader/lib!./node_modules/antd/lib/alert/style/index.css)
  146. Module build failed (from ./node_modules/css-loader/dist/cjs.js):
  147. Error: PostCSS received undefined instead of CSS string
  148. at new Input (/Applications/MAMP/htdocs/wpmldev/wp-content/plugins/sitepress-multilingual-cms/node_modules/css-loader/node_modules/postcss/lib/input.js:38:13)
  149. at parse (/Applications/MAMP/htdocs/wpmldev/wp-content/plugins/sitepress-multilingual-cms/node_modules/css-loader/node_modules/postcss/lib/parse.js:13:15)
  150. at new LazyResult (/Applications/MAMP/htdocs/wpmldev/wp-content/plugins/sitepress-multilingual-cms/node_modules/css-loader/node_modules/postcss/lib/lazy-result.js:64:16)
  151. at Processor.<anonymous> (/Applications/MAMP/htdocs/wpmldev/wp-content/plugins/sitepress-multilingual-cms/node_modules/css-loader/node_modules/postcss/lib/processor.js:142:12)
  152. at Processor.process (/Applications/MAMP/htdocs/wpmldev/wp-content/plugins/sitepress-multilingual-cms/node_modules/css-loader/node_modules/postcss/lib/processor.js:121:23)
  153. at Object.loader (/Applications/MAMP/htdocs/wpmldev/wp-content/plugins/sitepress-multilingual-cms/node_modules/css-loader/dist/index.js:140:51)
  154. Child mini-css-extract-plugin node_modules/css-loader/dist/cjs.js??ref--9!node_modules/sass-loader/dist/cjs.js??ref--10!node_modules/postcss-loader/lib/index.js!node_modules/antd/lib/input-number/style/index.css:
  155. Entrypoint mini-css-extract-plugin = *
  156. 1 module
  157.  
  158. ERROR in ./node_modules/antd/lib/input-number/style/index.css (./node_modules/css-loader/dist/cjs.js??ref--9!./node_modules/sass-loader/dist/cjs.js??ref--10!./node_modules/postcss-loader/lib!./node_modules/antd/lib/input-number/style/index.css)
  159. Module Error (from ./node_modules/sass-loader/dist/cjs.js):
  160. Node Sass does not yet support your current environment: OS X Unsupported architecture (arm64) with Node.js 14.x
  161. For more information on which environments are supported please see:
  162. https://github.com/sass/node-sass/releases/tag/v5.0.0
  163.  
  164. ERROR in ./node_modules/antd/lib/input-number/style/index.css (./node_modules/css-loader/dist/cjs.js??ref--9!./node_modules/sass-loader/dist/cjs.js??ref--10!./node_modules/postcss-loader/lib!./node_modules/antd/lib/input-number/style/index.css)
  165. Module build failed (from ./node_modules/css-loader/dist/cjs.js):
  166. Error: PostCSS received undefined instead of CSS string
  167. at new Input (/Applications/MAMP/htdocs/wpmldev/wp-content/plugins/sitepress-multilingual-cms/node_modules/css-loader/node_modules/postcss/lib/input.js:38:13)
  168. at parse (/Applications/MAMP/htdocs/wpmldev/wp-content/plugins/sitepress-multilingual-cms/node_modules/css-loader/node_modules/postcss/lib/parse.js:13:15)
  169. at new LazyResult (/Applications/MAMP/htdocs/wpmldev/wp-content/plugins/sitepress-multilingual-cms/node_modules/css-loader/node_modules/postcss/lib/lazy-result.js:64:16)
  170. at Processor.<anonymous> (/Applications/MAMP/htdocs/wpmldev/wp-content/plugins/sitepress-multilingual-cms/node_modules/css-loader/node_modules/postcss/lib/processor.js:142:12)
  171. at Processor.process (/Applications/MAMP/htdocs/wpmldev/wp-content/plugins/sitepress-multilingual-cms/node_modules/css-loader/node_modules/postcss/lib/processor.js:121:23)
  172. at Object.loader (/Applications/MAMP/htdocs/wpmldev/wp-content/plugins/sitepress-multilingual-cms/node_modules/css-loader/dist/index.js:140:51)
  173. Child mini-css-extract-plugin node_modules/css-loader/dist/cjs.js??ref--9!node_modules/sass-loader/dist/cjs.js??ref--10!node_modules/postcss-loader/lib/index.js!node_modules/antd/lib/select/style/index.css:
  174. Entrypoint mini-css-extract-plugin = *
  175. 1 module
  176.  
  177. ERROR in ./node_modules/antd/lib/select/style/index.css (./node_modules/css-loader/dist/cjs.js??ref--9!./node_modules/sass-loader/dist/cjs.js??ref--10!./node_modules/postcss-loader/lib!./node_modules/antd/lib/select/style/index.css)
  178. Module Error (from ./node_modules/sass-loader/dist/cjs.js):
  179. Node Sass does not yet support your current environment: OS X Unsupported architecture (arm64) with Node.js 14.x
  180. For more information on which environments are supported please see:
  181. https://github.com/sass/node-sass/releases/tag/v5.0.0
  182.  
  183. ERROR in ./node_modules/antd/lib/select/style/index.css (./node_modules/css-loader/dist/cjs.js??ref--9!./node_modules/sass-loader/dist/cjs.js??ref--10!./node_modules/postcss-loader/lib!./node_modules/antd/lib/select/style/index.css)
  184. Module build failed (from ./node_modules/css-loader/dist/cjs.js):
  185. Error: PostCSS received undefined instead of CSS string
  186. at new Input (/Applications/MAMP/htdocs/wpmldev/wp-content/plugins/sitepress-multilingual-cms/node_modules/css-loader/node_modules/postcss/lib/input.js:38:13)
  187. at parse (/Applications/MAMP/htdocs/wpmldev/wp-content/plugins/sitepress-multilingual-cms/node_modules/css-loader/node_modules/postcss/lib/parse.js:13:15)
  188. at new LazyResult (/Applications/MAMP/htdocs/wpmldev/wp-content/plugins/sitepress-multilingual-cms/node_modules/css-loader/node_modules/postcss/lib/lazy-result.js:64:16)
  189. at Processor.<anonymous> (/Applications/MAMP/htdocs/wpmldev/wp-content/plugins/sitepress-multilingual-cms/node_modules/css-loader/node_modules/postcss/lib/processor.js:142:12)
  190. at Processor.process (/Applications/MAMP/htdocs/wpmldev/wp-content/plugins/sitepress-multilingual-cms/node_modules/css-loader/node_modules/postcss/lib/processor.js:121:23)
  191. at Object.loader (/Applications/MAMP/htdocs/wpmldev/wp-content/plugins/sitepress-multilingual-cms/node_modules/css-loader/dist/index.js:140:51)
  192. Child mini-css-extract-plugin node_modules/css-loader/dist/cjs.js??ref--9!node_modules/sass-loader/dist/cjs.js??ref--10!node_modules/postcss-loader/lib/index.js!node_modules/antd/lib/slider/style/index.css:
  193. Entrypoint mini-css-extract-plugin = *
  194. 1 module
  195.  
  196. ERROR in ./node_modules/antd/lib/slider/style/index.css (./node_modules/css-loader/dist/cjs.js??ref--9!./node_modules/sass-loader/dist/cjs.js??ref--10!./node_modules/postcss-loader/lib!./node_modules/antd/lib/slider/style/index.css)
  197. Module Error (from ./node_modules/sass-loader/dist/cjs.js):
  198. Node Sass does not yet support your current environment: OS X Unsupported architecture (arm64) with Node.js 14.x
  199. For more information on which environments are supported please see:
  200. https://github.com/sass/node-sass/releases/tag/v5.0.0
  201.  
  202. ERROR in ./node_modules/antd/lib/slider/style/index.css (./node_modules/css-loader/dist/cjs.js??ref--9!./node_modules/sass-loader/dist/cjs.js??ref--10!./node_modules/postcss-loader/lib!./node_modules/antd/lib/slider/style/index.css)
  203. Module build failed (from ./node_modules/css-loader/dist/cjs.js):
  204. Error: PostCSS received undefined instead of CSS string
  205. at new Input (/Applications/MAMP/htdocs/wpmldev/wp-content/plugins/sitepress-multilingual-cms/node_modules/css-loader/node_modules/postcss/lib/input.js:38:13)
  206. at parse (/Applications/MAMP/htdocs/wpmldev/wp-content/plugins/sitepress-multilingual-cms/node_modules/css-loader/node_modules/postcss/lib/parse.js:13:15)
  207. at new LazyResult (/Applications/MAMP/htdocs/wpmldev/wp-content/plugins/sitepress-multilingual-cms/node_modules/css-loader/node_modules/postcss/lib/lazy-result.js:64:16)
  208. at Processor.<anonymous> (/Applications/MAMP/htdocs/wpmldev/wp-content/plugins/sitepress-multilingual-cms/node_modules/css-loader/node_modules/postcss/lib/processor.js:142:12)
  209. at Processor.process (/Applications/MAMP/htdocs/wpmldev/wp-content/plugins/sitepress-multilingual-cms/node_modules/css-loader/node_modules/postcss/lib/processor.js:121:23)
  210. at Object.loader (/Applications/MAMP/htdocs/wpmldev/wp-content/plugins/sitepress-multilingual-cms/node_modules/css-loader/dist/index.js:140:51)
  211. Child mini-css-extract-plugin node_modules/css-loader/dist/cjs.js??ref--9!node_modules/sass-loader/dist/cjs.js??ref--10!node_modules/postcss-loader/lib/index.js!src/js/blocks/LanguageSwitcher/Styles/editor.scss:
  212. Entrypoint mini-css-extract-plugin = *
  213. [./node_modules/css-loader/dist/cjs.js?!./node_modules/sass-loader/dist/cjs.js?!./node_modules/postcss-loader/lib/index.js!./src/js/blocks/LanguageSwitcher/Styles/editor.scss] ./node_modules/css-loader/dist/cjs.js??ref--9!./node_modules/sass-loader/dist/cjs.js??ref--10!./node_modules/postcss-loader/lib!./src/js/blocks/LanguageSwitcher/Styles/editor.scss 1.12 KiB {mini-css-extract-plugin} [built] [failed] [2 errors]
  214.  
  215. ERROR in ./src/js/blocks/LanguageSwitcher/Styles/editor.scss (./node_modules/css-loader/dist/cjs.js??ref--9!./node_modules/sass-loader/dist/cjs.js??ref--10!./node_modules/postcss-loader/lib!./src/js/blocks/LanguageSwitcher/Styles/editor.scss)
  216. Module Error (from ./node_modules/sass-loader/dist/cjs.js):
  217. Node Sass does not yet support your current environment: OS X Unsupported architecture (arm64) with Node.js 14.x
  218. For more information on which environments are supported please see:
  219. https://github.com/sass/node-sass/releases/tag/v5.0.0
  220.  
  221. ERROR in ./src/js/blocks/LanguageSwitcher/Styles/editor.scss (./node_modules/css-loader/dist/cjs.js??ref--9!./node_modules/sass-loader/dist/cjs.js??ref--10!./node_modules/postcss-loader/lib!./src/js/blocks/LanguageSwitcher/Styles/editor.scss)
  222. Module build failed (from ./node_modules/css-loader/dist/cjs.js):
  223. Error: PostCSS received undefined instead of CSS string
  224. at new Input (/Applications/MAMP/htdocs/wpmldev/wp-content/plugins/sitepress-multilingual-cms/node_modules/css-loader/node_modules/postcss/lib/input.js:38:13)
  225. at parse (/Applications/MAMP/htdocs/wpmldev/wp-content/plugins/sitepress-multilingual-cms/node_modules/css-loader/node_modules/postcss/lib/parse.js:13:15)
  226. at new LazyResult (/Applications/MAMP/htdocs/wpmldev/wp-content/plugins/sitepress-multilingual-cms/node_modules/css-loader/node_modules/postcss/lib/lazy-result.js:64:16)
  227. at Processor.<anonymous> (/Applications/MAMP/htdocs/wpmldev/wp-content/plugins/sitepress-multilingual-cms/node_modules/css-loader/node_modules/postcss/lib/processor.js:142:12)
  228. at Processor.process (/Applications/MAMP/htdocs/wpmldev/wp-content/plugins/sitepress-multilingual-cms/node_modules/css-loader/node_modules/postcss/lib/processor.js:121:23)
  229. at Object.loader (/Applications/MAMP/htdocs/wpmldev/wp-content/plugins/sitepress-multilingual-cms/node_modules/css-loader/dist/index.js:140:51)
  230. Child mini-css-extract-plugin node_modules/css-loader/dist/cjs.js??ref--9!node_modules/sass-loader/dist/cjs.js??ref--10!node_modules/postcss-loader/lib/index.js!src/js/blocks/NavigationLanguageSwitcher/Styles/editor.scss:
  231. Entrypoint mini-css-extract-plugin = *
  232. [./node_modules/css-loader/dist/cjs.js?!./node_modules/sass-loader/dist/cjs.js?!./node_modules/postcss-loader/lib/index.js!./src/js/blocks/NavigationLanguageSwitcher/Styles/editor.scss] ./node_modules/css-loader/dist/cjs.js??ref--9!./node_modules/sass-loader/dist/cjs.js??ref--10!./node_modules/postcss-loader/lib!./src/js/blocks/NavigationLanguageSwitcher/Styles/editor.scss 1.12 KiB {mini-css-extract-plugin} [built] [failed] [2 errors]
  233.  
  234. ERROR in ./src/js/blocks/NavigationLanguageSwitcher/Styles/editor.scss (./node_modules/css-loader/dist/cjs.js??ref--9!./node_modules/sass-loader/dist/cjs.js??ref--10!./node_modules/postcss-loader/lib!./src/js/blocks/NavigationLanguageSwitcher/Styles/editor.scss)
  235. Module Error (from ./node_modules/sass-loader/dist/cjs.js):
  236. Node Sass does not yet support your current environment: OS X Unsupported architecture (arm64) with Node.js 14.x
  237. For more information on which environments are supported please see:
  238. https://github.com/sass/node-sass/releases/tag/v5.0.0
  239.  
  240. ERROR in ./src/js/blocks/NavigationLanguageSwitcher/Styles/editor.scss (./node_modules/css-loader/dist/cjs.js??ref--9!./node_modules/sass-loader/dist/cjs.js??ref--10!./node_modules/postcss-loader/lib!./src/js/blocks/NavigationLanguageSwitcher/Styles/editor.scss)
  241. Module build failed (from ./node_modules/css-loader/dist/cjs.js):
  242. Error: PostCSS received undefined instead of CSS string
  243. at new Input (/Applications/MAMP/htdocs/wpmldev/wp-content/plugins/sitepress-multilingual-cms/node_modules/css-loader/node_modules/postcss/lib/input.js:38:13)
  244. at parse (/Applications/MAMP/htdocs/wpmldev/wp-content/plugins/sitepress-multilingual-cms/node_modules/css-loader/node_modules/postcss/lib/parse.js:13:15)
  245. at new LazyResult (/Applications/MAMP/htdocs/wpmldev/wp-content/plugins/sitepress-multilingual-cms/node_modules/css-loader/node_modules/postcss/lib/lazy-result.js:64:16)
  246. at Processor.<anonymous> (/Applications/MAMP/htdocs/wpmldev/wp-content/plugins/sitepress-multilingual-cms/node_modules/css-loader/node_modules/postcss/lib/processor.js:142:12)
  247. at Processor.process (/Applications/MAMP/htdocs/wpmldev/wp-content/plugins/sitepress-multilingual-cms/node_modules/css-loader/node_modules/postcss/lib/processor.js:121:23)
  248. at Object.loader (/Applications/MAMP/htdocs/wpmldev/wp-content/plugins/sitepress-multilingual-cms/node_modules/css-loader/dist/index.js:140:51)
  249. Child mini-css-extract-plugin node_modules/css-loader/dist/cjs.js??ref--9!node_modules/sass-loader/dist/cjs.js??ref--10!node_modules/postcss-loader/lib/index.js!src/js/blocks/editor-styles.scss:
  250. Entrypoint mini-css-extract-plugin = *
  251. [./node_modules/css-loader/dist/cjs.js?!./node_modules/sass-loader/dist/cjs.js?!./node_modules/postcss-loader/lib/index.js!./src/js/blocks/editor-styles.scss] ./node_modules/css-loader/dist/cjs.js??ref--9!./node_modules/sass-loader/dist/cjs.js??ref--10!./node_modules/postcss-loader/lib!./src/js/blocks/editor-styles.scss 1.12 KiB {mini-css-extract-plugin} [built] [failed] [2 errors]
  252.  
  253. ERROR in ./src/js/blocks/editor-styles.scss (./node_modules/css-loader/dist/cjs.js??ref--9!./node_modules/sass-loader/dist/cjs.js??ref--10!./node_modules/postcss-loader/lib!./src/js/blocks/editor-styles.scss)
  254. Module Error (from ./node_modules/sass-loader/dist/cjs.js):
  255. Node Sass does not yet support your current environment: OS X Unsupported architecture (arm64) with Node.js 14.x
  256. For more information on which environments are supported please see:
  257. https://github.com/sass/node-sass/releases/tag/v5.0.0
  258.  
  259. ERROR in ./src/js/blocks/editor-styles.scss (./node_modules/css-loader/dist/cjs.js??ref--9!./node_modules/sass-loader/dist/cjs.js??ref--10!./node_modules/postcss-loader/lib!./src/js/blocks/editor-styles.scss)
  260. Module build failed (from ./node_modules/css-loader/dist/cjs.js):
  261. Error: PostCSS received undefined instead of CSS string
  262. at new Input (/Applications/MAMP/htdocs/wpmldev/wp-content/plugins/sitepress-multilingual-cms/node_modules/css-loader/node_modules/postcss/lib/input.js:38:13)
  263. at parse (/Applications/MAMP/htdocs/wpmldev/wp-content/plugins/sitepress-multilingual-cms/node_modules/css-loader/node_modules/postcss/lib/parse.js:13:15)
  264. at new LazyResult (/Applications/MAMP/htdocs/wpmldev/wp-content/plugins/sitepress-multilingual-cms/node_modules/css-loader/node_modules/postcss/lib/lazy-result.js:64:16)
  265. at Processor.<anonymous> (/Applications/MAMP/htdocs/wpmldev/wp-content/plugins/sitepress-multilingual-cms/node_modules/css-loader/node_modules/postcss/lib/processor.js:142:12)
  266. at Processor.process (/Applications/MAMP/htdocs/wpmldev/wp-content/plugins/sitepress-multilingual-cms/node_modules/css-loader/node_modules/postcss/lib/processor.js:121:23)
  267. at Object.loader (/Applications/MAMP/htdocs/wpmldev/wp-content/plugins/sitepress-multilingual-cms/node_modules/css-loader/dist/index.js:140:51)
  268. npm ERR! code ELIFECYCLE
  269. npm ERR! errno 2
  270. npm ERR! [email protected] build:dev: `(cross-env WPML_BUILD_FRONTEND_CSS=1 webpack -p --mode development) && webpack --mode development`
  271. npm ERR! Exit status 2
  272. npm ERR!
  273. npm ERR! Failed at the [email protected] build:dev script.
  274. npm ERR! This is probably not a problem with npm. There is likely additional logging output above.
  275.  
  276. npm ERR! A complete log of this run can be found in:
  277. npm ERR! /Users/longnguyen/.npm/_logs/2024-07-23T10_20_38_225Z-debug.log
  278.  
Advertisement
Add Comment
Please, Sign In to add comment