Guest User

Untitled

a guest
Nov 26th, 2020
20
Never
Not a member of Pastebin yet? Sign Up, it unlocks many cool features!
  1. Step 5/37 : RUN set -eux; cd /tmp && curl -s -o ${saxon}.zip https://www.saxonica.com/saxon-c/${saxon}.zip; unzip ${saxon}.zip; ./${saxon} -batch -dest /tmp/saxon; cp /tmp/saxon/libsaxonhec.so /usr/lib/; cp -r /tmp/saxon/rt /usr/lib; ldconfig; cd /tmp/saxon/Saxon.C.API/; sed -i 's/#define PHP_SAXON_EXTNAME "Saxon\/C"/#define PHP_SAXON_EXTNAME "SaxonC"/g' php_saxon.h; phpize; ./configure --enable-saxon; make -j$(nproc); make install; docker-php-ext-enable saxon; rm -rf /tmp/${saxon}.zip /tmp/${saxon} /tmp/saxon;
  2. ---> Running in 56962553e49b
  3. + cd /tmp
  4. + curl -s -o libsaxon-HEC-setup64-v1.2.1.zip https://www.saxonica.com/saxon-c/libsaxon-HEC-setup64-v1.2.1.zip
  5. + unzip libsaxon-HEC-setup64-v1.2.1.zip
  6. Archive: libsaxon-HEC-setup64-v1.2.1.zip
  7. inflating: libsaxon-HEC-setup64-v1.2.1
  8. + ./libsaxon-HEC-setup64-v1.2.1 -batch -dest /tmp/saxon
  9. /tmp/saxon/command/jni/unix/jni_md.h
  10. /tmp/saxon/command/jni/win32/jni_md.h
  11. /tmp/saxon/command/jni/jni.h
  12. /tmp/saxon/command/buildhec-command.sh
  13. /tmp/saxon/command/Query.c
  14. /tmp/saxon/command/temp.xml
  15. /tmp/saxon/command/Transform.c
  16. /tmp/saxon/command/Validate.c
  17. /tmp/saxon/notices/CERN.txt
  18. /tmp/saxon/notices/JAMESCLARK.txt
  19. /tmp/saxon/notices/LICENSE.txt
  20. /tmp/saxon/notices/THAI.txt
  21. /tmp/saxon/notices/UNICODE.txt
  22. /tmp/saxon/rt/bin/unpack200
  23. /tmp/saxon/rt/lib/amd64/jetvm/libjvm.so
  24. /tmp/saxon/rt/lib/amd64/jvm.cfg
  25. /tmp/saxon/rt/lib/amd64/libawt_headless.so
  26. /tmp/saxon/rt/lib/amd64/libawt_xawt.so
  27. /tmp/saxon/rt/lib/amd64/libawt.so
  28. /tmp/saxon/rt/lib/amd64/libfontmanager.so
  29. /tmp/saxon/rt/lib/amd64/libj2gss.so
  30. /tmp/saxon/rt/lib/amd64/libj2pcsc.so
  31. /tmp/saxon/rt/lib/amd64/libj2pkcs11.so
  32. /tmp/saxon/rt/lib/amd64/libjaas_unix.so
  33. /tmp/saxon/rt/lib/amd64/libjava.so
  34. /tmp/saxon/rt/lib/amd64/libjawt.so
  35. /tmp/saxon/rt/lib/amd64/libjpeg.so
  36. /tmp/saxon/rt/lib/amd64/libjsound.so
  37. /tmp/saxon/rt/lib/amd64/libjsoundalsa.so
  38. /tmp/saxon/rt/lib/amd64/liblcms.so
  39. /tmp/saxon/rt/lib/amd64/libmlib_image.so
  40. /tmp/saxon/rt/lib/amd64/libnet.so
  41. /tmp/saxon/rt/lib/amd64/libnio.so
  42. /tmp/saxon/rt/lib/amd64/libsctp.so
  43. /tmp/saxon/rt/lib/amd64/libsunec.so
  44. /tmp/saxon/rt/lib/amd64/libunpack.so
  45. /tmp/saxon/rt/lib/amd64/libzip.so
  46. /tmp/saxon/rt/lib/cmm/CIEXYZ.pf
  47. /tmp/saxon/rt/lib/cmm/GRAY.pf
  48. /tmp/saxon/rt/lib/cmm/LINEAR_RGB.pf
  49. /tmp/saxon/rt/lib/cmm/PYCC.pf
  50. /tmp/saxon/rt/lib/cmm/sRGB.pf
  51. /tmp/saxon/rt/lib/ext/localedata.jar.pack
  52. /tmp/saxon/rt/lib/ext/meta-index
  53. /tmp/saxon/rt/lib/ext/sunec.jar
  54. /tmp/saxon/rt/lib/ext/sunjce_provider.jar
  55. /tmp/saxon/rt/lib/ext/sunpkcs11.jar
  56. /tmp/saxon/rt/lib/images/cursors/cursors.properties
  57. /tmp/saxon/rt/lib/images/cursors/invalid32x32.gif
  58. /tmp/saxon/rt/lib/images/cursors/motif_CopyDrop32x32.gif
  59. /tmp/saxon/rt/lib/images/cursors/motif_CopyNoDrop32x32.gif
  60. /tmp/saxon/rt/lib/images/cursors/motif_LinkDrop32x32.gif
  61. /tmp/saxon/rt/lib/images/cursors/motif_LinkNoDrop32x32.gif
  62. /tmp/saxon/rt/lib/images/cursors/motif_MoveDrop32x32.gif
  63. /tmp/saxon/rt/lib/images/cursors/motif_MoveNoDrop32x32.gif
  64. /tmp/saxon/rt/lib/management/jmxremote.access
  65. /tmp/saxon/rt/lib/management/jmxremote.password.template
  66. /tmp/saxon/rt/lib/management/management.properties
  67. /tmp/saxon/rt/lib/management/snmp.acl.template
  68. /tmp/saxon/rt/lib/security/policy/limited/local_policy.jar
  69. /tmp/saxon/rt/lib/security/policy/limited/US_export_policy.jar
  70. /tmp/saxon/rt/lib/security/policy/unlimited/local_policy.jar
  71. /tmp/saxon/rt/lib/security/policy/unlimited/US_export_policy.jar
  72. /tmp/saxon/rt/lib/security/blacklisted.certs
  73. /tmp/saxon/rt/lib/security/cacerts
  74. /tmp/saxon/rt/lib/security/java.policy
  75. /tmp/saxon/rt/lib/security/java.security
  76. /tmp/saxon/rt/lib/calendars.properties
  77. /tmp/saxon/rt/lib/charsets.jar.pack
  78. /tmp/saxon/rt/lib/content-types.properties
  79. /tmp/saxon/rt/lib/currency.data
  80. /tmp/saxon/rt/lib/flavormap.properties
  81. /tmp/saxon/rt/lib/hijrah-config-umalqura.properties
  82. /tmp/saxon/rt/lib/jce.jar
  83. /tmp/saxon/rt/lib/jsse.jar.pack
  84. /tmp/saxon/rt/lib/locales
  85. /tmp/saxon/rt/lib/logging.properties
  86. /tmp/saxon/rt/lib/meta-index
  87. /tmp/saxon/rt/lib/net.properties
  88. /tmp/saxon/rt/lib/psfont.properties.ja
  89. /tmp/saxon/rt/lib/psfontj2d.properties
  90. /tmp/saxon/rt/lib/resources.jar.pack
  91. /tmp/saxon/rt/lib/rt.jar.pack
  92. /tmp/saxon/rt/lib/sound.properties
  93. /tmp/saxon/rt/lib/tzdb.dat
  94. /tmp/saxon/samples/cppTests/build64-linux.sh
  95. /tmp/saxon/samples/cppTests/cat.xml
  96. /tmp/saxon/samples/cppTests/catalog.xml
  97. /tmp/saxon/samples/cppTests/catOutput.xml
  98. /tmp/saxon/samples/cppTests/cppExtensionFunction.cpp
  99. /tmp/saxon/samples/cppTests/cppExtensionFunction.so
  100. /tmp/saxon/samples/cppTests/cppTestUnits.h
  101. /tmp/saxon/samples/cppTests/family.xml
  102. /tmp/saxon/samples/cppTests/family.xsd
  103. /tmp/saxon/samples/cppTests/family-ext.xsd
  104. /tmp/saxon/samples/cppTests/q12.xsl
  105. /tmp/saxon/samples/cppTests/stylesheet1.xsl
  106. /tmp/saxon/samples/cppTests/test.xsl
  107. /tmp/saxon/samples/cppTests/test2.xsl
  108. /tmp/saxon/samples/cppTests/testExtension.xsl
  109. /tmp/saxon/samples/cppTests/testValidator
  110. /tmp/saxon/samples/cppTests/testValidator.cpp
  111. /tmp/saxon/samples/cppTests/testXPath.cpp
  112. /tmp/saxon/samples/cppTests/testXQuery.cpp
  113. /tmp/saxon/samples/cppTests/testXSLT.cpp
  114. /tmp/saxon/samples/cppTests/testXSLT30
  115. /tmp/saxon/samples/cppTests/testXSLT30.cpp
  116. /tmp/saxon/samples/cppTests/xslt30UnitTests.cpp
  117. /tmp/saxon/samples/cTests/build.sh
  118. /tmp/saxon/samples/cTests/build64-linux.sh
  119. /tmp/saxon/samples/cTests/build64-mac.sh
  120. /tmp/saxon/samples/cTests/buildhec.sh
  121. /tmp/saxon/samples/cTests/build-linux.sh
  122. /tmp/saxon/samples/cTests/buildpec.sh
  123. /tmp/saxon/samples/cTests/cat.xml
  124. /tmp/saxon/samples/cTests/test.xsl
  125. /tmp/saxon/samples/cTests/testXPath
  126. /tmp/saxon/samples/cTests/testXPath.c
  127. /tmp/saxon/samples/cTests/testXQuery
  128. /tmp/saxon/samples/cTests/testXQuery.c
  129. /tmp/saxon/samples/cTests/testXSLT
  130. /tmp/saxon/samples/cTests/testXSLT.c
  131. /tmp/saxon/samples/data/._.DS_Store
  132. /tmp/saxon/samples/data/._books.xml
  133. /tmp/saxon/samples/data/.DS_Store
  134. /tmp/saxon/samples/data/books.dtd
  135. /tmp/saxon/samples/data/books.xml
  136. /tmp/saxon/samples/data/books.xsd
  137. /tmp/saxon/samples/data/books-invalid.xml
  138. /tmp/saxon/samples/data/cat.xml
  139. /tmp/saxon/samples/data/config.xml
  140. /tmp/saxon/samples/data/more-books.xml
  141. /tmp/saxon/samples/data/othello.xml
  142. /tmp/saxon/samples/data/output.xml
  143. /tmp/saxon/samples/data/output2.xml
  144. /tmp/saxon/samples/data/play.dtd
  145. /tmp/saxon/samples/data/test.xsl
  146. /tmp/saxon/samples/php/catalog-test/catalog.xml
  147. /tmp/saxon/samples/php/catalog-test/catalog2.xml
  148. /tmp/saxon/samples/php/catalog-test/catalogExample.php
  149. /tmp/saxon/samples/php/catalog-test/example.ent
  150. /tmp/saxon/samples/php/catalog-test/example.xml
  151. /tmp/saxon/samples/php/catalog-test/test.xsd
  152. /tmp/saxon/samples/php/catalog-test/test.xsl
  153. /tmp/saxon/samples/php/catalog-test/test1.xsd
  154. /tmp/saxon/samples/php/catalog-test/test1.xsl
  155. /tmp/saxon/samples/php/catalog-test/test2.xsl
  156. /tmp/saxon/samples/php/query/books.dtd
  157. /tmp/saxon/samples/php/query/books.xml
  158. /tmp/saxon/samples/php/query/books.xsd
  159. /tmp/saxon/samples/php/query/books-to-html.xq
  160. /tmp/saxon/samples/php/trax/xml/subdir1/subdir2/foo3.xml
  161. /tmp/saxon/samples/php/trax/xml/subdir1/foo2.xml
  162. /tmp/saxon/samples/php/trax/xml/baz.xml
  163. /tmp/saxon/samples/php/trax/xml/cities.xml
  164. /tmp/saxon/samples/php/trax/xml/embedded.xml
  165. /tmp/saxon/samples/php/trax/xml/foo.xml
  166. /tmp/saxon/samples/php/trax/xml/misc.txt
  167. /tmp/saxon/samples/php/trax/xml/withentityref.xml
  168. /tmp/saxon/samples/php/trax/xsl/inc1/inc2/inc2.xsl
  169. /tmp/saxon/samples/php/trax/xsl/inc1/inc1.xsl
  170. /tmp/saxon/samples/php/trax/xsl/baz.xsl
  171. /tmp/saxon/samples/php/trax/xsl/err.xsl
  172. /tmp/saxon/samples/php/trax/xsl/foo.xsl
  173. /tmp/saxon/samples/php/trax/xsl/foo.xslp
  174. /tmp/saxon/samples/php/trax/xsl/foo2.xsl
  175. /tmp/saxon/samples/php/trax/xsl/foo3.xsl
  176. /tmp/saxon/samples/php/trax/xsl/foo4.xsl
  177. /tmp/saxon/samples/php/trax/xsl/fooExFunc.xsl
  178. /tmp/saxon/samples/php/trax/xsl/identity.xsl
  179. /tmp/saxon/samples/php/trax/xsl/multidoc.xsl
  180. /tmp/saxon/samples/php/trax/xsl/postamble.txt
  181. /tmp/saxon/samples/php/trax/xsl/preamble.txt
  182. /tmp/saxon/samples/php/trax/xsl/text.xsl
  183. /tmp/saxon/samples/php/trax/a2.out
  184. /tmp/saxon/samples/php/trax/b3.out
  185. /tmp/saxon/samples/php/trax/c4.out
  186. /tmp/saxon/samples/php/trax/doc1.out
  187. /tmp/saxon/samples/php/trax/exampleSimple2.out
  188. /tmp/saxon/samples/php/trax/Simple2.out
  189. /tmp/saxon/samples/php/xml/subdir1/subdir2/foo3.xml
  190. /tmp/saxon/samples/php/xml/subdir1/foo2.xml
  191. /tmp/saxon/samples/php/xml/baz.xml
  192. /tmp/saxon/samples/php/xml/cities.xml
  193. /tmp/saxon/samples/php/xml/embedded.xml
  194. /tmp/saxon/samples/php/xml/foo.xml
  195. /tmp/saxon/samples/php/xml/input.xml
  196. /tmp/saxon/samples/php/xml/misc.txt
  197. /tmp/saxon/samples/php/xml/withentityref.xml
  198. /tmp/saxon/samples/php/xsl/inc1/inc2/inc2.xsl
  199. /tmp/saxon/samples/php/xsl/inc1/inc1.xsl
  200. /tmp/saxon/samples/php/xsl/addition.xsl
  201. /tmp/saxon/samples/php/xsl/baz.xsl
  202. /tmp/saxon/samples/php/xsl/err.xsl
  203. /tmp/saxon/samples/php/xsl/foo.xsl
  204. /tmp/saxon/samples/php/xsl/foo2.xsl
  205. /tmp/saxon/samples/php/xsl/foo3.xsl
  206. /tmp/saxon/samples/php/xsl/identity.xsl
  207. /tmp/saxon/samples/php/xsl/multidoc.xsl
  208. /tmp/saxon/samples/php/xsl/postamble.txt
  209. /tmp/saxon/samples/php/xsl/preamble.txt
  210. /tmp/saxon/samples/php/xsl/testExFunc.xsl
  211. /tmp/saxon/samples/php/xsl/text.xsl
  212. /tmp/saxon/samples/php/CallFunctionExample.xsl
  213. /tmp/saxon/samples/php/cat.xml
  214. /tmp/saxon/samples/php/doc1.out
  215. /tmp/saxon/samples/php/exampleSimple2.out
  216. /tmp/saxon/samples/php/generated.xsl
  217. /tmp/saxon/samples/php/phpinfo.php
  218. /tmp/saxon/samples/php/phpunit
  219. /tmp/saxon/samples/php/simpleTest.php
  220. /tmp/saxon/samples/php/test.xsl
  221. /tmp/saxon/samples/php/xpathExamples.php
  222. /tmp/saxon/samples/php/xqueryExamples.php
  223. /tmp/saxon/samples/php/xslt30_PHPUnit.php
  224. /tmp/saxon/samples/php/xslt30Examples.php
  225. /tmp/saxon/samples/php/xslt30TestSuite.php
  226. /tmp/saxon/samples/php/xsltExamples.php
  227. /tmp/saxon/Saxon.C.API/jni/unix/jni_md.h
  228. /tmp/saxon/Saxon.C.API/jni/jni.h
  229. /tmp/saxon/Saxon.C.API/PHP5-Build/config.m4
  230. /tmp/saxon/Saxon.C.API/python-saxon/nodekind.py
  231. /tmp/saxon/Saxon.C.API/python-saxon/readme.txt
  232. /tmp/saxon/Saxon.C.API/python-saxon/saxon_example.py
  233. /tmp/saxon/Saxon.C.API/python-saxon/saxon_example2.py
  234. /tmp/saxon/Saxon.C.API/python-saxon/saxon_example3.py
  235. /tmp/saxon/Saxon.C.API/python-saxon/saxonc.html
  236. /tmp/saxon/Saxon.C.API/python-saxon/saxonc.pyx
  237. /tmp/saxon/Saxon.C.API/python-saxon/saxoncClasses.pxd
  238. /tmp/saxon/Saxon.C.API/python-saxon/saxon-setup.py
  239. /tmp/saxon/Saxon.C.API/python-saxon/test_saxon_schema.py
  240. /tmp/saxon/Saxon.C.API/python-saxon/test_saxonc.py
  241. /tmp/saxon/Saxon.C.API/python-saxon/test.xsl
  242. /tmp/saxon/Saxon.C.API/20-saxon.ini
  243. /tmp/saxon/Saxon.C.API/config.m4
  244. /tmp/saxon/Saxon.C.API/Doxyfile
  245. /tmp/saxon/Saxon.C.API/php_saxon.cpp
  246. /tmp/saxon/Saxon.C.API/php_saxon.h
  247. /tmp/saxon/Saxon.C.API/php5_saxon.cpp
  248. /tmp/saxon/Saxon.C.API/php5_saxon.h
  249. /tmp/saxon/Saxon.C.API/php7_saxon.cpp
  250. /tmp/saxon/Saxon.C.API/Query.c
  251. /tmp/saxon/Saxon.C.API/readme.md
  252. /tmp/saxon/Saxon.C.API/SaxonCGlue.c
  253. /tmp/saxon/Saxon.C.API/SaxonCGlue.h
  254. /tmp/saxon/Saxon.C.API/SaxonCProcessor.c
  255. /tmp/saxon/Saxon.C.API/SaxonCProcessor.h
  256. /tmp/saxon/Saxon.C.API/SaxonCXPath.c
  257. /tmp/saxon/Saxon.C.API/SaxonCXPath.h
  258. /tmp/saxon/Saxon.C.API/SaxonProcessor.cpp
  259. /tmp/saxon/Saxon.C.API/SaxonProcessor.h
  260. /tmp/saxon/Saxon.C.API/SchemaValidator.cpp
  261. /tmp/saxon/Saxon.C.API/SchemaValidator.h
  262. /tmp/saxon/Saxon.C.API/Transform.c
  263. /tmp/saxon/Saxon.C.API/Validate.c
  264. /tmp/saxon/Saxon.C.API/XdmAtomicValue.cpp
  265. /tmp/saxon/Saxon.C.API/XdmAtomicValue.h
  266. /tmp/saxon/Saxon.C.API/XdmItem.cpp
  267. /tmp/saxon/Saxon.C.API/XdmItem.h
  268. /tmp/saxon/Saxon.C.API/XdmNode.cpp
  269. /tmp/saxon/Saxon.C.API/XdmNode.h
  270. /tmp/saxon/Saxon.C.API/XdmValue.cpp
  271. /tmp/saxon/Saxon.C.API/XdmValue.h
  272. /tmp/saxon/Saxon.C.API/XPathProcessor.cpp
  273. /tmp/saxon/Saxon.C.API/XPathProcessor.h
  274. /tmp/saxon/Saxon.C.API/XQueryProcessor.cpp
  275. /tmp/saxon/Saxon.C.API/XQueryProcessor.h
  276. /tmp/saxon/Saxon.C.API/Xslt30Processor.cpp
  277. /tmp/saxon/Saxon.C.API/Xslt30Processor.h
  278. /tmp/saxon/Saxon.C.API/XsltProcessor.cpp
  279. /tmp/saxon/Saxon.C.API/XsltProcessor.h
  280. /tmp/saxon/saxon-data/w3c/mathml/mathml1/isoamsa.ent
  281. /tmp/saxon/saxon-data/w3c/mathml/mathml1/isoamsb.ent
  282. /tmp/saxon/saxon-data/w3c/mathml/mathml1/isoamsc.ent
  283. /tmp/saxon/saxon-data/w3c/mathml/mathml1/isoamsn.ent
  284. /tmp/saxon/saxon-data/w3c/mathml/mathml1/isoamso.ent
  285. /tmp/saxon/saxon-data/w3c/mathml/mathml1/isoamsr.ent
  286. /tmp/saxon/saxon-data/w3c/mathml/mathml1/isobox.ent
  287. /tmp/saxon/saxon-data/w3c/mathml/mathml1/isocyr1.ent
  288. /tmp/saxon/saxon-data/w3c/mathml/mathml1/isocyr2.ent
  289. /tmp/saxon/saxon-data/w3c/mathml/mathml1/isodia.ent
  290. /tmp/saxon/saxon-data/w3c/mathml/mathml1/isogrk1.ent
  291. /tmp/saxon/saxon-data/w3c/mathml/mathml1/isogrk2.ent
  292. /tmp/saxon/saxon-data/w3c/mathml/mathml1/isogrk3.ent
  293. /tmp/saxon/saxon-data/w3c/mathml/mathml1/isogrk4.ent
  294. /tmp/saxon/saxon-data/w3c/mathml/mathml1/isolat1.ent
  295. /tmp/saxon/saxon-data/w3c/mathml/mathml1/isolat2.ent
  296. /tmp/saxon/saxon-data/w3c/mathml/mathml1/isomfrk.ent
  297. /tmp/saxon/saxon-data/w3c/mathml/mathml1/isomopf.ent
  298. /tmp/saxon/saxon-data/w3c/mathml/mathml1/isomscr.ent
  299. /tmp/saxon/saxon-data/w3c/mathml/mathml1/isonum.ent
  300. /tmp/saxon/saxon-data/w3c/mathml/mathml1/isopub.ent
  301. /tmp/saxon/saxon-data/w3c/mathml/mathml1/isotech.ent
  302. /tmp/saxon/saxon-data/w3c/mathml/mathml1/mathml.dtd
  303. /tmp/saxon/saxon-data/w3c/mathml/mathml1/mmlalias.ent
  304. /tmp/saxon/saxon-data/w3c/mathml/mathml1/mmlextra.ent
  305. /tmp/saxon/saxon-data/w3c/mathml/mathml2/html/lat1.ent
  306. /tmp/saxon/saxon-data/w3c/mathml/mathml2/html/special.ent
  307. /tmp/saxon/saxon-data/w3c/mathml/mathml2/html/symbol.ent
  308. /tmp/saxon/saxon-data/w3c/mathml/mathml2/iso8879/isoamsa.ent
  309. /tmp/saxon/saxon-data/w3c/mathml/mathml2/iso8879/isoamsb.ent
  310. /tmp/saxon/saxon-data/w3c/mathml/mathml2/iso8879/isoamsc.ent
  311. /tmp/saxon/saxon-data/w3c/mathml/mathml2/iso8879/isoamsn.ent
  312. /tmp/saxon/saxon-data/w3c/mathml/mathml2/iso8879/isoamso.ent
  313. /tmp/saxon/saxon-data/w3c/mathml/mathml2/iso8879/isoamsr.ent
  314. /tmp/saxon/saxon-data/w3c/mathml/mathml2/iso8879/isobox.ent
  315. /tmp/saxon/saxon-data/w3c/mathml/mathml2/iso8879/isocyr1.ent
  316. /tmp/saxon/saxon-data/w3c/mathml/mathml2/iso8879/isocyr2.ent
  317. /tmp/saxon/saxon-data/w3c/mathml/mathml2/iso8879/isodia.ent
  318. /tmp/saxon/saxon-data/w3c/mathml/mathml2/iso8879/isogrk1.ent
  319. /tmp/saxon/saxon-data/w3c/mathml/mathml2/iso8879/isogrk2.ent
  320. /tmp/saxon/saxon-data/w3c/mathml/mathml2/iso8879/isogrk3.ent
  321. /tmp/saxon/saxon-data/w3c/mathml/mathml2/iso8879/isogrk4.ent
  322. /tmp/saxon/saxon-data/w3c/mathml/mathml2/iso8879/isolat1.ent
  323. /tmp/saxon/saxon-data/w3c/mathml/mathml2/iso8879/isolat2.ent
  324. /tmp/saxon/saxon-data/w3c/mathml/mathml2/iso8879/isonum.ent
  325. /tmp/saxon/saxon-data/w3c/mathml/mathml2/iso8879/isopub.ent
  326. /tmp/saxon/saxon-data/w3c/mathml/mathml2/iso8879/isotech.ent
  327. /tmp/saxon/saxon-data/w3c/mathml/mathml2/iso9573-13/isoamsa.ent
  328. /tmp/saxon/saxon-data/w3c/mathml/mathml2/iso9573-13/isoamsb.ent
  329. /tmp/saxon/saxon-data/w3c/mathml/mathml2/iso9573-13/isoamsc.ent
  330. /tmp/saxon/saxon-data/w3c/mathml/mathml2/iso9573-13/isoamsn.ent
  331. /tmp/saxon/saxon-data/w3c/mathml/mathml2/iso9573-13/isoamso.ent
  332. /tmp/saxon/saxon-data/w3c/mathml/mathml2/iso9573-13/isoamsr.ent
  333. /tmp/saxon/saxon-data/w3c/mathml/mathml2/iso9573-13/isogrk3.ent
  334. /tmp/saxon/saxon-data/w3c/mathml/mathml2/iso9573-13/isogrk4.ent
  335. /tmp/saxon/saxon-data/w3c/mathml/mathml2/iso9573-13/isomfrk.ent
  336. /tmp/saxon/saxon-data/w3c/mathml/mathml2/iso9573-13/isomopf.ent
  337. /tmp/saxon/saxon-data/w3c/mathml/mathml2/iso9573-13/isomscr.ent
  338. /tmp/saxon/saxon-data/w3c/mathml/mathml2/iso9573-13/isotech.ent
  339. /tmp/saxon/saxon-data/w3c/mathml/mathml2/mathml/mmlalias.ent
  340. /tmp/saxon/saxon-data/w3c/mathml/mathml2/mathml/mmlextra.ent
  341. /tmp/saxon/saxon-data/w3c/mathml/mathml2/isoamsa.ent
  342. /tmp/saxon/saxon-data/w3c/mathml/mathml2/isoamsb.ent
  343. /tmp/saxon/saxon-data/w3c/mathml/mathml2/isoamsc.ent
  344. /tmp/saxon/saxon-data/w3c/mathml/mathml2/isoamsn.ent
  345. /tmp/saxon/saxon-data/w3c/mathml/mathml2/isoamso.ent
  346. /tmp/saxon/saxon-data/w3c/mathml/mathml2/isoamsr.ent
  347. /tmp/saxon/saxon-data/w3c/mathml/mathml2/isobox.ent
  348. /tmp/saxon/saxon-data/w3c/mathml/mathml2/isocyr1.ent
  349. /tmp/saxon/saxon-data/w3c/mathml/mathml2/isocyr2.ent
  350. /tmp/saxon/saxon-data/w3c/mathml/mathml2/isodia.ent
  351. /tmp/saxon/saxon-data/w3c/mathml/mathml2/isogrk3.ent
  352. /tmp/saxon/saxon-data/w3c/mathml/mathml2/isolat1.ent
  353. /tmp/saxon/saxon-data/w3c/mathml/mathml2/isolat2.ent
  354. /tmp/saxon/saxon-data/w3c/mathml/mathml2/isomfrk.ent
  355. /tmp/saxon/saxon-data/w3c/mathml/mathml2/isomopf.ent
  356. /tmp/saxon/saxon-data/w3c/mathml/mathml2/isomscr.ent
  357. /tmp/saxon/saxon-data/w3c/mathml/mathml2/isonum.ent
  358. /tmp/saxon/saxon-data/w3c/mathml/mathml2/isopub.ent
  359. /tmp/saxon/saxon-data/w3c/mathml/mathml2/isotech.ent
  360. /tmp/saxon/saxon-data/w3c/mathml/mathml2/mathml2.dtd
  361. /tmp/saxon/saxon-data/w3c/mathml/mathml2/mathml2-a.dtd
  362. /tmp/saxon/saxon-data/w3c/mathml/mathml2/mathml2-qname-1.mod
  363. /tmp/saxon/saxon-data/w3c/mathml/mathml2/mmlalias.ent
  364. /tmp/saxon/saxon-data/w3c/mathml/mathml2/mmlextra.ent
  365. /tmp/saxon/saxon-data/w3c/mathml/mathml2/xhtml-math11.dtd
  366. /tmp/saxon/saxon-data/w3c/mathml/mathml2/xhtml-math11-f.dtd
  367. /tmp/saxon/saxon-data/w3c/mathml/mathml2/xhtml-math11-f-a.dtd
  368. /tmp/saxon/saxon-data/w3c/mathml/mathml3/isoamsa.ent
  369. /tmp/saxon/saxon-data/w3c/mathml/mathml3/isoamsb.ent
  370. /tmp/saxon/saxon-data/w3c/mathml/mathml3/isoamsc.ent
  371. /tmp/saxon/saxon-data/w3c/mathml/mathml3/isoamsn.ent
  372. /tmp/saxon/saxon-data/w3c/mathml/mathml3/isoamso.ent
  373. /tmp/saxon/saxon-data/w3c/mathml/mathml3/isoamsr.ent
  374. /tmp/saxon/saxon-data/w3c/mathml/mathml3/isobox.ent
  375. /tmp/saxon/saxon-data/w3c/mathml/mathml3/isocyr1.ent
  376. /tmp/saxon/saxon-data/w3c/mathml/mathml3/isocyr2.ent
  377. /tmp/saxon/saxon-data/w3c/mathml/mathml3/isodia.ent
  378. /tmp/saxon/saxon-data/w3c/mathml/mathml3/isogrk3.ent
  379. /tmp/saxon/saxon-data/w3c/mathml/mathml3/isolat1.ent
  380. /tmp/saxon/saxon-data/w3c/mathml/mathml3/isolat2.ent
  381. /tmp/saxon/saxon-data/w3c/mathml/mathml3/isomfrk.ent
  382. /tmp/saxon/saxon-data/w3c/mathml/mathml3/isomopf.ent
  383. /tmp/saxon/saxon-data/w3c/mathml/mathml3/isomscr.ent
  384. /tmp/saxon/saxon-data/w3c/mathml/mathml3/isonum.ent
  385. /tmp/saxon/saxon-data/w3c/mathml/mathml3/isopub.ent
  386. /tmp/saxon/saxon-data/w3c/mathml/mathml3/isotech.ent
  387. /tmp/saxon/saxon-data/w3c/mathml/mathml3/mathml3.dtd
  388. /tmp/saxon/saxon-data/w3c/mathml/mathml3/mathml3-qname.mod
  389. /tmp/saxon/saxon-data/w3c/mathml/mathml3/mmlalias.ent
  390. /tmp/saxon/saxon-data/w3c/mathml/mathml3/mmlextra.ent
  391. /tmp/saxon/saxon-data/w3c/rddl/rddl-qname-1.mod
  392. /tmp/saxon/saxon-data/w3c/rddl/rddl-resource-1.mod
  393. /tmp/saxon/saxon-data/w3c/rddl/rddl-xhtml.dtd
  394. /tmp/saxon/saxon-data/w3c/rddl/xhtml11.dtd
  395. /tmp/saxon/saxon-data/w3c/rddl/xhtml-arch-1.mod
  396. /tmp/saxon/saxon-data/w3c/rddl/xhtml-attribs-1.mod
  397. /tmp/saxon/saxon-data/w3c/rddl/xhtml-base-1.mod
  398. /tmp/saxon/saxon-data/w3c/rddl/xhtml-basic-form-1.mod
  399. /tmp/saxon/saxon-data/w3c/rddl/xhtml-basic-table-1.mod
  400. /tmp/saxon/saxon-data/w3c/rddl/xhtml-blkphras-1.mod
  401. /tmp/saxon/saxon-data/w3c/rddl/xhtml-blkstruct-1.mod
  402. /tmp/saxon/saxon-data/w3c/rddl/xhtml-charent-1.mod
  403. /tmp/saxon/saxon-data/w3c/rddl/xhtml-datatypes-1.mod
  404. /tmp/saxon/saxon-data/w3c/rddl/xhtml-events-1.mod
  405. /tmp/saxon/saxon-data/w3c/rddl/xhtml-framework-1.mod
  406. /tmp/saxon/saxon-data/w3c/rddl/xhtml-hypertext-1.mod
  407. /tmp/saxon/saxon-data/w3c/rddl/xhtml-image-1.mod
  408. /tmp/saxon/saxon-data/w3c/rddl/xhtml-inlphras-1.mod
  409. /tmp/saxon/saxon-data/w3c/rddl/xhtml-inlstruct-1.mod
  410. /tmp/saxon/saxon-data/w3c/rddl/xhtml-link-1.mod
  411. /tmp/saxon/saxon-data/w3c/rddl/xhtml-list-1.mod
  412. /tmp/saxon/saxon-data/w3c/rddl/xhtml-meta-1.mod
  413. /tmp/saxon/saxon-data/w3c/rddl/xhtml-notations-1.mod
  414. /tmp/saxon/saxon-data/w3c/rddl/xhtml-object-1.mod
  415. /tmp/saxon/saxon-data/w3c/rddl/xhtml-param-1.mod
  416. /tmp/saxon/saxon-data/w3c/rddl/xhtml-qname-1.mod
  417. /tmp/saxon/saxon-data/w3c/rddl/xhtml-rddl-model-1.mod
  418. /tmp/saxon/saxon-data/w3c/rddl/xhtml-struct-1.mod
  419. /tmp/saxon/saxon-data/w3c/rddl/xhtml-text-1.mod
  420. /tmp/saxon/saxon-data/w3c/rddl/xlink-module-1.mod
  421. /tmp/saxon/saxon-data/w3c/svg10/svg10.dtd
  422. /tmp/saxon/saxon-data/w3c/svg11/templates/svg11-template.dtd
  423. /tmp/saxon/saxon-data/w3c/svg11/templates/svg-template.mod
  424. /tmp/saxon/saxon-data/w3c/svg11/templates/svg-template-qname.mod
  425. /tmp/saxon/saxon-data/w3c/svg11/svg11.dtd
  426. /tmp/saxon/saxon-data/w3c/svg11/svg11-attribs.mod
  427. /tmp/saxon/saxon-data/w3c/svg11/svg11-basic.dtd
  428. /tmp/saxon/saxon-data/w3c/svg11/svg11-basic-attribs.mod
  429. /tmp/saxon/saxon-data/w3c/svg11/svg11-basic-flat.dtd
  430. /tmp/saxon/saxon-data/w3c/svg11/svg11-basic-model.mod
  431. /tmp/saxon/saxon-data/w3c/svg11/svg11-flat.dtd
  432. /tmp/saxon/saxon-data/w3c/svg11/svg11-flat-20030114.dtd
  433. /tmp/saxon/saxon-data/w3c/svg11/svg11-model.mod
  434. /tmp/saxon/saxon-data/w3c/svg11/svg11-tiny.dtd
  435. /tmp/saxon/saxon-data/w3c/svg11/svg11-tiny-attribs.mod
  436. /tmp/saxon/saxon-data/w3c/svg11/svg11-tiny-flat.dtd
  437. /tmp/saxon/saxon-data/w3c/svg11/svg11-tiny-model.mod
  438. /tmp/saxon/saxon-data/w3c/svg11/svg-animation.mod
  439. /tmp/saxon/saxon-data/w3c/svg11/svg-animevents-attrib.mod
  440. /tmp/saxon/saxon-data/w3c/svg11/svg-basic-clip.mod
  441. /tmp/saxon/saxon-data/w3c/svg11/svg-basic-filter.mod
  442. /tmp/saxon/saxon-data/w3c/svg11/svg-basic-font.mod
  443. /tmp/saxon/saxon-data/w3c/svg11/svg-basic-graphics-attrib.mod
  444. /tmp/saxon/saxon-data/w3c/svg11/svg-basic-paint-attrib.mod
  445. /tmp/saxon/saxon-data/w3c/svg11/svg-basic-structure.mod
  446. /tmp/saxon/saxon-data/w3c/svg11/svg-basic-text.mod
  447. /tmp/saxon/saxon-data/w3c/svg11/svg-clip.mod
  448. /tmp/saxon/saxon-data/w3c/svg11/svg-conditional.mod
  449. /tmp/saxon/saxon-data/w3c/svg11/svg-container-attrib.mod
  450. /tmp/saxon/saxon-data/w3c/svg11/svg-core-attrib.mod
  451. /tmp/saxon/saxon-data/w3c/svg11/svg-cursor.mod
  452. /tmp/saxon/saxon-data/w3c/svg11/svg-datatypes.mod
  453. /tmp/saxon/saxon-data/w3c/svg11/svg-docevents-attrib.mod
  454. /tmp/saxon/saxon-data/w3c/svg11/svg-extensibility.mod
  455. /tmp/saxon/saxon-data/w3c/svg11/svg-extresources-attrib.mod
  456. /tmp/saxon/saxon-data/w3c/svg11/svg-filter.mod
  457. /tmp/saxon/saxon-data/w3c/svg11/svg-font.mod
  458. /tmp/saxon/saxon-data/w3c/svg11/svg-framework.mod
  459. /tmp/saxon/saxon-data/w3c/svg11/svg-gradient.mod
  460. /tmp/saxon/saxon-data/w3c/svg11/svg-graphevents-attrib.mod
  461. /tmp/saxon/saxon-data/w3c/svg11/svg-graphics-attrib.mod
  462. /tmp/saxon/saxon-data/w3c/svg11/svg-hyperlink.mod
  463. /tmp/saxon/saxon-data/w3c/svg11/svg-image.mod
  464. /tmp/saxon/saxon-data/w3c/svg11/svg-marker.mod
  465. /tmp/saxon/saxon-data/w3c/svg11/svg-mask.mod
  466. /tmp/saxon/saxon-data/w3c/svg11/svg-opacity-attrib.mod
  467. /tmp/saxon/saxon-data/w3c/svg11/svg-paint-attrib.mod
  468. /tmp/saxon/saxon-data/w3c/svg11/svg-pattern.mod
  469. /tmp/saxon/saxon-data/w3c/svg11/svg-profile.mod
  470. /tmp/saxon/saxon-data/w3c/svg11/svg-qname.mod
  471. /tmp/saxon/saxon-data/w3c/svg11/svg-script.mod
  472. /tmp/saxon/saxon-data/w3c/svg11/svg-shape.mod
  473. /tmp/saxon/saxon-data/w3c/svg11/svg-structure.mod
  474. /tmp/saxon/saxon-data/w3c/svg11/svg-style.mod
  475. /tmp/saxon/saxon-data/w3c/svg11/svg-text.mod
  476. /tmp/saxon/saxon-data/w3c/svg11/svg-view.mod
  477. /tmp/saxon/saxon-data/w3c/svg11/svg-viewport-attrib.mod
  478. /tmp/saxon/saxon-data/w3c/svg11/svg-xlink-attrib.mod
  479. /tmp/saxon/saxon-data/w3c/xhtml10/xhtml1-frameset.dtd
  480. /tmp/saxon/saxon-data/w3c/xhtml10/xhtml1-strict.dtd
  481. /tmp/saxon/saxon-data/w3c/xhtml10/xhtml1-transitional.dtd
  482. /tmp/saxon/saxon-data/w3c/xhtml10/xhtml-basic10.dtd
  483. /tmp/saxon/saxon-data/w3c/xhtml11/xhtml11.dtd
  484. /tmp/saxon/saxon-data/w3c/xhtml11/xhtml11-model-1.mod
  485. /tmp/saxon/saxon-data/w3c/xhtml11/xhtml-access-1.mod
  486. /tmp/saxon/saxon-data/w3c/xhtml11/xhtml-access-qname-1.mod
  487. /tmp/saxon/saxon-data/w3c/xhtml11/xhtml-applet-1.mod
  488. /tmp/saxon/saxon-data/w3c/xhtml11/xhtml-arch-1.mod
  489. /tmp/saxon/saxon-data/w3c/xhtml11/xhtml-attribs-1.mod
  490. /tmp/saxon/saxon-data/w3c/xhtml11/xhtml-base-1.mod
  491. /tmp/saxon/saxon-data/w3c/xhtml11/xhtml-basic10-model-1.mod
  492. /tmp/saxon/saxon-data/w3c/xhtml11/xhtml-basic11.dtd
  493. /tmp/saxon/saxon-data/w3c/xhtml11/xhtml-basic11-model-1.mod
  494. /tmp/saxon/saxon-data/w3c/xhtml11/xhtml-basic-form-1.mod
  495. /tmp/saxon/saxon-data/w3c/xhtml11/xhtml-basic-table-1.mod
  496. /tmp/saxon/saxon-data/w3c/xhtml11/xhtml-bdo-1.mod
  497. /tmp/saxon/saxon-data/w3c/xhtml11/xhtml-blkphras-1.mod
  498. /tmp/saxon/saxon-data/w3c/xhtml11/xhtml-blkpres-1.mod
  499. /tmp/saxon/saxon-data/w3c/xhtml11/xhtml-blkstruct-1.mod
  500. /tmp/saxon/saxon-data/w3c/xhtml11/xhtml-charent-1.mod
  501. /tmp/saxon/saxon-data/w3c/xhtml11/xhtml-csismap-1.mod
  502. /tmp/saxon/saxon-data/w3c/xhtml11/xhtml-datatypes-1.mod
  503. /tmp/saxon/saxon-data/w3c/xhtml11/xhtml-edit-1.mod
  504. /tmp/saxon/saxon-data/w3c/xhtml11/xhtml-events-1.mod
  505. /tmp/saxon/saxon-data/w3c/xhtml11/xhtml-form-1.mod
  506. /tmp/saxon/saxon-data/w3c/xhtml11/xhtml-frames-1.mod
  507. /tmp/saxon/saxon-data/w3c/xhtml11/xhtml-framework-1.mod
  508. /tmp/saxon/saxon-data/w3c/xhtml11/xhtml-hyperAttributes-1.mod
  509. /tmp/saxon/saxon-data/w3c/xhtml11/xhtml-hypertext-1.mod
  510. /tmp/saxon/saxon-data/w3c/xhtml11/xhtml-iframe-1.mod
  511. /tmp/saxon/saxon-data/w3c/xhtml11/xhtml-image-1.mod
  512. /tmp/saxon/saxon-data/w3c/xhtml11/xhtml-inlphras-1.mod
  513. /tmp/saxon/saxon-data/w3c/xhtml11/xhtml-inlpres-1.mod
  514. /tmp/saxon/saxon-data/w3c/xhtml11/xhtml-inlstruct-1.mod
  515. /tmp/saxon/saxon-data/w3c/xhtml11/xhtml-inlstyle-1.mod
  516. /tmp/saxon/saxon-data/w3c/xhtml11/xhtml-inputmode-1.mod
  517. /tmp/saxon/saxon-data/w3c/xhtml11/xhtml-legacy-1.mod
  518. /tmp/saxon/saxon-data/w3c/xhtml11/xhtml-legacy-redecl-1.mod
  519. /tmp/saxon/saxon-data/w3c/xhtml11/xhtml-link-1.mod
  520. /tmp/saxon/saxon-data/w3c/xhtml11/xhtml-list-1.mod
  521. /tmp/saxon/saxon-data/w3c/xhtml11/xhtml-meta-1.mod
  522. /tmp/saxon/saxon-data/w3c/xhtml11/xhtml-meta-2.mod
  523. /tmp/saxon/saxon-data/w3c/xhtml11/xhtml-metaAttributes-1.mod
  524. /tmp/saxon/saxon-data/w3c/xhtml11/xhtml-nameident-1.mod
  525. /tmp/saxon/saxon-data/w3c/xhtml11/xhtml-notations-1.mod
  526. /tmp/saxon/saxon-data/w3c/xhtml11/xhtml-object-1.mod
  527. /tmp/saxon/saxon-data/w3c/xhtml11/xhtml-param-1.mod
  528. /tmp/saxon/saxon-data/w3c/xhtml11/xhtml-pres-1.mod
  529. /tmp/saxon/saxon-data/w3c/xhtml11/xhtml-print10-model-1.mod
  530. /tmp/saxon/saxon-data/w3c/xhtml11/xhtml-qname-1.mod
  531. /tmp/saxon/saxon-data/w3c/xhtml11/xhtml-rdfa-model-1.mod
  532. /tmp/saxon/saxon-data/w3c/xhtml11/xhtml-rdfa-qname-1.mod
  533. /tmp/saxon/saxon-data/w3c/xhtml11/xhtml-role-1.mod
  534. /tmp/saxon/saxon-data/w3c/xhtml11/xhtml-role-qname-1.mod
  535. /tmp/saxon/saxon-data/w3c/xhtml11/xhtml-ruby-1.mod
  536. /tmp/saxon/saxon-data/w3c/xhtml11/xhtml-script-1.mod
  537. /tmp/saxon/saxon-data/w3c/xhtml11/xhtml-ssismap-1.mod
  538. /tmp/saxon/saxon-data/w3c/xhtml11/xhtml-struct-1.mod
  539. /tmp/saxon/saxon-data/w3c/xhtml11/xhtml-style-1.mod
  540. /tmp/saxon/saxon-data/w3c/xhtml11/xhtml-table-1.mod
  541. /tmp/saxon/saxon-data/w3c/xhtml11/xhtml-target-1.mod
  542. /tmp/saxon/saxon-data/w3c/xhtml11/xhtml-text-1.mod
  543. /tmp/saxon/saxon-data/w3c/xlink/xlink.xsd
  544. /tmp/saxon/saxon-data/w3c/xmlspec/xmlspec.dtd
  545. /tmp/saxon/saxon-data/w3c/xslt3/xslt30.xsd
  546. /tmp/saxon/saxon-data/w3c/catalog.dtd
  547. /tmp/saxon/saxon-data/w3c/catalog.xml
  548. /tmp/saxon/saxon-data/w3c/generate-resolver.xsl
  549. /tmp/saxon/saxon-data/w3c/xhtml-lat1.ent
  550. /tmp/saxon/saxon-data/w3c/xhtml-special.ent
  551. /tmp/saxon/saxon-data/w3c/xhtml-symbol.ent
  552. /tmp/saxon/saxon-data/analyze-string.xsd
  553. /tmp/saxon/saxon-data/casevariants.xml
  554. /tmp/saxon/saxon-data/categories.xml
  555. /tmp/saxon/saxon-data/chameleon.xsl
  556. /tmp/saxon/saxon-data/json.xsd
  557. /tmp/saxon/saxon-data/normalizationData.xml
  558. /tmp/saxon/saxon-data/override.xsl
  559. /tmp/saxon/saxon-data/unicodeBlocks.xml
  560. /tmp/saxon/saxon-data/xml-to-json.xsl
  561. /tmp/saxon/saxon-data/xml-to-json-indent.xsl
  562. /tmp/saxon/saxon-data/xml-to-json-pkg.xsl
  563. /tmp/saxon/saxon-data/xpath-functions.xsd
  564. /tmp/saxon/libsaxonhec.so
  565. /tmp/saxon/readme.md
  566. /tmp/saxon/Uninstall
  567.  
  568. Saxon-HEC 1.2.1 has been successfully installed on your computer.
  569. + cp /tmp/saxon/libsaxonhec.so /usr/lib/
  570. + cp -r /tmp/saxon/rt /usr/lib
  571. + ldconfig
  572. ldconfig: file /usr/lib/libsaxonhec.so is truncated
  573.  
  574. + cd /tmp/saxon/Saxon.C.API/
  575. + sed -i s/#define PHP_SAXON_EXTNAME "Saxon\/C"/#define PHP_SAXON_EXTNAME "SaxonC"/g php_saxon.h
  576. + phpize
  577. Configuring for:
  578. PHP Api Version: 20200930
  579. Zend Module Api No: 20200930
  580. Zend Extension Api No: 420200930
  581. + ./configure --enable-saxon
  582. checking for grep that handles long lines and -e... /bin/grep
  583. checking for egrep... /bin/grep -E
  584. checking for a sed that does not truncate output... /bin/sed
  585. checking for pkg-config... /usr/bin/pkg-config
  586. checking pkg-config is at least version 0.9.0... yes
  587. checking for cc... cc
  588. checking whether the C compiler works... yes
  589. checking for C compiler default output file name... a.out
  590. checking for suffix of executables...
  591. checking whether we are cross compiling... no
  592. checking for suffix of object files... o
  593. checking whether we are using the GNU C compiler... yes
  594. checking whether cc accepts -g... yes
  595. checking for cc option to accept ISO C89... none needed
  596. checking how to run the C preprocessor... cc -E
  597. checking for icc... no
  598. checking for suncc... no
  599. checking for system library directory... lib
  600. checking if compiler supports -R... no
  601. checking if compiler supports -Wl,-rpath,... yes
  602. checking build system type... x86_64-pc-linux-gnu
  603. checking host system type... x86_64-pc-linux-gnu
  604. checking target system type... x86_64-pc-linux-gnu
  605. checking for PHP prefix... /usr/local
  606. checking for PHP includes... -I/usr/local/include/php -I/usr/local/include/php/main -I/usr/local/include/php/TSRM -I/usr/local/include/php/Zend -I/usr/local/include/php/ext -I/usr/local/include/php/ext/date/lib
  607. checking for PHP extension directory... /usr/local/lib/php/extensions/no-debug-non-zts-20200930
  608. checking for PHP installed headers prefix... /usr/local/include/php
  609. checking if debug is enabled... no
  610. checking if zts is enabled... no
  611. checking for gawk... no
  612. checking for nawk... nawk
  613. checking if nawk is broken... no
  614. checking Whether to enable the "saxon" extension... yes, shared
  615. checking for g++... g++
  616. checking whether we are using the GNU C++ compiler... yes
  617. checking whether g++ accepts -g... yes
  618. checking how to run the C++ preprocessor... g++ -E
  619. checking for a sed that does not truncate output... /bin/sed
  620. checking for ld used by cc... /usr/bin/ld
  621. checking if the linker (/usr/bin/ld) is GNU ld... yes
  622. checking for /usr/bin/ld option to reload object files... -r
  623. checking for BSD-compatible nm... /usr/bin/nm -B
  624. checking whether ln -s works... yes
  625. checking how to recognize dependent libraries... pass_all
  626. checking for ANSI C header files... yes
  627. checking for sys/types.h... yes
  628. checking for sys/stat.h... yes
  629. checking for stdlib.h... yes
  630. checking for string.h... yes
  631. checking for memory.h... yes
  632. checking for strings.h... yes
  633. checking for inttypes.h... yes
  634. checking for stdint.h... yes
  635. checking for unistd.h... yes
  636. checking dlfcn.h usability... yes
  637. checking dlfcn.h presence... yes
  638. checking for dlfcn.h... yes
  639. checking how to run the C++ preprocessor... g++ -E
  640. checking the maximum length of command line arguments... 1572864
  641. checking command to parse /usr/bin/nm -B output from cc object... ok
  642. checking for objdir... .libs
  643. checking for ar... ar
  644. checking for ranlib... ranlib
  645. checking for strip... strip
  646. checking if cc supports -fno-rtti -fno-exceptions... no
  647. checking for cc option to produce PIC... -fPIC
  648. checking if cc PIC flag -fPIC works... yes
  649. checking if cc static flag -static works... yes
  650. checking if cc supports -c -o file.o... yes
  651. checking whether the cc linker (/usr/bin/ld -m elf_x86_64) supports shared libraries... yes
  652. checking whether -lc should be explicitly linked in... no
  653. checking dynamic linker characteristics... GNU/Linux ld.so
  654. checking how to hardcode library paths into programs... immediate
  655. checking whether stripping libraries is possible... yes
  656. checking if libtool supports shared libraries... yes
  657. checking whether to build shared libraries... yes
  658. checking whether to build static libraries... no
  659.  
  660. creating libtool
  661. appending configuration tag "CXX" to libtool
  662. checking for ld used by g++... /usr/bin/ld -m elf_x86_64
  663. checking if the linker (/usr/bin/ld -m elf_x86_64) is GNU ld... yes
  664. checking whether the g++ linker (/usr/bin/ld -m elf_x86_64) supports shared libraries... yes
  665. checking for g++ option to produce PIC... -fPIC
  666. checking if g++ PIC flag -fPIC works... yes
  667. checking if g++ static flag -static works... yes
  668. checking if g++ supports -c -o file.o... yes
  669. checking whether the g++ linker (/usr/bin/ld -m elf_x86_64) supports shared libraries... yes
  670. checking dynamic linker characteristics... GNU/Linux ld.so
  671. (cached) (cached) checking how to hardcode library paths into programs... immediate
  672. configure: patching config.h.in
  673. configure: creating ./config.status
  674. config.status: creating config.h
  675. + nproc
  676. + make -j8
  677. /bin/bash /tmp/saxon/Saxon.C.API/libtool --mode=compile g++ -I. -I/tmp/saxon/Saxon.C.API -I/tmp/saxon/Saxon.C.API/include -I/tmp/saxon/Saxon.C.API/main -I/tmp/saxon/Saxon.C.API -I/usr/local/include/php -I/usr/local/include/php/main -I/usr/local/include/php/TSRM -I/usr/local/include/php/Zend -I/usr/local/include/php/ext -I/usr/local/include/php/ext/date/lib -I/tmp/saxon/Saxon.C.API/jni -DHAVE_CONFIG_H -g -O2 -c /tmp/saxon/Saxon.C.API/php7_saxon.cpp -o php7_saxon.lo
  678. /bin/bash /tmp/saxon/Saxon.C.API/libtool --mode=compile g++ -I. -I/tmp/saxon/Saxon.C.API -I/tmp/saxon/Saxon.C.API/include -I/tmp/saxon/Saxon.C.API/main -I/tmp/saxon/Saxon.C.API -I/usr/local/include/php -I/usr/local/include/php/main -I/usr/local/include/php/TSRM -I/usr/local/include/php/Zend -I/usr/local/include/php/ext -I/usr/local/include/php/ext/date/lib -I/tmp/saxon/Saxon.C.API/jni -DHAVE_CONFIG_H -g -O2 -c /tmp/saxon/Saxon.C.API/SaxonProcessor.cpp -o SaxonProcessor.lo
  679. /bin/bash /tmp/saxon/Saxon.C.API/libtool --mode=compile g++ -I. -I/tmp/saxon/Saxon.C.API -I/tmp/saxon/Saxon.C.API/include -I/tmp/saxon/Saxon.C.API/main -I/tmp/saxon/Saxon.C.API -I/usr/local/include/php -I/usr/local/include/php/main -I/usr/local/include/php/TSRM -I/usr/local/include/php/Zend -I/usr/local/include/php/ext -I/usr/local/include/php/ext/date/lib -I/tmp/saxon/Saxon.C.API/jni -DHAVE_CONFIG_H -g -O2 -c /tmp/saxon/Saxon.C.API/XQueryProcessor.cpp -o XQueryProcessor.lo
  680. /bin/bash /tmp/saxon/Saxon.C.API/libtool --mode=compile g++ -I. -I/tmp/saxon/Saxon.C.API -I/tmp/saxon/Saxon.C.API/include -I/tmp/saxon/Saxon.C.API/main -I/tmp/saxon/Saxon.C.API -I/usr/local/include/php -I/usr/local/include/php/main -I/usr/local/include/php/TSRM -I/usr/local/include/php/Zend -I/usr/local/include/php/ext -I/usr/local/include/php/ext/date/lib -I/tmp/saxon/Saxon.C.API/jni -DHAVE_CONFIG_H -g -O2 -c /tmp/saxon/Saxon.C.API/XsltProcessor.cpp -o XsltProcessor.lo
  681. /bin/bash /tmp/saxon/Saxon.C.API/libtool --mode=compile g++ -I. -I/tmp/saxon/Saxon.C.API -I/tmp/saxon/Saxon.C.API/include -I/tmp/saxon/Saxon.C.API/main -I/tmp/saxon/Saxon.C.API -I/usr/local/include/php -I/usr/local/include/php/main -I/usr/local/include/php/TSRM -I/usr/local/include/php/Zend -I/usr/local/include/php/ext -I/usr/local/include/php/ext/date/lib -I/tmp/saxon/Saxon.C.API/jni -DHAVE_CONFIG_H -g -O2 -c /tmp/saxon/Saxon.C.API/Xslt30Processor.cpp -o Xslt30Processor.lo
  682. /bin/bash /tmp/saxon/Saxon.C.API/libtool --mode=compile g++ -I. -I/tmp/saxon/Saxon.C.API -I/tmp/saxon/Saxon.C.API/include -I/tmp/saxon/Saxon.C.API/main -I/tmp/saxon/Saxon.C.API -I/usr/local/include/php -I/usr/local/include/php/main -I/usr/local/include/php/TSRM -I/usr/local/include/php/Zend -I/usr/local/include/php/ext -I/usr/local/include/php/ext/date/lib -I/tmp/saxon/Saxon.C.API/jni -DHAVE_CONFIG_H -g -O2 -c /tmp/saxon/Saxon.C.API/XPathProcessor.cpp -o XPathProcessor.lo
  683. /bin/bash /tmp/saxon/Saxon.C.API/libtool --mode=compile g++ -I. -I/tmp/saxon/Saxon.C.API -I/tmp/saxon/Saxon.C.API/include -I/tmp/saxon/Saxon.C.API/main -I/tmp/saxon/Saxon.C.API -I/usr/local/include/php -I/usr/local/include/php/main -I/usr/local/include/php/TSRM -I/usr/local/include/php/Zend -I/usr/local/include/php/ext -I/usr/local/include/php/ext/date/lib -I/tmp/saxon/Saxon.C.API/jni -DHAVE_CONFIG_H -g -O2 -c /tmp/saxon/Saxon.C.API/SchemaValidator.cpp -o SchemaValidator.lo
  684. /bin/bash /tmp/saxon/Saxon.C.API/libtool --mode=compile g++ -I. -I/tmp/saxon/Saxon.C.API -I/tmp/saxon/Saxon.C.API/include -I/tmp/saxon/Saxon.C.API/main -I/tmp/saxon/Saxon.C.API -I/usr/local/include/php -I/usr/local/include/php/main -I/usr/local/include/php/TSRM -I/usr/local/include/php/Zend -I/usr/local/include/php/ext -I/usr/local/include/php/ext/date/lib -I/tmp/saxon/Saxon.C.API/jni -DHAVE_CONFIG_H -g -O2 -c /tmp/saxon/Saxon.C.API/XdmValue.cpp -o XdmValue.lo
  685. mkdir .libs
  686. g++ -I. -I/tmp/saxon/Saxon.C.API -I/tmp/saxon/Saxon.C.API/include -I/tmp/saxon/Saxon.C.API/main -I/tmp/saxon/Saxon.C.API -I/usr/local/include/php -I/usr/local/include/php/main -I/usr/local/include/php/TSRM -I/usr/local/include/php/Zend -I/usr/local/include/php/ext -I/usr/local/include/php/ext/date/lib -I/tmp/saxon/Saxon.C.API/jni -DHAVE_CONFIG_H -g -O2 -c /tmp/saxon/Saxon.C.API/XQueryProcessor.cpp -fPIC -DPIC -o .libs/XQueryProcessor.o
  687. g++ -I. -I/tmp/saxon/Saxon.C.API -I/tmp/saxon/Saxon.C.API/include -I/tmp/saxon/Saxon.C.API/main -I/tmp/saxon/Saxon.C.API -I/usr/local/include/php -I/usr/local/include/php/main -I/usr/local/include/php/TSRM -I/usr/local/include/php/Zend -I/usr/local/include/php/ext -I/usr/local/include/php/ext/date/lib -I/tmp/saxon/Saxon.C.API/jni -DHAVE_CONFIG_H -g -O2 -c /tmp/saxon/Saxon.C.API/Xslt30Processor.cpp -fPIC -DPIC -o .libs/Xslt30Processor.o
  688. g++ -I. -I/tmp/saxon/Saxon.C.API -I/tmp/saxon/Saxon.C.API/include -I/tmp/saxon/Saxon.C.API/main -I/tmp/saxon/Saxon.C.API -I/usr/local/include/php -I/usr/local/include/php/main -I/usr/local/include/php/TSRM -I/usr/local/include/php/Zend -I/usr/local/include/php/ext -I/usr/local/include/php/ext/date/lib -I/tmp/saxon/Saxon.C.API/jni -DHAVE_CONFIG_H -g -O2 -c /tmp/saxon/Saxon.C.API/XdmValue.cpp -fPIC -DPIC -o .libs/XdmValue.o
  689. g++ -I. -I/tmp/saxon/Saxon.C.API -I/tmp/saxon/Saxon.C.API/include -I/tmp/saxon/Saxon.C.API/main -I/tmp/saxon/Saxon.C.API -I/usr/local/include/php -I/usr/local/include/php/main -I/usr/local/include/php/TSRM -I/usr/local/include/php/Zend -I/usr/local/include/php/ext -I/usr/local/include/php/ext/date/lib -I/tmp/saxon/Saxon.C.API/jni -DHAVE_CONFIG_H -g -O2 -c /tmp/saxon/Saxon.C.API/php7_saxon.cpp -fPIC -DPIC -o .libs/php7_saxon.o
  690. g++ -I. -I/tmp/saxon/Saxon.C.API -I/tmp/saxon/Saxon.C.API/include -I/tmp/saxon/Saxon.C.API/main -I/tmp/saxon/Saxon.C.API -I/usr/local/include/php -I/usr/local/include/php/main -I/usr/local/include/php/TSRM -I/usr/local/include/php/Zend -I/usr/local/include/php/ext -I/usr/local/include/php/ext/date/lib -I/tmp/saxon/Saxon.C.API/jni -DHAVE_CONFIG_H -g -O2 -c /tmp/saxon/Saxon.C.API/XsltProcessor.cpp -fPIC -DPIC -o .libs/XsltProcessor.o
  691. g++ -I. -I/tmp/saxon/Saxon.C.API -I/tmp/saxon/Saxon.C.API/include -I/tmp/saxon/Saxon.C.API/main -I/tmp/saxon/Saxon.C.API -I/usr/local/include/php -I/usr/local/include/php/main -I/usr/local/include/php/TSRM -I/usr/local/include/php/Zend -I/usr/local/include/php/ext -I/usr/local/include/php/ext/date/lib -I/tmp/saxon/Saxon.C.API/jni -DHAVE_CONFIG_H -g -O2 -c /tmp/saxon/Saxon.C.API/SaxonProcessor.cpp -fPIC -DPIC -o .libs/SaxonProcessor.o
  692. g++ -I. -I/tmp/saxon/Saxon.C.API -I/tmp/saxon/Saxon.C.API/include -I/tmp/saxon/Saxon.C.API/main -I/tmp/saxon/Saxon.C.API -I/usr/local/include/php -I/usr/local/include/php/main -I/usr/local/include/php/TSRM -I/usr/local/include/php/Zend -I/usr/local/include/php/ext -I/usr/local/include/php/ext/date/lib -I/tmp/saxon/Saxon.C.API/jni -DHAVE_CONFIG_H -g -O2 -c /tmp/saxon/Saxon.C.API/SchemaValidator.cpp -fPIC -DPIC -o .libs/SchemaValidator.o
  693. g++ -I. -I/tmp/saxon/Saxon.C.API -I/tmp/saxon/Saxon.C.API/include -I/tmp/saxon/Saxon.C.API/main -I/tmp/saxon/Saxon.C.API -I/usr/local/include/php -I/usr/local/include/php/main -I/usr/local/include/php/TSRM -I/usr/local/include/php/Zend -I/usr/local/include/php/ext -I/usr/local/include/php/ext/date/lib -I/tmp/saxon/Saxon.C.API/jni -DHAVE_CONFIG_H -g -O2 -c /tmp/saxon/Saxon.C.API/XPathProcessor.cpp -fPIC -DPIC -o .libs/XPathProcessor.o
  694. /tmp/saxon/Saxon.C.API/php7_saxon.cpp:20:1: warning: ISO C++ forbids converting a string constant to 'char*' [-Wwrite-strings]
  695. };
  696. ^
  697. /tmp/saxon/Saxon.C.API/php7_saxon.cpp:20:1: warning: ISO C++ forbids converting a string constant to 'char*' [-Wwrite-strings]
  698. /tmp/saxon/Saxon.C.API/php7_saxon.cpp: In function 'void zim_SaxonProcessor_createAtomicValue(zend_execute_data*, zval*)':
  699. /tmp/saxon/Saxon.C.API/php7_saxon.cpp:402:65: error: 'TSRMLS_C' was not declared in this scope
  700. zend_throw_exception(zend_exception_get_default(TSRMLS_C), "unknown type specified in XdmValue", 0 TSRMLS_CC);
  701. ^~~~~~~~
  702. /tmp/saxon/Saxon.C.API/php7_saxon.cpp:402:65: note: suggested alternative: 'TSRM_H'
  703. zend_throw_exception(zend_exception_get_default(TSRMLS_C), "unknown type specified in XdmValue", 0 TSRMLS_CC);
  704. ^~~~~~~~
  705. TSRM_H
  706. /tmp/saxon/Saxon.C.API/php7_saxon.cpp:402:115: error: expected ')' before 'TSRMLS_CC'
  707. zend_throw_exception(zend_exception_get_default(TSRMLS_C), "unknown type specified in XdmValue", 0 TSRMLS_CC);
  708. ~ ^~~~~~~~~~
  709. )
  710. /tmp/saxon/Saxon.C.API/php7_saxon.cpp: In function '_jobject* phpNativeCall(JNIEnv*, jobject, jstring, jobjectArray, jobjectArray)':
  711. /tmp/saxon/Saxon.C.API/php7_saxon.cpp:966:5: error: 'call_user_function_ex' was not declared in this scope
  712. if(call_user_function_ex(CG(function_table), (zval*)callOnObj, &function_name, &retval, argLength, params, 0, NULL) != SUCCESS)
  713. ^~~~~~~~~~~~~~~~~~~~~
  714. /tmp/saxon/Saxon.C.API/php7_saxon.cpp:966:5: note: suggested alternative: 'call_user_function'
  715. if(call_user_function_ex(CG(function_table), (zval*)callOnObj, &function_name, &retval, argLength, params, 0, NULL) != SUCCESS)
  716. ^~~~~~~~~~~~~~~~~~~~~
  717. call_user_function
  718. /tmp/saxon/Saxon.C.API/php7_saxon.cpp:1026:65: error: 'TSRMLS_C' was not declared in this scope
  719. zend_throw_exception(zend_exception_get_default(TSRMLS_C), "Unknown type specified in extension function", 0 TSRMLS_CC);
  720. ^~~~~~~~
  721. /tmp/saxon/Saxon.C.API/php7_saxon.cpp:1026:65: note: suggested alternative: 'TSRM_H'
  722. zend_throw_exception(zend_exception_get_default(TSRMLS_C), "Unknown type specified in extension function", 0 TSRMLS_CC);
  723. ^~~~~~~~
  724. TSRM_H
  725. /tmp/saxon/Saxon.C.API/php7_saxon.cpp:1026:125: error: expected ')' before 'TSRMLS_CC'
  726. zend_throw_exception(zend_exception_get_default(TSRMLS_C), "Unknown type specified in extension function", 0 TSRMLS_CC);
  727. ~ ^~~~~~~~~~
  728. )
  729. /tmp/saxon/Saxon.C.API/php7_saxon.cpp: In function 'void zim_Xslt30Processor_callFunctionReturningValue(zend_execute_data*, zval*)':
  730. /tmp/saxon/Saxon.C.API/php7_saxon.cpp:1664:29: warning: NULL used in arithmetic [-Wpointer-arith]
  731. if(Z_TYPE_P(val) != NULL) {
  732. ^~~~
  733. /tmp/saxon/Saxon.C.API/php7_saxon.cpp: In function 'void zim_Xslt30Processor_callFunctionReturningString(zend_execute_data*, zval*)':
  734. /tmp/saxon/Saxon.C.API/php7_saxon.cpp:1755:29: warning: NULL used in arithmetic [-Wpointer-arith]
  735. if(Z_TYPE_P(val) != NULL) {
  736. ^~~~
  737. /tmp/saxon/Saxon.C.API/php7_saxon.cpp: In function 'void zim_Xslt30Processor_callFunctionReturningFile(zend_execute_data*, zval*)':
  738. /tmp/saxon/Saxon.C.API/php7_saxon.cpp:1844:29: warning: NULL used in arithmetic [-Wpointer-arith]
  739. if(Z_TYPE_P(val) != NULL) {
  740. ^~~~
  741. /tmp/saxon/Saxon.C.API/php7_saxon.cpp: In function 'void zim_Xslt30Processor_addPackages(zend_execute_data*, zval*)':
  742. /tmp/saxon/Saxon.C.API/php7_saxon.cpp:2154:29: warning: NULL used in arithmetic [-Wpointer-arith]
  743. if(Z_TYPE_P(val) != NULL && Z_TYPE_P(val)== IS_STRING) {
  744. ^~~~
  745. /tmp/saxon/Saxon.C.API/php7_saxon.cpp: In function 'void zim_Xslt30Processor_setInitialTemplateParameters(zend_execute_data*, zval*)':
  746. /tmp/saxon/Saxon.C.API/php7_saxon.cpp:2207:29: warning: NULL used in arithmetic [-Wpointer-arith]
  747. if(Z_TYPE_P(val) != NULL) {
  748. ^~~~
  749. In file included from /usr/local/include/php/Zend/zend.h:27,
  750. from /usr/local/include/php/main/php.h:31,
  751. from /tmp/saxon/Saxon.C.API/php_saxon.h:15,
  752. from /tmp/saxon/Saxon.C.API/php7_saxon.cpp:5:
  753. /tmp/saxon/Saxon.C.API/php7_saxon.cpp: In function 'void zim_XdmValue_addXdmItem(zend_execute_data*, zval*)':
  754. /tmp/saxon/Saxon.C.API/php7_saxon.cpp:4720:65: error: expected ')' before 'TSRMLS_CC'
  755. xdmValue_object *obj = (xdmValue_object *)Z_OBJ_P(getThis() TSRMLS_CC);
  756. ^~~~~~~~~
  757. /usr/local/include/php/Zend/zend_types.h:819:26: note: in definition of macro 'Z_OBJ'
  758. #define Z_OBJ(zval) (zval).value.obj
  759. ^~~~
  760. /tmp/saxon/Saxon.C.API/php7_saxon.cpp:4720:47: note: in expansion of macro 'Z_OBJ_P'
  761. xdmValue_object *obj = (xdmValue_object *)Z_OBJ_P(getThis() TSRMLS_CC);
  762. ^~~~~~~
  763. /usr/local/include/php/Zend/zend_types.h:820:35: note: to match this '('
  764. #define Z_OBJ_P(zval_p) Z_OBJ(*(zval_p))
  765. ^
  766. /usr/local/include/php/Zend/zend_types.h:819:26: note: in definition of macro 'Z_OBJ'
  767. #define Z_OBJ(zval) (zval).value.obj
  768. ^~~~
  769. /tmp/saxon/Saxon.C.API/php7_saxon.cpp:4720:47: note: in expansion of macro 'Z_OBJ_P'
  770. xdmValue_object *obj = (xdmValue_object *)Z_OBJ_P(getThis() TSRMLS_CC);
  771. ^~~~~~~
  772. /tmp/saxon/Saxon.C.API/php7_saxon.cpp:4720:75: error: expected ')' before ';' token
  773. xdmValue_object *obj = (xdmValue_object *)Z_OBJ_P(getThis() TSRMLS_CC);
  774. ^
  775. In file included from /usr/local/include/php/Zend/zend.h:27,
  776. from /usr/local/include/php/main/php.h:31,
  777. from /tmp/saxon/Saxon.C.API/php_saxon.h:15,
  778. from /tmp/saxon/Saxon.C.API/php7_saxon.cpp:5:
  779. /usr/local/include/php/Zend/zend_types.h:819:25: note: to match this '('
  780. #define Z_OBJ(zval) (zval).value.obj
  781. ^
  782. /usr/local/include/php/Zend/zend_types.h:820:28: note: in expansion of macro 'Z_OBJ'
  783. #define Z_OBJ_P(zval_p) Z_OBJ(*(zval_p))
  784. ^~~~~
  785. /tmp/saxon/Saxon.C.API/php7_saxon.cpp:4720:47: note: in expansion of macro 'Z_OBJ_P'
  786. xdmValue_object *obj = (xdmValue_object *)Z_OBJ_P(getThis() TSRMLS_CC);
  787. ^~~~~~~
  788. /tmp/saxon/Saxon.C.API/php7_saxon.cpp:4720:75: error: invalid cast from type 'zval' {aka '_zval_struct'} to type 'xdmValue_object*'
  789. xdmValue_object *obj = (xdmValue_object *)Z_OBJ_P(getThis() TSRMLS_CC);
  790. ^
  791. In file included from /usr/local/include/php/main/php.h:35,
  792. from /tmp/saxon/Saxon.C.API/php_saxon.h:15,
  793. from /tmp/saxon/Saxon.C.API/php7_saxon.cpp:5:
  794. /tmp/saxon/Saxon.C.API/php7_saxon.cpp: At global scope:
  795. /tmp/saxon/Saxon.C.API/php7_saxon.cpp:5497:69: error: 'ZEND_ACC_DTOR' was not declared in this scope
  796. PHP_ME(SaxonProcessor, __destruct, NULL, ZEND_ACC_PUBLIC | ZEND_ACC_DTOR)
  797. ^~~~~~~~~~~~~
  798. /usr/local/include/php/Zend/zend_API.h:77:162: note: in definition of macro 'ZEND_RAW_FENTRY'
  799. #define ZEND_RAW_FENTRY(zend_name, name, arg_info, flags) { zend_name, name, arg_info, (uint32_t) (sizeof(arg_info)/sizeof(struct _zend_internal_arg_info)-1), flags },
  800. ^~~~~
  801. /usr/local/include/php/main/php.h:388:25: note: in expansion of macro 'ZEND_ME'
  802. #define PHP_ME ZEND_ME
  803. ^~~~~~~
  804. /tmp/saxon/Saxon.C.API/php7_saxon.cpp:5497:5: note: in expansion of macro 'PHP_ME'
  805. PHP_ME(SaxonProcessor, __destruct, NULL, ZEND_ACC_PUBLIC | ZEND_ACC_DTOR)
  806. ^~~~~~
  807. /tmp/saxon/Saxon.C.API/php7_saxon.cpp:5497:69: note: suggested alternative: 'ZEND_ACC_CTOR'
  808. PHP_ME(SaxonProcessor, __destruct, NULL, ZEND_ACC_PUBLIC | ZEND_ACC_DTOR)
  809. ^~~~~~~~~~~~~
  810. /usr/local/include/php/Zend/zend_API.h:77:162: note: in definition of macro 'ZEND_RAW_FENTRY'
  811. #define ZEND_RAW_FENTRY(zend_name, name, arg_info, flags) { zend_name, name, arg_info, (uint32_t) (sizeof(arg_info)/sizeof(struct _zend_internal_arg_info)-1), flags },
  812. ^~~~~
  813. /usr/local/include/php/main/php.h:388:25: note: in expansion of macro 'ZEND_ME'
  814. #define PHP_ME ZEND_ME
  815. ^~~~~~~
  816. /tmp/saxon/Saxon.C.API/php7_saxon.cpp:5497:5: note: in expansion of macro 'PHP_ME'
  817. PHP_ME(SaxonProcessor, __destruct, NULL, ZEND_ACC_PUBLIC | ZEND_ACC_DTOR)
  818. ^~~~~~
  819. /tmp/saxon/Saxon.C.API/php7_saxon.cpp:5519:68: error: 'ZEND_ACC_DTOR' was not declared in this scope
  820. PHP_ME(XsltProcessor, __destruct, NULL, ZEND_ACC_PUBLIC | ZEND_ACC_DTOR)
  821. ^~~~~~~~~~~~~
  822. /usr/local/include/php/Zend/zend_API.h:77:162: note: in definition of macro 'ZEND_RAW_FENTRY'
  823. #define ZEND_RAW_FENTRY(zend_name, name, arg_info, flags) { zend_name, name, arg_info, (uint32_t) (sizeof(arg_info)/sizeof(struct _zend_internal_arg_info)-1), flags },
  824. ^~~~~
  825. /usr/local/include/php/main/php.h:388:25: note: in expansion of macro 'ZEND_ME'
  826. #define PHP_ME ZEND_ME
  827. ^~~~~~~
  828. /tmp/saxon/Saxon.C.API/php7_saxon.cpp:5519:5: note: in expansion of macro 'PHP_ME'
  829. PHP_ME(XsltProcessor, __destruct, NULL, ZEND_ACC_PUBLIC | ZEND_ACC_DTOR)
  830. ^~~~~~
  831. /tmp/saxon/Saxon.C.API/php7_saxon.cpp:5519:68: note: suggested alternative: 'ZEND_ACC_CTOR'
  832. PHP_ME(XsltProcessor, __destruct, NULL, ZEND_ACC_PUBLIC | ZEND_ACC_DTOR)
  833. ^~~~~~~~~~~~~
  834. /usr/local/include/php/Zend/zend_API.h:77:162: note: in definition of macro 'ZEND_RAW_FENTRY'
  835. #define ZEND_RAW_FENTRY(zend_name, name, arg_info, flags) { zend_name, name, arg_info, (uint32_t) (sizeof(arg_info)/sizeof(struct _zend_internal_arg_info)-1), flags },
  836. ^~~~~
  837. /usr/local/include/php/main/php.h:388:25: note: in expansion of macro 'ZEND_ME'
  838. #define PHP_ME ZEND_ME
  839. ^~~~~~~
  840. /tmp/saxon/Saxon.C.API/php7_saxon.cpp:5519:5: note: in expansion of macro 'PHP_ME'
  841. PHP_ME(XsltProcessor, __destruct, NULL, ZEND_ACC_PUBLIC | ZEND_ACC_DTOR)
  842. ^~~~~~
  843. /tmp/saxon/Saxon.C.API/php7_saxon.cpp:5549:70: error: 'ZEND_ACC_DTOR' was not declared in this scope
  844. PHP_ME(Xslt30Processor, __destruct, NULL, ZEND_ACC_PUBLIC | ZEND_ACC_DTOR)
  845. ^~~~~~~~~~~~~
  846. /usr/local/include/php/Zend/zend_API.h:77:162: note: in definition of macro 'ZEND_RAW_FENTRY'
  847. #define ZEND_RAW_FENTRY(zend_name, name, arg_info, flags) { zend_name, name, arg_info, (uint32_t) (sizeof(arg_info)/sizeof(struct _zend_internal_arg_info)-1), flags },
  848. ^~~~~
  849. /usr/local/include/php/main/php.h:388:25: note: in expansion of macro 'ZEND_ME'
  850. #define PHP_ME ZEND_ME
  851. ^~~~~~~
  852. /tmp/saxon/Saxon.C.API/php7_saxon.cpp:5549:5: note: in expansion of macro 'PHP_ME'
  853. PHP_ME(Xslt30Processor, __destruct, NULL, ZEND_ACC_PUBLIC | ZEND_ACC_DTOR)
  854. ^~~~~~
  855. /tmp/saxon/Saxon.C.API/php7_saxon.cpp:5549:70: note: suggested alternative: 'ZEND_ACC_CTOR'
  856. PHP_ME(Xslt30Processor, __destruct, NULL, ZEND_ACC_PUBLIC | ZEND_ACC_DTOR)
  857. ^~~~~~~~~~~~~
  858. /usr/local/include/php/Zend/zend_API.h:77:162: note: in definition of macro 'ZEND_RAW_FENTRY'
  859. #define ZEND_RAW_FENTRY(zend_name, name, arg_info, flags) { zend_name, name, arg_info, (uint32_t) (sizeof(arg_info)/sizeof(struct _zend_internal_arg_info)-1), flags },
  860. ^~~~~
  861. /usr/local/include/php/main/php.h:388:25: note: in expansion of macro 'ZEND_ME'
  862. #define PHP_ME ZEND_ME
  863. ^~~~~~~
  864. /tmp/saxon/Saxon.C.API/php7_saxon.cpp:5549:5: note: in expansion of macro 'PHP_ME'
  865. PHP_ME(Xslt30Processor, __destruct, NULL, ZEND_ACC_PUBLIC | ZEND_ACC_DTOR)
  866. ^~~~~~
  867. /tmp/saxon/Saxon.C.API/php7_saxon.cpp:5593:70: error: 'ZEND_ACC_DTOR' was not declared in this scope
  868. PHP_ME(XQueryProcessor, __destruct, NULL, ZEND_ACC_PUBLIC | ZEND_ACC_DTOR)
  869. ^~~~~~~~~~~~~
  870. /usr/local/include/php/Zend/zend_API.h:77:162: note: in definition of macro 'ZEND_RAW_FENTRY'
  871. #define ZEND_RAW_FENTRY(zend_name, name, arg_info, flags) { zend_name, name, arg_info, (uint32_t) (sizeof(arg_info)/sizeof(struct _zend_internal_arg_info)-1), flags },
  872. ^~~~~
  873. /usr/local/include/php/main/php.h:388:25: note: in expansion of macro 'ZEND_ME'
  874. #define PHP_ME ZEND_ME
  875. ^~~~~~~
  876. /tmp/saxon/Saxon.C.API/php7_saxon.cpp:5593:5: note: in expansion of macro 'PHP_ME'
  877. PHP_ME(XQueryProcessor, __destruct, NULL, ZEND_ACC_PUBLIC | ZEND_ACC_DTOR)
  878. ^~~~~~
  879. /tmp/saxon/Saxon.C.API/php7_saxon.cpp:5593:70: note: suggested alternative: 'ZEND_ACC_CTOR'
  880. PHP_ME(XQueryProcessor, __destruct, NULL, ZEND_ACC_PUBLIC | ZEND_ACC_DTOR)
  881. ^~~~~~~~~~~~~
  882. /usr/local/include/php/Zend/zend_API.h:77:162: note: in definition of macro 'ZEND_RAW_FENTRY'
  883. #define ZEND_RAW_FENTRY(zend_name, name, arg_info, flags) { zend_name, name, arg_info, (uint32_t) (sizeof(arg_info)/sizeof(struct _zend_internal_arg_info)-1), flags },
  884. ^~~~~
  885. /usr/local/include/php/main/php.h:388:25: note: in expansion of macro 'ZEND_ME'
  886. #define PHP_ME ZEND_ME
  887. ^~~~~~~
  888. /tmp/saxon/Saxon.C.API/php7_saxon.cpp:5593:5: note: in expansion of macro 'PHP_ME'
  889. PHP_ME(XQueryProcessor, __destruct, NULL, ZEND_ACC_PUBLIC | ZEND_ACC_DTOR)
  890. ^~~~~~
  891. /tmp/saxon/Saxon.C.API/php7_saxon.cpp:5617:69: error: 'ZEND_ACC_DTOR' was not declared in this scope
  892. PHP_ME(XPathProcessor, __destruct, NULL, ZEND_ACC_PUBLIC | ZEND_ACC_DTOR)
  893. ^~~~~~~~~~~~~
  894. /usr/local/include/php/Zend/zend_API.h:77:162: note: in definition of macro 'ZEND_RAW_FENTRY'
  895. #define ZEND_RAW_FENTRY(zend_name, name, arg_info, flags) { zend_name, name, arg_info, (uint32_t) (sizeof(arg_info)/sizeof(struct _zend_internal_arg_info)-1), flags },
  896. ^~~~~
  897. /usr/local/include/php/main/php.h:388:25: note: in expansion of macro 'ZEND_ME'
  898. #define PHP_ME ZEND_ME
  899. ^~~~~~~
  900. /tmp/saxon/Saxon.C.API/php7_saxon.cpp:5617:5: note: in expansion of macro 'PHP_ME'
  901. PHP_ME(XPathProcessor, __destruct, NULL, ZEND_ACC_PUBLIC | ZEND_ACC_DTOR)
  902. ^~~~~~
  903. /tmp/saxon/Saxon.C.API/php7_saxon.cpp:5617:69: note: suggested alternative: 'ZEND_ACC_CTOR'
  904. PHP_ME(XPathProcessor, __destruct, NULL, ZEND_ACC_PUBLIC | ZEND_ACC_DTOR)
  905. ^~~~~~~~~~~~~
  906. /usr/local/include/php/Zend/zend_API.h:77:162: note: in definition of macro 'ZEND_RAW_FENTRY'
  907. #define ZEND_RAW_FENTRY(zend_name, name, arg_info, flags) { zend_name, name, arg_info, (uint32_t) (sizeof(arg_info)/sizeof(struct _zend_internal_arg_info)-1), flags },
  908. ^~~~~
  909. /usr/local/include/php/main/php.h:388:25: note: in expansion of macro 'ZEND_ME'
  910. #define PHP_ME ZEND_ME
  911. ^~~~~~~
  912. /tmp/saxon/Saxon.C.API/php7_saxon.cpp:5617:5: note: in expansion of macro 'PHP_ME'
  913. PHP_ME(XPathProcessor, __destruct, NULL, ZEND_ACC_PUBLIC | ZEND_ACC_DTOR)
  914. ^~~~~~
  915. /tmp/saxon/Saxon.C.API/php7_saxon.cpp:5641:70: error: 'ZEND_ACC_DTOR' was not declared in this scope
  916. PHP_ME(SchemaValidator, __destruct, NULL, ZEND_ACC_PUBLIC | ZEND_ACC_DTOR)
  917. ^~~~~~~~~~~~~
  918. /usr/local/include/php/Zend/zend_API.h:77:162: note: in definition of macro 'ZEND_RAW_FENTRY'
  919. #define ZEND_RAW_FENTRY(zend_name, name, arg_info, flags) { zend_name, name, arg_info, (uint32_t) (sizeof(arg_info)/sizeof(struct _zend_internal_arg_info)-1), flags },
  920. ^~~~~
  921. /usr/local/include/php/main/php.h:388:25: note: in expansion of macro 'ZEND_ME'
  922. #define PHP_ME ZEND_ME
  923. ^~~~~~~
  924. /tmp/saxon/Saxon.C.API/php7_saxon.cpp:5641:5: note: in expansion of macro 'PHP_ME'
  925. PHP_ME(SchemaValidator, __destruct, NULL, ZEND_ACC_PUBLIC | ZEND_ACC_DTOR)
  926. ^~~~~~
  927. /tmp/saxon/Saxon.C.API/php7_saxon.cpp:5641:70: note: suggested alternative: 'ZEND_ACC_CTOR'
  928. PHP_ME(SchemaValidator, __destruct, NULL, ZEND_ACC_PUBLIC | ZEND_ACC_DTOR)
  929. ^~~~~~~~~~~~~
  930. /usr/local/include/php/Zend/zend_API.h:77:162: note: in definition of macro 'ZEND_RAW_FENTRY'
  931. #define ZEND_RAW_FENTRY(zend_name, name, arg_info, flags) { zend_name, name, arg_info, (uint32_t) (sizeof(arg_info)/sizeof(struct _zend_internal_arg_info)-1), flags },
  932. ^~~~~
  933. /usr/local/include/php/main/php.h:388:25: note: in expansion of macro 'ZEND_ME'
  934. #define PHP_ME ZEND_ME
  935. ^~~~~~~
  936. /tmp/saxon/Saxon.C.API/php7_saxon.cpp:5641:5: note: in expansion of macro 'PHP_ME'
  937. PHP_ME(SchemaValidator, __destruct, NULL, ZEND_ACC_PUBLIC | ZEND_ACC_DTOR)
  938. ^~~~~~
  939. /tmp/saxon/Saxon.C.API/php7_saxon.cpp:5663:63: error: 'ZEND_ACC_DTOR' was not declared in this scope
  940. PHP_ME(XdmValue, __destruct, NULL, ZEND_ACC_PUBLIC | ZEND_ACC_DTOR)
  941. ^~~~~~~~~~~~~
  942. /usr/local/include/php/Zend/zend_API.h:77:162: note: in definition of macro 'ZEND_RAW_FENTRY'
  943. #define ZEND_RAW_FENTRY(zend_name, name, arg_info, flags) { zend_name, name, arg_info, (uint32_t) (sizeof(arg_info)/sizeof(struct _zend_internal_arg_info)-1), flags },
  944. ^~~~~
  945. /usr/local/include/php/main/php.h:388:25: note: in expansion of macro 'ZEND_ME'
  946. #define PHP_ME ZEND_ME
  947. ^~~~~~~
  948. /tmp/saxon/Saxon.C.API/php7_saxon.cpp:5663:5: note: in expansion of macro 'PHP_ME'
  949. PHP_ME(XdmValue, __destruct, NULL, ZEND_ACC_PUBLIC | ZEND_ACC_DTOR)
  950. ^~~~~~
  951. /tmp/saxon/Saxon.C.API/php7_saxon.cpp:5663:63: note: suggested alternative: 'ZEND_ACC_CTOR'
  952. PHP_ME(XdmValue, __destruct, NULL, ZEND_ACC_PUBLIC | ZEND_ACC_DTOR)
  953. ^~~~~~~~~~~~~
  954. /usr/local/include/php/Zend/zend_API.h:77:162: note: in definition of macro 'ZEND_RAW_FENTRY'
  955. #define ZEND_RAW_FENTRY(zend_name, name, arg_info, flags) { zend_name, name, arg_info, (uint32_t) (sizeof(arg_info)/sizeof(struct _zend_internal_arg_info)-1), flags },
  956. ^~~~~
  957. /usr/local/include/php/main/php.h:388:25: note: in expansion of macro 'ZEND_ME'
  958. #define PHP_ME ZEND_ME
  959. ^~~~~~~
  960. /tmp/saxon/Saxon.C.API/php7_saxon.cpp:5663:5: note: in expansion of macro 'PHP_ME'
  961. PHP_ME(XdmValue, __destruct, NULL, ZEND_ACC_PUBLIC | ZEND_ACC_DTOR)
  962. ^~~~~~
  963. /tmp/saxon/Saxon.C.API/php7_saxon.cpp:5674:62: error: 'ZEND_ACC_DTOR' was not declared in this scope
  964. PHP_ME(XdmItem, __destruct, NULL, ZEND_ACC_PUBLIC | ZEND_ACC_DTOR)
  965. ^~~~~~~~~~~~~
  966. /usr/local/include/php/Zend/zend_API.h:77:162: note: in definition of macro 'ZEND_RAW_FENTRY'
  967. #define ZEND_RAW_FENTRY(zend_name, name, arg_info, flags) { zend_name, name, arg_info, (uint32_t) (sizeof(arg_info)/sizeof(struct _zend_internal_arg_info)-1), flags },
  968. ^~~~~
  969. /usr/local/include/php/main/php.h:388:25: note: in expansion of macro 'ZEND_ME'
  970. #define PHP_ME ZEND_ME
  971. ^~~~~~~
  972. /tmp/saxon/Saxon.C.API/php7_saxon.cpp:5674:5: note: in expansion of macro 'PHP_ME'
  973. PHP_ME(XdmItem, __destruct, NULL, ZEND_ACC_PUBLIC | ZEND_ACC_DTOR)
  974. ^~~~~~
  975. /tmp/saxon/Saxon.C.API/php7_saxon.cpp:5674:62: note: suggested alternative: 'ZEND_ACC_CTOR'
  976. PHP_ME(XdmItem, __destruct, NULL, ZEND_ACC_PUBLIC | ZEND_ACC_DTOR)
  977. ^~~~~~~~~~~~~
  978. /usr/local/include/php/Zend/zend_API.h:77:162: note: in definition of macro 'ZEND_RAW_FENTRY'
  979. #define ZEND_RAW_FENTRY(zend_name, name, arg_info, flags) { zend_name, name, arg_info, (uint32_t) (sizeof(arg_info)/sizeof(struct _zend_internal_arg_info)-1), flags },
  980. ^~~~~
  981. /usr/local/include/php/main/php.h:388:25: note: in expansion of macro 'ZEND_ME'
  982. #define PHP_ME ZEND_ME
  983. ^~~~~~~
  984. /tmp/saxon/Saxon.C.API/php7_saxon.cpp:5674:5: note: in expansion of macro 'PHP_ME'
  985. PHP_ME(XdmItem, __destruct, NULL, ZEND_ACC_PUBLIC | ZEND_ACC_DTOR)
  986. ^~~~~~
  987. /tmp/saxon/Saxon.C.API/php7_saxon.cpp:5686:62: error: 'ZEND_ACC_DTOR' was not declared in this scope
  988. PHP_ME(XdmNode, __destruct, NULL, ZEND_ACC_PUBLIC | ZEND_ACC_DTOR)
  989. ^~~~~~~~~~~~~
  990. /usr/local/include/php/Zend/zend_API.h:77:162: note: in definition of macro 'ZEND_RAW_FENTRY'
  991. #define ZEND_RAW_FENTRY(zend_name, name, arg_info, flags) { zend_name, name, arg_info, (uint32_t) (sizeof(arg_info)/sizeof(struct _zend_internal_arg_info)-1), flags },
  992. ^~~~~
  993. /usr/local/include/php/main/php.h:388:25: note: in expansion of macro 'ZEND_ME'
  994. #define PHP_ME ZEND_ME
  995. ^~~~~~~
  996. /tmp/saxon/Saxon.C.API/php7_saxon.cpp:5686:5: note: in expansion of macro 'PHP_ME'
  997. PHP_ME(XdmNode, __destruct, NULL, ZEND_ACC_PUBLIC | ZEND_ACC_DTOR)
  998. ^~~~~~
  999. /tmp/saxon/Saxon.C.API/php7_saxon.cpp:5686:62: note: suggested alternative: 'ZEND_ACC_CTOR'
  1000. PHP_ME(XdmNode, __destruct, NULL, ZEND_ACC_PUBLIC | ZEND_ACC_DTOR)
  1001. ^~~~~~~~~~~~~
  1002. /usr/local/include/php/Zend/zend_API.h:77:162: note: in definition of macro 'ZEND_RAW_FENTRY'
  1003. #define ZEND_RAW_FENTRY(zend_name, name, arg_info, flags) { zend_name, name, arg_info, (uint32_t) (sizeof(arg_info)/sizeof(struct _zend_internal_arg_info)-1), flags },
  1004. ^~~~~
  1005. /usr/local/include/php/main/php.h:388:25: note: in expansion of macro 'ZEND_ME'
  1006. #define PHP_ME ZEND_ME
  1007. ^~~~~~~
  1008. /tmp/saxon/Saxon.C.API/php7_saxon.cpp:5686:5: note: in expansion of macro 'PHP_ME'
  1009. PHP_ME(XdmNode, __destruct, NULL, ZEND_ACC_PUBLIC | ZEND_ACC_DTOR)
  1010. ^~~~~~
  1011. /tmp/saxon/Saxon.C.API/php7_saxon.cpp:5704:69: error: 'ZEND_ACC_DTOR' was not declared in this scope
  1012. PHP_ME(XdmAtomicValue, __destruct, NULL, ZEND_ACC_PUBLIC | ZEND_ACC_DTOR)
  1013. ^~~~~~~~~~~~~
  1014. /usr/local/include/php/Zend/zend_API.h:77:162: note: in definition of macro 'ZEND_RAW_FENTRY'
  1015. #define ZEND_RAW_FENTRY(zend_name, name, arg_info, flags) { zend_name, name, arg_info, (uint32_t) (sizeof(arg_info)/sizeof(struct _zend_internal_arg_info)-1), flags },
  1016. ^~~~~
  1017. /usr/local/include/php/main/php.h:388:25: note: in expansion of macro 'ZEND_ME'
  1018. #define PHP_ME ZEND_ME
  1019. ^~~~~~~
  1020. /tmp/saxon/Saxon.C.API/php7_saxon.cpp:5704:5: note: in expansion of macro 'PHP_ME'
  1021. PHP_ME(XdmAtomicValue, __destruct, NULL, ZEND_ACC_PUBLIC | ZEND_ACC_DTOR)
  1022. ^~~~~~
  1023. /tmp/saxon/Saxon.C.API/php7_saxon.cpp:5704:69: note: suggested alternative: 'ZEND_ACC_CTOR'
  1024. PHP_ME(XdmAtomicValue, __destruct, NULL, ZEND_ACC_PUBLIC | ZEND_ACC_DTOR)
  1025. ^~~~~~~~~~~~~
  1026. /usr/local/include/php/Zend/zend_API.h:77:162: note: in definition of macro 'ZEND_RAW_FENTRY'
  1027. #define ZEND_RAW_FENTRY(zend_name, name, arg_info, flags) { zend_name, name, arg_info, (uint32_t) (sizeof(arg_info)/sizeof(struct _zend_internal_arg_info)-1), flags },
  1028. ^~~~~
  1029. /usr/local/include/php/main/php.h:388:25: note: in expansion of macro 'ZEND_ME'
  1030. #define PHP_ME ZEND_ME
  1031. ^~~~~~~
  1032. /tmp/saxon/Saxon.C.API/php7_saxon.cpp:5704:5: note: in expansion of macro 'PHP_ME'
  1033. PHP_ME(XdmAtomicValue, __destruct, NULL, ZEND_ACC_PUBLIC | ZEND_ACC_DTOR)
  1034. ^~~~~~
  1035. /bin/bash /tmp/saxon/Saxon.C.API/libtool --mode=compile g++ -I. -I/tmp/saxon/Saxon.C.API -I/tmp/saxon/Saxon.C.API/include -I/tmp/saxon/Saxon.C.API/main -I/tmp/saxon/Saxon.C.API -I/usr/local/include/php -I/usr/local/include/php/main -I/usr/local/include/php/TSRM -I/usr/local/include/php/Zend -I/usr/local/include/php/ext -I/usr/local/include/php/ext/date/lib -I/tmp/saxon/Saxon.C.API/jni -DHAVE_CONFIG_H -g -O2 -c /tmp/saxon/Saxon.C.API/XdmItem.cpp -o XdmItem.lo
  1036. g++ -I. -I/tmp/saxon/Saxon.C.API -I/tmp/saxon/Saxon.C.API/include -I/tmp/saxon/Saxon.C.API/main -I/tmp/saxon/Saxon.C.API -I/usr/local/include/php -I/usr/local/include/php/main -I/usr/local/include/php/TSRM -I/usr/local/include/php/Zend -I/usr/local/include/php/ext -I/usr/local/include/php/ext/date/lib -I/tmp/saxon/Saxon.C.API/jni -DHAVE_CONFIG_H -g -O2 -c /tmp/saxon/Saxon.C.API/XdmItem.cpp -fPIC -DPIC -o .libs/XdmItem.o
  1037. make: *** [Makefile:209: php7_saxon.lo] Error 1
  1038. make: *** Waiting for unfinished jobs....
RAW Paste Data

Adblocker detected! Please consider disabling it...

We've detected AdBlock Plus or some other adblocking software preventing Pastebin.com from fully loading.

We don't have any obnoxious sound, or popup ads, we actively block these annoying types of ads!

Please add Pastebin.com to your ad blocker whitelist or disable your adblocking software.

×