LFGaming

ubuntu machine

Feb 19th, 2023 (edited)
552
1
Never
Not a member of Pastebin yet? Sign Up, it unlocks many cool features!
Bash 5.40 KB | Source Code | 1 0
  1. luke@luke-ESPRIMO-Mobile-U9210:~/StudioProjects/berty/js$ make android.release
  2. npx react-native run-android \
  3.     --no-packager \
  4.     --port="8081" \
  5.     --variant=Release \
  6.    
  7. warn Package @types/jest has been ignored because it contains invalid configuration. Reason: Package subpath './package.json' is not defined by "exports" in /home/luke/StudioProjects/berty/js/node_modules/@types/jest/package.json
  8. info Running jetifier to migrate libraries to AndroidX. You can disable it using "--no-jetifier" flag.
  9. Jetifier found 1406 file(s) to forward-jetify. Using 2 workers...
  10. info Launching emulator...
  11. error Failed to launch emulator. Reason: Emulator exited before boot..
  12. warn Please launch an emulator manually or connect a device. Otherwise app may fail to launch.
  13. info Installing the app...
  14.  
  15. > Configure project :app
  16. WARNING: BuildType(releaseStaff): buildConfigField 'DEBUG_LOGS' value is being replaced: false -> true
  17. WARNING: BuildType(releaseYolo): buildConfigField 'DEBUG_LOGS' value is being replaced: false -> true
  18.  
  19. > Configure project :expo-file-system
  20. WARNING: Configuration 'testApi' is obsolete and has been replaced with 'testImplementation'.
  21. It will be removed in version 5.0 of the Android Gradle plugin.
  22. For more information, see http://d.android.com/r/tools/update-dependency-configurations.html.
  23.  
  24. > Configure project :expo
  25.  
  26. Using expo modules
  27.   - expo-application (4.0.2)
  28.   - expo-barcode-scanner (11.2.1)
  29.   - expo-camera (12.1.2)
  30.   - expo-constants (13.0.2)
  31.   - expo-error-recovery (3.0.5)
  32.   - expo-file-system (13.1.4)
  33.   - expo-font (10.0.5)
  34.   - expo-image-loader (3.1.1)
  35.   - expo-keep-awake (10.0.2)
  36.   - expo-mail-composer (11.1.1)
  37.   - expo-modules-core (0.6.5)
  38.   - expo-network (4.1.1)
  39.   - expo-web-browser (10.1.1)
  40.  
  41.  
  42. > Configure project :react-native-android-keyboard-adjust
  43. WARNING: Configuration 'compile' is obsolete and has been replaced with 'implementation' and 'api'.
  44. It will be removed in version 5.0 of the Android Gradle plugin.
  45. For more information, see http://d.android.com/r/tools/update-dependency-configurations.html.
  46.  
  47. The Kotlin Gradle plugin was loaded multiple times in different subprojects, which is not supported and may break the build.
  48. This might happen in subprojects that apply the Kotlin plugins with the Gradle 'plugins { ... }' DSL if they specify explicit versions, even if the versions are equal.
  49. Please add the Kotlin plugin to the common parent project or the root project, then remove the versions in the subprojects.
  50. If the parent project does not need the plugin, add 'apply false' to the plugin line.
  51. See: https://docs.gradle.org/current/userguide/plugins.html#sec:subprojects_plugins_dsl
  52. The Kotlin plugin was loaded in the following projects: ':react-native-pager-view', ':shopify_flash-list'
  53.  
  54. > Task :app:bundleReleaseJsAndAssets
  55. warning: the transform cache was reset.
  56.                     Welcome to Metro!
  57.               Fast - Scalable - Integrated
  58.  
  59.  
  60.  
  61. > Task :app:bundleReleaseJsAndAssets FAILED
  62.  
  63. Deprecated Gradle features were used in this build, making it incompatible with Gradle 7.0.
  64. Use '--warning-mode all' to show the individual deprecation warnings.
  65. See https://docs.gradle.org/6.7/userguide/command_line_interface.html#sec:command_line_warnings
  66. 43 actionable tasks: 3 executed, 40 up-to-date
  67. warn Package @types/jest has been ignored because it contains invalid configuration. Reason: Package subpath './package.json' is not defined by "exports" in /home/luke/StudioProjects/berty/js/node_modules/@types/jest/package.json
  68.  
  69. FAILURE: Build failed with an exception.
  70.  
  71. * What went wrong:
  72. Execution failed for task ':app:bundleReleaseJsAndAssets'.
  73. > Process 'command 'node'' finished with non-zero exit value 137
  74.  
  75. * Try:
  76. Run with --stacktrace option to get the stack trace. Run with --info or --debug option to get more log output. Run with --scan to get full insights.
  77.  
  78. * Get more help at https://help.gradle.org
  79.  
  80. BUILD FAILED in 21m 57s
  81.  
  82. error Failed to install the app. Make sure you have the Android development environment set up: https://reactnative.dev/docs/environment-setup.
  83. Error: Command failed: ./gradlew app:installRelease -PreactNativeDevServerPort=8081
  84. warn Package @types/jest has been ignored because it contains invalid configuration. Reason: Package subpath './package.json' is not defined by "exports" in /home/luke/StudioProjects/berty/js/node_modules/@types/jest/package.json
  85.  
  86. FAILURE: Build failed with an exception.
  87.  
  88. * What went wrong:
  89. Execution failed for task ':app:bundleReleaseJsAndAssets'.
  90. > Process 'command 'node'' finished with non-zero exit value 137
  91.  
  92. * Try:
  93. Run with --stacktrace option to get the stack trace. Run with --info or --debug option to get more log output. Run with --scan to get full insights.
  94.  
  95. * Get more help at https://help.gradle.org
  96.  
  97. BUILD FAILED in 21m 57s
  98.  
  99.     at makeError (/home/luke/StudioProjects/berty/js/node_modules/execa/index.js:174:9)
  100.     at /home/luke/StudioProjects/berty/js/node_modules/execa/index.js:278:16
  101.     at processTicksAndRejections (node:internal/process/task_queues:96:5)
  102.     at async runOnAllDevices (/home/luke/StudioProjects/berty/js/node_modules/@react-native-community/cli-platform-android/build/commands/runAndroid/runOnAllDevices.js:94:5)
  103.     at async Command.handleAction (/home/luke/StudioProjects/berty/js/node_modules/@react-native-community/cli/build/index.js:186:9)
  104. info Run CLI with --verbose flag for more details.
  105. make: *** [Makefile:274: android.release] Error 1
  106.  
Advertisement
Add Comment
Please, Sign In to add comment