Advertisement
Guest User

Unknown errors

a guest
Feb 15th, 2022
24
Never
Not a member of Pastebin yet? Sign Up, it unlocks many cool features!
  1.  
  2. Grace@DESKTOP-56898IK MINGW64 /e/openmrs-tickets/openmrs-contrib-qaframework (RATEST-302)
  3. $ git status
  4. Refresh index: 100% (277/277), done.
  5. On branch RATEST-302
  6. Your branch is up to date with 'origin/RATEST-302'.
  7.  
  8. Changes to be committed:
  9. (use "git restore --staged <file>..." to unstage)
  10. modified: qaframework-bdd-tests/pom.xml
  11.  
  12. Changes not staged for commit:
  13. (use "git add <file>..." to update what will be committed)
  14. (use "git restore <file>..." to discard changes in working directory)
  15. modified: qaframework-bdd-tests/src/test/resources/org/openmrs/uitestframework/test.properties
  16.  
  17.  
  18. Grace@DESKTOP-56898IK MINGW64 /e/openmrs-tickets/openmrs-contrib-qaframework (RATEST-302)
  19. $ git a add .
  20. git: 'a' is not a git command. See 'git --help'.
  21.  
  22. The most similar commands are
  23. add
  24. am
  25.  
  26. Grace@DESKTOP-56898IK MINGW64 /e/openmrs-tickets/openmrs-contrib-qaframework (RATEST-302)
  27. $ git add .
  28.  
  29. Grace@DESKTOP-56898IK MINGW64 /e/openmrs-tickets/openmrs-contrib-qaframework (RATEST-302)
  30. $ git status
  31. On branch RATEST-302
  32. Your branch is up to date with 'origin/RATEST-302'.
  33.  
  34. Changes to be committed:
  35. (use "git restore --staged <file>..." to unstage)
  36. modified: qaframework-bdd-tests/pom.xml
  37. modified: qaframework-bdd-tests/src/test/resources/org/openmrs/uitestframework/test.properties
  38.  
  39.  
  40. Grace@DESKTOP-56898IK MINGW64 /e/openmrs-tickets/openmrs-contrib-qaframework (RATEST-302)
  41. $ mvn clean install -DskipTests=true
  42. [INFO] Scanning for projects...
  43. [WARNING]
  44. [WARNING] Some problems were encountered while building the effective model for org.openmrs.contrib:qaframework-legacy-tests:jar:1.0-SNAPSHOT
  45. [WARNING] 'build.plugins.plugin.version' for org.apache.maven.plugins:maven-deploy-plugin is missing. @ line 145, column 21
  46. [WARNING]
  47. [WARNING] Some problems were encountered while building the effective model for org.openmrs.contrib:qaframework-bdd-tests:jar:1.0-SNAPSHOT
  48. [WARNING] 'build.plugins.plugin.version' for org.apache.maven.plugins:maven-compiler-plugin is missing. @ line 183, column 21
  49. [WARNING]
  50. [WARNING] It is highly recommended to fix these problems because they threaten the stability of your build.
  51. [WARNING]
  52. [WARNING] For this reason, future Maven versions might no longer support building such malformed projects.
  53. [WARNING]
  54. [INFO] ------------------------------------------------------------------------
  55. [INFO] Reactor Build Order:
  56. [INFO]
  57. [INFO] OpenMRS QA Framework [pom]
  58. [INFO] qaframework-bdd-tests [jar]
  59. [INFO] qaframework-legacy-tests [jar]
  60. [INFO]
  61. [INFO] ------------------< org.openmrs.contrib:qaframework >-------------------
  62. [INFO] Building OpenMRS QA Framework 1.0-SNAPSHOT [1/3]
  63. [INFO] --------------------------------[ pom ]---------------------------------
  64. [INFO]
  65. [INFO] --- maven-clean-plugin:2.5:clean (default-clean) @ qaframework ---
  66. [INFO]
  67. [INFO] --- maven-install-plugin:2.4:install (default-install) @ qaframework ---
  68. [INFO] Installing E:\openmrs-tickets\openmrs-contrib-qaframework\pom.xml to C:\Users\Grace\.m2\repository\org\openmrs\contrib\qaframework\1.0-SNAPSHOT\qaframework-1.0-SNAPSHOT.pom
  69. [INFO]
  70. [INFO] -------------< org.openmrs.contrib:qaframework-bdd-tests >--------------
  71. [INFO] Building qaframework-bdd-tests 1.0-SNAPSHOT [2/3]
  72. [INFO] --------------------------------[ jar ]---------------------------------
  73. [INFO]
  74. [INFO] --- maven-clean-plugin:2.5:clean (default-clean) @ qaframework-bdd-tests ---
  75. [INFO] Deleting E:\openmrs-tickets\openmrs-contrib-qaframework\qaframework-bdd-tests\target
  76. [INFO]
  77. [INFO] --- frontend-maven-plugin:1.11.3:install-node-and-npm (install node and npm) @ qaframework-bdd-tests ---
  78. [INFO] Node v15.8.0 is already installed.
  79. [INFO]
  80. [INFO] --- maven-resources-plugin:2.6:resources (default-resources) @ qaframework-bdd-tests ---
  81. [INFO] Using 'UTF-8' encoding to copy filtered resources.
  82. [INFO] skip non existing resourceDirectory E:\openmrs-tickets\openmrs-contrib-qaframework\qaframework-bdd-tests\src\main\resources
  83. [INFO]
  84. [INFO] --- maven-compiler-plugin:3.1:compile (default-compile) @ qaframework-bdd-tests ---
  85. [INFO] Changes detected - recompiling the module!
  86. [INFO] Compiling 84 source files to E:\openmrs-tickets\openmrs-contrib-qaframework\qaframework-bdd-tests\target\classes
  87. [WARNING] /E:/openmrs-tickets/openmrs-contrib-qaframework/qaframework-bdd-tests/src/main/java/org/openmrs/contrib/qaframework/helper/Page.java: Some input files use or override a deprecated API.
  88. [WARNING] /E:/openmrs-tickets/openmrs-contrib-qaframework/qaframework-bdd-tests/src/main/java/org/openmrs/contrib/qaframework/helper/Page.java: Recompile with -Xlint:deprecation for details.
  89. [INFO]
  90. [INFO] --- maven-resources-plugin:2.6:testResources (default-testResources) @ qaframework-bdd-tests ---
  91. [INFO] Using 'UTF-8' encoding to copy filtered resources.
  92. [INFO] Copying 53 resources
  93. [INFO]
  94. [INFO] --- maven-compiler-plugin:3.1:testCompile (default-testCompile) @ qaframework-bdd-tests ---
  95. [INFO] Changes detected - recompiling the module!
  96. [INFO] Compiling 27 source files to E:\openmrs-tickets\openmrs-contrib-qaframework\qaframework-bdd-tests\target\test-classes
  97. [INFO]
  98. [INFO] --- maven-antrun-plugin:1.8:run (make-mac-chromedriver-executable) @ qaframework-bdd-tests ---
  99. [INFO] Executing tasks
  100.  
  101. main:
  102. [INFO] Executed tasks
  103. [INFO]
  104. [INFO] --- maven-antrun-plugin:1.8:run (make-linux-chromedriver-executable) @ qaframework-bdd-tests ---
  105. [INFO] Executing tasks
  106.  
  107. main:
  108. [INFO] Executed tasks
  109. [INFO]
  110. [INFO] --- maven-antrun-plugin:1.8:run (make-windows-chromedriver-executable) @ qaframework-bdd-tests ---
  111. [INFO] Executing tasks
  112.  
  113. main:
  114. [INFO] Executed tasks
  115. [INFO]
  116. [INFO] --- maven-antrun-plugin:1.8:run (make-mac-firefoxdriver-executable) @ qaframework-bdd-tests ---
  117. [INFO] Executing tasks
  118.  
  119. main:
  120. [INFO] Executed tasks
  121. [INFO]
  122. [INFO] --- maven-antrun-plugin:1.8:run (make-linux-firefoxdriver-executable) @ qaframework-bdd-tests ---
  123. [INFO] Executing tasks
  124.  
  125. main:
  126. [INFO] Executed tasks
  127. [INFO]
  128. [INFO] --- maven-antrun-plugin:1.8:run (make-windows-firefoxdriver-executable) @ qaframework-bdd-tests ---
  129. [INFO] Executing tasks
  130.  
  131. main:
  132. [INFO] Executed tasks
  133. [INFO]
  134. [INFO] --- maven-surefire-plugin:2.12.4:test (default-test) @ qaframework-bdd-tests ---
  135. [INFO] Tests are skipped.
  136. [INFO]
  137. [INFO] --- maven-jar-plugin:2.4:jar (default-jar) @ qaframework-bdd-tests ---
  138. [INFO] Building jar: E:\openmrs-tickets\openmrs-contrib-qaframework\qaframework-bdd-tests\target\qaframework-bdd-tests-1.0-SNAPSHOT.jar
  139. [INFO]
  140. [INFO] --- maven-install-plugin:2.4:install (default-install) @ qaframework-bdd-tests ---
  141. [INFO] Installing E:\openmrs-tickets\openmrs-contrib-qaframework\qaframework-bdd-tests\target\qaframework-bdd-tests-1.0-SNAPSHOT.jar to C:\Users\Grace\.m2\repository\org\openmrs\contrib\qaframework-bdd-tests\1.0-SNAPSHOT\qaframework-bdd-tests-1.0-SNAPSHOT.jar
  142. [INFO] Installing E:\openmrs-tickets\openmrs-contrib-qaframework\qaframework-bdd-tests\pom.xml to C:\Users\Grace\.m2\repository\org\openmrs\contrib\qaframework-bdd-tests\1.0-SNAPSHOT\qaframework-bdd-tests-1.0-SNAPSHOT.pom
  143. [INFO]
  144. [INFO] ------------< org.openmrs.contrib:qaframework-legacy-tests >------------
  145. [INFO] Building qaframework-legacy-tests 1.0-SNAPSHOT [3/3]
  146. [INFO] --------------------------------[ jar ]---------------------------------
  147. [INFO]
  148. [INFO] --- maven-clean-plugin:2.5:clean (default-clean) @ qaframework-legacy-tests ---
  149. [INFO] Deleting E:\openmrs-tickets\openmrs-contrib-qaframework\qaframework-legacy-tests\target
  150. [INFO]
  151. [INFO] --- maven-resources-plugin:2.6:resources (default-resources) @ qaframework-legacy-tests ---
  152. [INFO] Using 'UTF-8' encoding to copy filtered resources.
  153. [INFO] skip non existing resourceDirectory E:\openmrs-tickets\openmrs-contrib-qaframework\qaframework-legacy-tests\src\main\resources
  154. [INFO]
  155. [INFO] --- maven-compiler-plugin:3.1:compile (default-compile) @ qaframework-legacy-tests ---
  156. [INFO] No sources to compile
  157. [INFO]
  158. [INFO] --- maven-resources-plugin:2.6:testResources (default-testResources) @ qaframework-legacy-tests ---
  159. [INFO] Using 'UTF-8' encoding to copy filtered resources.
  160. [INFO] Copying 11 resources
  161. [INFO]
  162. [INFO] --- maven-compiler-plugin:3.1:testCompile (default-testCompile) @ qaframework-legacy-tests ---
  163. [INFO] Changes detected - recompiling the module!
  164. [INFO] Compiling 36 source files to E:\openmrs-tickets\openmrs-contrib-qaframework\qaframework-legacy-tests\target\test-classes
  165. [WARNING] /E:/openmrs-tickets/openmrs-contrib-qaframework/qaframework-legacy-tests/src/test/java/org/openmrs/contrib/qaframework/legacy/AddDeleteLocationTest.java: E:\openmrs-tickets\openmrs-contrib-qaframework\qaframework-legacy-tests\src\test\java\org\openmrs\contrib\qaframework\legacy\AddDeleteLocationTest.java uses or overrides a deprecated API.
  166. [WARNING] /E:/openmrs-tickets/openmrs-contrib-qaframework/qaframework-legacy-tests/src/test/java/org/openmrs/contrib/qaframework/legacy/AddDeleteLocationTest.java: Recompile with -Xlint:deprecation for details.
  167. [INFO]
  168. [INFO] --- maven-antrun-plugin:1.8:run (make-mac-chromedriver-executable) @ qaframework-legacy-tests ---
  169. [INFO] Executing tasks
  170.  
  171. main:
  172. [INFO] Executed tasks
  173. [INFO]
  174. [INFO] --- maven-antrun-plugin:1.8:run (make-linux-chromedriver-executable) @ qaframework-legacy-tests ---
  175. [INFO] Executing tasks
  176.  
  177. main:
  178. [INFO] Executed tasks
  179. [INFO]
  180. [INFO] --- maven-antrun-plugin:1.8:run (make-mac-firefoxdriver-executable) @ qaframework-legacy-tests ---
  181. [INFO] Executing tasks
  182.  
  183. main:
  184. [INFO] Executed tasks
  185. [INFO]
  186. [INFO] --- maven-antrun-plugin:1.8:run (make-linux-firefoxdriver-executable) @ qaframework-legacy-tests ---
  187. [INFO] Executing tasks
  188.  
  189. main:
  190. [INFO] Executed tasks
  191. [INFO]
  192. [INFO] --- maven-surefire-plugin:2.12.4:test (default-test) @ qaframework-legacy-tests ---
  193. [INFO] Tests are skipped.
  194. [INFO]
  195. [INFO] --- maven-jar-plugin:2.4:jar (default-jar) @ qaframework-legacy-tests ---
  196. [WARNING] JAR will be empty - no content was marked for inclusion!
  197. [INFO] Building jar: E:\openmrs-tickets\openmrs-contrib-qaframework\qaframework-legacy-tests\target\qaframework-legacy-tests-1.0-SNAPSHOT.jar
  198. [INFO]
  199. [INFO] --- maven-failsafe-plugin:2.18.1:integration-test (default) @ qaframework-legacy-tests ---
  200. [INFO] Tests are skipped.
  201. [INFO]
  202. [INFO] --- maven-failsafe-plugin:2.18.1:verify (default) @ qaframework-legacy-tests ---
  203. [INFO] Tests are skipped.
  204. [INFO]
  205. [INFO] --- maven-install-plugin:2.4:install (default-install) @ qaframework-legacy-tests ---
  206. [INFO] Installing E:\openmrs-tickets\openmrs-contrib-qaframework\qaframework-legacy-tests\target\qaframework-legacy-tests-1.0-SNAPSHOT.jar to C:\Users\Grace\.m2\repository\org\openmrs\contrib\qaframework-legacy-tests\1.0-SNAPSHOT\qaframework-legacy-tests-1.0-SNAPSHOT.jar
  207. [INFO] Installing E:\openmrs-tickets\openmrs-contrib-qaframework\qaframework-legacy-tests\pom.xml to C:\Users\Grace\.m2\repository\org\openmrs\contrib\qaframework-legacy-tests\1.0-SNAPSHOT\qaframework-legacy-tests-1.0-SNAPSHOT.pom
  208. [INFO] ------------------------------------------------------------------------
  209. [INFO] Reactor Summary for OpenMRS QA Framework 1.0-SNAPSHOT:
  210. [INFO]
  211. [INFO] OpenMRS QA Framework ............................... SUCCESS [ 12.176 s]
  212. [INFO] qaframework-bdd-tests .............................. SUCCESS [05:31 min]
  213. [INFO] qaframework-legacy-tests ........................... SUCCESS [01:25 min]
  214. [INFO] ------------------------------------------------------------------------
  215. [INFO] BUILD SUCCESS
  216. [INFO] ------------------------------------------------------------------------
  217. [INFO] Total time: 07:11 min
  218. [INFO] Finished at: 2022-02-15T20:41:37+03:00
  219. [INFO] ------------------------------------------------------------------------
  220.  
  221. Grace@DESKTOP-56898IK MINGW64 /e/openmrs-tickets/openmrs-contrib-qaframework (RATEST-302)
  222. $ cd qaframework-bdd-tests
  223.  
  224. Grace@DESKTOP-56898IK MINGW64 /e/openmrs-tickets/openmrs-contrib-qaframework/qaframework-bdd-tests (RATEST-302)
  225. $ npm run refapp2AddNewIdentifier
  226.  
  227. > openmrs-contrib-qaframework@0.1.0 refapp2AddNewIdentifier
  228. > mvn test -Dcucumber.filter.tags='@selenium and @addNewIdentifier'
  229.  
  230. [INFO] Scanning for projects...
  231. [WARNING]
  232. [WARNING] Some problems were encountered while building the effective model for org.openmrs.contrib:qaframework-bdd-tests:jar:1.0-SNAPSHOT
  233. [WARNING] 'build.plugins.plugin.version' for org.apache.maven.plugins:maven-compiler-plugin is missing. @ line 183, column 21
  234. [WARNING]
  235. [WARNING] It is highly recommended to fix these problems because they threaten the stability of your build.
  236. [WARNING]
  237. [WARNING] For this reason, future Maven versions might no longer support building such malformed projects.
  238. [WARNING]
  239. [INFO]
  240. [INFO] -------------< org.openmrs.contrib:qaframework-bdd-tests >--------------
  241. [INFO] Building qaframework-bdd-tests 1.0-SNAPSHOT
  242. [INFO] --------------------------------[ jar ]---------------------------------
  243. [INFO] ------------------------------------------------------------------------
  244. [INFO] BUILD FAILURE
  245. [INFO] ------------------------------------------------------------------------
  246. [INFO] Total time: 1.475 s
  247. [INFO] Finished at: 2022-02-15T20:56:55+03:00
  248. [INFO] ------------------------------------------------------------------------
  249. [ERROR] Unknown lifecycle phase "and". You must specify a valid lifecycle phase or a goal in the format <plugin-prefix>:<goal> or <plugin-group-id>:<plugin-artifact-id>[:<plugin-version>]:<goal>. Available lifecycle phases are: validate, initialize, generate-sources, process-sources, generate-resources, process-resources, compile, process-classes, generate-test-sources, process-test-sources, generate-test-resources, process-test-resources, test-compile, process-test-classes, test, prepare-package, package, pre-integration-test, integration-test, post-integration-test, verify, install, deploy, pre-clean, clean, post-clean, pre-site, site, post-site, site-deploy. -> [Help 1]
  250. [ERROR]
  251. [ERROR] To see the full stack trace of the errors, re-run Maven with the -e switch.
  252. [ERROR] Re-run Maven using the -X switch to enable full debug logging.
  253. [ERROR]
  254. [ERROR] For more information about the errors and possible solutions, please read the following articles:
  255. [ERROR] [Help 1] http://cwiki.apache.org/confluence/display/MAVEN/LifecyclePhaseNotFoundException
  256.  
  257. Grace@DESKTOP-56898IK MINGW64 /e/openmrs-tickets/openmrs-contrib-qaframework/qaframework-bdd-tests (RATEST-302)
Advertisement
RAW Paste Data Copied
Advertisement