Guest User

hdgjdgj

a guest
Jan 13th, 2019
5
Never
Not a member of Pastebin yet? Sign Up, it unlocks many cool features!
  1. HABUILD_SDK [maple] kristoffer@kristoffer-N550JK:~/hadk$ source build/envsetup.sh
  2. including device/google/dragon/vendorsetup.sh
  3. including device/google/marlin/vendorsetup.sh
  4. including device/google/muskie/vendorsetup.sh
  5. including device/google/taimen/vendorsetup.sh
  6. including device/sony/akari/vendorsetup.sh
  7. including device/sony/akatsuki/vendorsetup.sh
  8. including device/sony/apollo/vendorsetup.sh
  9. including device/sony/blanc/vendorsetup.sh
  10. including device/sony/discovery/vendorsetup.sh
  11. including device/sony/dora/vendorsetup.sh
  12. including device/sony/kagura/vendorsetup.sh
  13. including device/sony/keyaki/vendorsetup.sh
  14. including device/sony/kugo/vendorsetup.sh
  15. including device/sony/lilac/vendorsetup.sh
  16. including device/sony/maple/vendorsetup.sh
  17. including device/sony/pioneer/vendorsetup.sh
  18. including device/sony/poplar/vendorsetup.sh
  19. including device/sony/suzu/vendorsetup.sh
  20. including device/sony/voyager/vendorsetup.sh
  21. including sdk/bash_completion/adb.bash
  22. HABUILD_SDK [maple] kristoffer@kristoffer-N550JK:~/hadk$ lunch aosp_g8142-userdebug
  23.  
  24. ============================================
  25. PLATFORM_VERSION_CODENAME=REL
  26. PLATFORM_VERSION=8.1.0
  27. TARGET_PRODUCT=aosp_g8142
  28. TARGET_BUILD_VARIANT=userdebug
  29. TARGET_BUILD_TYPE=release
  30. TARGET_PLATFORM_VERSION=OPM1
  31. TARGET_BUILD_APPS=
  32. TARGET_ARCH=arm64
  33. TARGET_ARCH_VARIANT=armv8-a
  34. TARGET_CPU_VARIANT=cortex-a73
  35. TARGET_2ND_ARCH=arm
  36. TARGET_2ND_ARCH_VARIANT=armv7-a-neon
  37. TARGET_2ND_CPU_VARIANT=cortex-a73
  38. HOST_ARCH=x86_64
  39. HOST_2ND_ARCH=x86
  40. HOST_OS=linux
  41. HOST_OS_EXTRA=Linux-4.18.0-13-generic-x86_64-with-Ubuntu-14.04-trusty
  42. HOST_CROSS_OS=windows
  43. HOST_CROSS_ARCH=x86
  44. HOST_CROSS_2ND_ARCH=x86_64
  45. HOST_BUILD_TYPE=release
  46. BUILD_ID=OPM7.181005.003
  47. OUT_DIR=out
  48. AUX_OS_VARIANT_LIST=
  49. ============================================
  50. HABUILD_SDK [maple] kristoffer@kristoffer-N550JK:~/hadk$ make -j4 hybris-hal
  51. ============================================
  52. PLATFORM_VERSION_CODENAME=REL
  53. PLATFORM_VERSION=8.1.0
  54. TARGET_PRODUCT=aosp_g8142
  55. TARGET_BUILD_VARIANT=userdebug
  56. TARGET_BUILD_TYPE=release
  57. TARGET_ARCH=arm64
  58. TARGET_ARCH_VARIANT=armv8-a
  59. TARGET_CPU_VARIANT=cortex-a73
  60. TARGET_2ND_ARCH=arm
  61. TARGET_2ND_ARCH_VARIANT=armv7-a-neon
  62. TARGET_2ND_CPU_VARIANT=cortex-a73
  63. HOST_ARCH=x86_64
  64. HOST_2ND_ARCH=x86
  65. HOST_OS=linux
  66. HOST_OS_EXTRA=Linux-4.18.0-13-generic-x86_64-with-Ubuntu-14.04-trusty
  67. HOST_CROSS_OS=windows
  68. HOST_CROSS_ARCH=x86
  69. HOST_CROSS_2ND_ARCH=x86_64
  70. HOST_BUILD_TYPE=release
  71. BUILD_ID=OPM7.181005.003
  72. OUT_DIR=out
  73. ============================================
  74. [44/44] bootstrap out/soong/.minibootstrap/build.ninja.in
  75. [4/4] out/soong/.bootstrap/bin/minibp out/soong/.bootstrap/build.ninja
  76. [867/868] glob vendor/qcom/opensource/interfaces/wifi/supplicant/1.1/Android.bp
  77. [54/54] out/soong/.bootstrap/bin/soong_build out/soong/build.ninja
  78. out/build-aosp_g8142.ninja is missing, regenerating...
  79. [140/1015] including ./device/sony/common/Android.mk ...
  80. hardware/qcom/media/msm8998/mm-video-v4l2/vidc/venc/Android.mk:60: warning: "venc: PQ compiled out"
  81. rm: cannot remove 'out/target/product/maple/system/vendor/rfs/': No such file or directory
  82. /bin/bash: line 0: pushd: out/target/product/maple/odm/: No such file or directory
  83. [412/1015] including ./frameworks/rs/Android.mk ...
  84. build/core/package.mk: warning: RSUnbundledTests: Unknown installed file for module RSTestBackward
  85. build/core/package.mk: warning: RSUnbundledTests: Unknown installed file for module RSTest_Compat
  86. build/core/package.mk: warning: RSUnbundledTests19: Unknown installed file for module RSTestBackward19
  87. build/core/package.mk: warning: RSUnbundledTests19: Unknown installed file for module RSTest_Compat19
  88. [500/1015] including ./hybris/hybris-boot/Android.mk ...
  89. perl: warning: Setting locale failed.
  90. perl: warning: Please check that your locale settings:
  91. LANGUAGE = (unset),
  92. LC_ALL = (unset),
  93. LC_MESSAGES = "en_US.UTF-8",
  94. LC_CTYPE = "en_US.UTF-8",
  95. LANG = (unset)
  96. are supported and installed on your system.
  97. perl: warning: Falling back to the standard locale ("C").
  98. perl: warning: Setting locale failed.
  99. perl: warning: Please check that your locale settings:
  100. LANGUAGE = (unset),
  101. LC_ALL = (unset),
  102. LC_MESSAGES = "en_US.UTF-8",
  103. LC_CTYPE = "en_US.UTF-8",
  104. LANG = (unset)
  105. are supported and installed on your system.
  106. perl: warning: Falling back to the standard locale ("C").
  107. ./hybris/hybris-boot/Android.mk:71: warning: ********************* /boot appears to live on /dev/block/bootdevice/by-name/boot
  108. ./hybris/hybris-boot/Android.mk:72: warning: ********************* /data appears to live on /dev/block/bootdevice/by-name/userdata
  109. [684/1015] including ./system/sepolicy/Android.mk ...
  110. ./system/sepolicy/Android.mk:111: warning: BOARD_SEPOLICY_VERS not specified, assuming current platform version
  111. [1015/1015] including ./vendor/qcom/opensource/wlan/wcnss-service/Android.mk ...
  112. PRODUCT_COPY_FILES device/generic/goldfish/data/etc/apns-conf.xml:system/etc/apns-conf.xml ignored.
  113. No private recovery resources for TARGET_DEVICE maple
  114. platform_testing/build/tasks/tests/instrumentation_metric_test_list.mk: warning: continuous_instrumentation_metric_tests: Unknown installed file for module CorePerfTests
  115. platform_testing/build/tasks/tests/instrumentation_metric_test_list.mk: warning: continuous_instrumentation_metric_tests: Unknown installed file for module DocumentsUIPerfTests
  116. platform_testing/build/tasks/tests/instrumentation_metric_test_list.mk: warning: continuous_instrumentation_metric_tests: Unknown installed file for module DocumentsUIAppPerfTests
  117. platform_testing/build/tasks/tests/instrumentation_metric_test_list.mk: warning: continuous_instrumentation_metric_tests: Unknown installed file for module MtpDocumentsProviderPerfTests
  118. platform_testing/build/tasks/tests/instrumentation_metric_test_list.mk: warning: continuous_instrumentation_metric_tests: Unknown installed file for module perf-setup.sh
  119. platform_testing/build/tasks/tests/instrumentation_metric_test_list.mk: warning: continuous_instrumentation_metric_tests: Unknown installed file for module SurfaceComposition
  120. platform_testing/build/tasks/tests/instrumentation_metric_test_list.mk: warning: continuous_instrumentation_metric_tests: Unknown installed file for module RsBlasBenchmark
  121. platform_testing/build/tasks/tests/instrumentation_metric_test_list.mk: warning: continuous_instrumentation_metric_tests: Unknown installed file for module ImageProcessingJB
  122. platform_testing/build/tasks/tests/instrumentation_metric_test_list.mk: warning: continuous_instrumentation_metric_tests: Unknown installed file for module MultiUserPerfTests
  123. platform_testing/build/tasks/tests/instrumentation_test_list.mk: warning: continuous_instrumentation_tests: Unknown installed file for module HelloWorldTests
  124. platform_testing/build/tasks/tests/instrumentation_test_list.mk: warning: continuous_instrumentation_tests: Unknown installed file for module LongevityLibTests
  125. platform_testing/build/tasks/tests/instrumentation_test_list.mk: warning: continuous_instrumentation_tests: Unknown installed file for module ManagedProvisioningTests
  126. platform_testing/build/tasks/tests/instrumentation_test_list.mk: warning: continuous_instrumentation_tests: Unknown installed file for module FrameworksCoreTests
  127. platform_testing/build/tasks/tests/instrumentation_test_list.mk: warning: continuous_instrumentation_tests: Unknown installed file for module FrameworksNetTests
  128. platform_testing/build/tasks/tests/instrumentation_test_list.mk: warning: continuous_instrumentation_tests: Unknown installed file for module FrameworksNotificationTests
  129. platform_testing/build/tasks/tests/instrumentation_test_list.mk: warning: continuous_instrumentation_tests: Unknown installed file for module ConnTestApp
  130. platform_testing/build/tasks/tests/instrumentation_test_list.mk: warning: continuous_instrumentation_tests: Unknown installed file for module FrameworksServicesTests
  131. platform_testing/build/tasks/tests/instrumentation_test_list.mk: warning: continuous_instrumentation_tests: Unknown installed file for module FrameworksUtilTests
  132. platform_testing/build/tasks/tests/instrumentation_test_list.mk: warning: continuous_instrumentation_tests: Unknown installed file for module MtpDocumentsProviderTests
  133. platform_testing/build/tasks/tests/instrumentation_test_list.mk: warning: continuous_instrumentation_tests: Unknown installed file for module DocumentsUITests
  134. platform_testing/build/tasks/tests/instrumentation_test_list.mk: warning: continuous_instrumentation_tests: Unknown installed file for module ShellTests
  135. platform_testing/build/tasks/tests/instrumentation_test_list.mk: warning: continuous_instrumentation_tests: Unknown installed file for module SystemUITests
  136. platform_testing/build/tasks/tests/instrumentation_test_list.mk: warning: continuous_instrumentation_tests: Unknown installed file for module TestablesTests
  137. platform_testing/build/tasks/tests/instrumentation_test_list.mk: warning: continuous_instrumentation_tests: Unknown installed file for module RecyclerViewTests
  138. platform_testing/build/tasks/tests/instrumentation_test_list.mk: warning: continuous_instrumentation_tests: Unknown installed file for module FrameworksWifiApiTests
  139. platform_testing/build/tasks/tests/instrumentation_test_list.mk: warning: continuous_instrumentation_tests: Unknown installed file for module FrameworksWifiTests
  140. platform_testing/build/tasks/tests/instrumentation_test_list.mk: warning: continuous_instrumentation_tests: Unknown installed file for module FrameworksTelephonyTests
  141. platform_testing/build/tasks/tests/instrumentation_test_list.mk: warning: continuous_instrumentation_tests: Unknown installed file for module ContactsProviderTests
  142. platform_testing/build/tasks/tests/instrumentation_test_list.mk: warning: continuous_instrumentation_tests: Unknown installed file for module ContactsProviderTests2
  143. platform_testing/build/tasks/tests/instrumentation_test_list.mk: warning: continuous_instrumentation_tests: Unknown installed file for module SettingsUnitTests
  144. platform_testing/build/tasks/tests/instrumentation_test_list.mk: warning: continuous_instrumentation_tests: Unknown installed file for module TelecomUnitTests
  145. platform_testing/build/tasks/tests/instrumentation_test_list.mk: warning: continuous_instrumentation_tests: Unknown installed file for module AndroidVCardTests
  146. platform_testing/build/tasks/tests/instrumentation_test_list.mk: warning: continuous_instrumentation_tests: Unknown installed file for module PermissionFunctionalTests
  147. platform_testing/build/tasks/tests/instrumentation_test_list.mk: warning: continuous_instrumentation_tests: Unknown installed file for module BlockedNumberProviderTest
  148. platform_testing/build/tasks/tests/instrumentation_test_list.mk: warning: continuous_instrumentation_tests: Unknown installed file for module SettingsFunctionalTests
  149. platform_testing/build/tasks/tests/instrumentation_test_list.mk: warning: continuous_instrumentation_tests: Unknown installed file for module LauncherFunctionalTests
  150. platform_testing/build/tasks/tests/instrumentation_test_list.mk: warning: continuous_instrumentation_tests: Unknown installed file for module DownloadAppFunctionalTests
  151. platform_testing/build/tasks/tests/instrumentation_test_list.mk: warning: continuous_instrumentation_tests: Unknown installed file for module NotificationFunctionalTests
  152. platform_testing/build/tasks/tests/instrumentation_test_list.mk: warning: continuous_instrumentation_tests: Unknown installed file for module DownloadProviderTests
  153. platform_testing/build/tasks/tests/instrumentation_test_list.mk: warning: continuous_instrumentation_tests: Unknown installed file for module EmergencyInfoTests
  154. platform_testing/build/tasks/tests/instrumentation_test_list.mk: warning: continuous_instrumentation_tests: Unknown installed file for module CalendarProviderTests
  155. platform_testing/build/tasks/tests/instrumentation_test_list.mk: warning: continuous_instrumentation_tests: Unknown installed file for module SettingsLibTests
  156. platform_testing/build/tasks/tests/instrumentation_test_list.mk: warning: continuous_instrumentation_tests: Unknown installed file for module RSTest
  157. platform_testing/build/tasks/tests/instrumentation_test_list.mk: warning: continuous_instrumentation_tests: Unknown installed file for module PrintSpoolerOutOfProcessTests
  158. platform_testing/build/tasks/tests/instrumentation_test_list.mk: warning: continuous_instrumentation_tests: Unknown installed file for module CellBroadcastReceiverUnitTests
  159. platform_testing/build/tasks/tests/instrumentation_test_list.mk: warning: continuous_instrumentation_tests: Unknown installed file for module TelephonyProviderTests
  160. platform_testing/build/tasks/tests/instrumentation_test_list.mk: warning: continuous_instrumentation_tests: Unknown installed file for module CarrierConfigTests
  161. platform_testing/build/tasks/tests/instrumentation_test_list.mk: warning: continuous_instrumentation_tests: Unknown installed file for module TeleServiceTests
  162. platform_testing/build/tasks/tests/instrumentation_test_list.mk: warning: continuous_instrumentation_tests: Unknown installed file for module SettingsProviderTest
  163. platform_testing/build/tasks/tests/instrumentation_test_list.mk: warning: continuous_instrumentation_tests: Unknown installed file for module SettingsTests
  164. platform_testing/build/tasks/tests/native_metric_test_list.mk: warning: continuous_native_metric_tests: Unknown installed file for module perf-setup.sh
  165. ./frameworks/base/Android.mk:1281: warning: overriding commands for target `/index.html'
  166. ./frameworks/base/Android.mk:1245: warning: ignoring old commands for target `/index.html'
  167. build/core/Makefile:34: warning: overriding commands for target `out/target/product/maple/system/vendor/etc/gps.conf'
  168. build/core/base_rules.mk:390: warning: ignoring old commands for target `out/target/product/maple/system/vendor/etc/gps.conf'
  169. [ 99% 1445/1446] glob vendor/qcom/opensource/interfaces/wifi/supplicant/1.1/Android.bp
  170. [ 6% 1029/15742] Building Kernel Config
  171. make: Entering directory `/home/kristoffer/hadk/kernel/sony/msm-4.4/kernel'
  172. make[1]: Entering directory `/home/kristoffer/hadk/out/target/product/maple/obj/KERNEL_OBJ'
  173. HOSTCC scripts/basic/fixdep
  174. GEN ./Makefile
  175. HOSTCC scripts/kconfig/conf.o
  176. SHIPPED scripts/kconfig/zconf.tab.c
  177. SHIPPED scripts/kconfig/zconf.lex.c
  178. SHIPPED scripts/kconfig/zconf.hash.c
  179. HOSTCC scripts/kconfig/zconf.tab.o
  180. HOSTLD scripts/kconfig/conf
  181. warning: (SND_SOC_EXT_CODEC && SND_SOC_MSM8998) selects SND_SOC_WCD934X which has unmet direct dependencies (SOUND && !M68K && !UML && SND && SND_SOC && WCD934X_CODEC)
  182. warning: (SND_SOC_EXT_CODEC && SND_SOC_MSM8996 && SND_SOC_MSM8998 && SND_SOC_MSM8952) selects SND_SOC_WCD9335 which has unmet direct dependencies (SOUND && !M68K && !UML && SND && SND_SOC && WCD9335_CODEC)
  183. warning: (SND_SOC_INT_CODEC && SND_SOC_EXT_CODEC && SND_SOC_MSM8996 && SND_SOC_MSM8998) selects SND_SOC_MSM_HDMI_CODEC_RX which has unmet direct dependencies (SOUND && !M68K && !UML && SND && SND_SOC && FB_MSM_MDSS_HDMI_PANEL && (SND_SOC_APQ8084 || SND_SOC_MSM8994 || SND_SOC_MSM8996 || SND_SOC_MSM8998 || SND_SOC_SDM660_COMMON))
  184. warning: (SND_SOC_EXT_CODEC && SND_SOC_MSM8996 && SND_SOC_MSM8998 && SND_SOC_MSM8952) selects SND_SOC_WCD9335 which has unmet direct dependencies (SOUND && !M68K && !UML && SND && SND_SOC && WCD9335_CODEC)
  185. warning: (SND_SOC_EXT_CODEC && SND_SOC_MSM8998) selects SND_SOC_WCD934X which has unmet direct dependencies (SOUND && !M68K && !UML && SND && SND_SOC && WCD934X_CODEC)
  186. warning: (SND_SOC_INT_CODEC && SND_SOC_EXT_CODEC && SND_SOC_MSM8996 && SND_SOC_MSM8998) selects SND_SOC_MSM_HDMI_CODEC_RX which has unmet direct dependencies (SOUND && !M68K && !UML && SND && SND_SOC && FB_MSM_MDSS_HDMI_PANEL && (SND_SOC_APQ8084 || SND_SOC_MSM8994 || SND_SOC_MSM8996 || SND_SOC_MSM8998 || SND_SOC_SDM660_COMMON))
  187. #
  188. # configuration written to .config
  189. #
  190. make[1]: Leaving directory `/home/kristoffer/hadk/out/target/product/maple/obj/KERNEL_OBJ'
  191. make: Leaving directory `/home/kristoffer/hadk/kernel/sony/msm-4.4/kernel'
  192. [ 6% 1065/15742] host cross C: host_cross_libmdnssd <= external/mdnsresponder/mDNSShared/dnssd_clientstub.c
  193. external/mdnsresponder/mDNSShared/dnssd_clientstub.c:38:0: warning: "_SSIZE_T" redefined [enabled by default]
  194. #define _SSIZE_T
  195. ^
  196. <command-line>:0:0: note: this is the location of the previous definition
  197. cc1: warning: unrecognized command line option "-Wno-address-of-packed-member" [enabled by default]
  198. [ 6% 1091/15742] Building Kernel Headers
  199. make: Entering directory `/home/kristoffer/hadk/kernel/sony/msm-4.4/kernel'
  200. make[1]: Entering directory `/home/kristoffer/hadk/out/target/product/maple/obj/KERNEL_OBJ'
  201. GEN ./Makefile
  202. warning: (SND_SOC_EXT_CODEC && SND_SOC_MSM8998) selects SND_SOC_WCD934X which has unmet direct dependencies (SOUND && !M68K && !UML && SND && SND_SOC && WCD934X_CODEC)
  203. warning: (SND_SOC_EXT_CODEC && SND_SOC_MSM8996 && SND_SOC_MSM8998 && SND_SOC_MSM8952) selects SND_SOC_WCD9335 which has unmet direct dependencies (SOUND && !M68K && !UML && SND && SND_SOC && WCD9335_CODEC)
  204. warning: (SND_SOC_INT_CODEC && SND_SOC_EXT_CODEC && SND_SOC_MSM8996 && SND_SOC_MSM8998) selects SND_SOC_MSM_HDMI_CODEC_RX which has unmet direct dependencies (SOUND && !M68K && !UML && SND && SND_SOC && FB_MSM_MDSS_HDMI_PANEL && (SND_SOC_APQ8084 || SND_SOC_MSM8994 || SND_SOC_MSM8996 || SND_SOC_MSM8998 || SND_SOC_SDM660_COMMON))
  205. warning: (SND_SOC_EXT_CODEC && SND_SOC_MSM8996 && SND_SOC_MSM8998 && SND_SOC_MSM8952) selects SND_SOC_WCD9335 which has unmet direct dependencies (SOUND && !M68K && !UML && SND && SND_SOC && WCD9335_CODEC)
  206. warning: (SND_SOC_EXT_CODEC && SND_SOC_MSM8998) selects SND_SOC_WCD934X which has unmet direct dependencies (SOUND && !M68K && !UML && SND && SND_SOC && WCD934X_CODEC)
  207. warning: (SND_SOC_INT_CODEC && SND_SOC_EXT_CODEC && SND_SOC_MSM8996 && SND_SOC_MSM8998) selects SND_SOC_MSM_HDMI_CODEC_RX which has unmet direct dependencies (SOUND && !M68K && !UML && SND && SND_SOC && FB_MSM_MDSS_HDMI_PANEL && (SND_SOC_APQ8084 || SND_SOC_MSM8994 || SND_SOC_MSM8996 || SND_SOC_MSM8998 || SND_SOC_SDM660_COMMON))
  208. #
  209. # configuration written to .config
  210. #
  211. make[1]: Leaving directory `/home/kristoffer/hadk/out/target/product/maple/obj/KERNEL_OBJ'
  212. make: Leaving directory `/home/kristoffer/hadk/kernel/sony/msm-4.4/kernel'
  213. make: Entering directory `/home/kristoffer/hadk/kernel/sony/msm-4.4/kernel'
  214. make[1]: Entering directory `/home/kristoffer/hadk/out/target/product/maple/obj/KERNEL_OBJ'
  215. CHK include/generated/uapi/linux/version.h
  216. UPD include/generated/uapi/linux/version.h
  217. WRAP arch/arm64/include/generated/asm/bug.h
  218. WRAP arch/arm64/include/generated/asm/bugs.h
  219. WRAP arch/arm64/include/generated/asm/clkdev.h
  220. WRAP arch/arm64/include/generated/asm/cputime.h
  221. WRAP arch/arm64/include/generated/asm/current.h
  222. WRAP arch/arm64/include/generated/asm/delay.h
  223. WRAP arch/arm64/include/generated/asm/div64.h
  224. WRAP arch/arm64/include/generated/asm/dma.h
  225. WRAP arch/arm64/include/generated/asm/dma-contiguous.h
  226. WRAP arch/arm64/include/generated/asm/early_ioremap.h
  227. WRAP arch/arm64/include/generated/asm/emergency-restart.h
  228. WRAP arch/arm64/include/generated/asm/errno.h
  229. WRAP arch/arm64/include/generated/asm/ftrace.h
  230. WRAP arch/arm64/include/generated/asm/hash.h
  231. WRAP arch/arm64/include/generated/asm/hw_irq.h
  232. WRAP arch/arm64/include/generated/asm/ioctl.h
  233. WRAP arch/arm64/include/generated/asm/ioctls.h
  234. WRAP arch/arm64/include/generated/asm/ipcbuf.h
  235. WRAP arch/arm64/include/generated/asm/irq_regs.h
  236. WRAP arch/arm64/include/generated/asm/kdebug.h
  237. WRAP arch/arm64/include/generated/asm/kmap_types.h
  238. WRAP arch/arm64/include/generated/asm/kvm_para.h
  239. WRAP arch/arm64/include/generated/asm/local.h
  240. WRAP arch/arm64/include/generated/asm/local64.h
  241. WRAP arch/arm64/include/generated/asm/mcs_spinlock.h
  242. WRAP arch/arm64/include/generated/asm/mm-arch-hooks.h
  243. WRAP arch/arm64/include/generated/asm/mman.h
  244. WRAP arch/arm64/include/generated/asm/msgbuf.h
  245. WRAP arch/arm64/include/generated/asm/msi.h
  246. WRAP arch/arm64/include/generated/asm/mutex.h
  247. WRAP arch/arm64/include/generated/asm/pci.h
  248. WRAP arch/arm64/include/generated/asm/pci-bridge.h
  249. WRAP arch/arm64/include/generated/asm/poll.h
  250. WRAP arch/arm64/include/generated/asm/preempt.h
  251. WRAP arch/arm64/include/generated/asm/resource.h
  252. WRAP arch/arm64/include/generated/asm/rwsem.h
  253. WRAP arch/arm64/include/generated/asm/sections.h
  254. WRAP arch/arm64/include/generated/asm/segment.h
  255. WRAP arch/arm64/include/generated/asm/sembuf.h
  256. WRAP arch/arm64/include/generated/asm/serial.h
  257. WRAP arch/arm64/include/generated/asm/shmbuf.h
  258. WRAP arch/arm64/include/generated/asm/simd.h
  259. WRAP arch/arm64/include/generated/asm/sizes.h
  260. WRAP arch/arm64/include/generated/asm/socket.h
  261. WRAP arch/arm64/include/generated/asm/sockios.h
  262. WRAP arch/arm64/include/generated/asm/swab.h
  263. WRAP arch/arm64/include/generated/asm/switch_to.h
  264. WRAP arch/arm64/include/generated/asm/termbits.h
  265. WRAP arch/arm64/include/generated/asm/termios.h
  266. WRAP arch/arm64/include/generated/asm/topology.h
  267. WRAP arch/arm64/include/generated/asm/trace_clock.h
  268. WRAP arch/arm64/include/generated/asm/types.h
  269. WRAP arch/arm64/include/generated/asm/unaligned.h
  270. WRAP arch/arm64/include/generated/asm/user.h
  271. WRAP arch/arm64/include/generated/asm/vga.h
  272. WRAP arch/arm64/include/generated/asm/xor.h
  273. WRAP arch/arm64/include/generated/uapi/asm/kvm_para.h
  274. HOSTCC scripts/unifdef
  275. INSTALL usr/include/asm-generic/ (35 files)
  276. INSTALL usr/include/drm/ (21 files)
  277. INSTALL usr/include/linux/android/ (1 file)
  278. INSTALL usr/include/linux/byteorder/ (2 files)
  279. INSTALL usr/include/media/ais/ (6 files)
  280. INSTALL usr/include/linux/caif/ (2 files)
  281. INSTALL usr/include/linux/can/ (5 files)
  282. INSTALL usr/include/media/ (21 files)
  283. INSTALL usr/include/linux/dvb/ (8 files)
  284. INSTALL usr/include/misc/ (1 file)
  285. INSTALL usr/include/mtd/ (5 files)
  286. INSTALL usr/include/linux/hdlc/ (1 file)
  287. INSTALL usr/include/linux/hsi/ (2 files)
  288. INSTALL usr/include/linux/iio/ (2 files)
  289. INSTALL usr/include/rdma/hfi/ (1 file)
  290. INSTALL usr/include/linux/isdn/ (1 file)
  291. INSTALL usr/include/linux/mfd/wcd9xxx/ (2 files)
  292. INSTALL usr/include/rdma/ (6 files)
  293. INSTALL usr/include/linux/mfd/ (1 file)
  294. INSTALL usr/include/linux/mmc/ (3 files)
  295. INSTALL usr/include/scsi/fc/ (4 files)
  296. INSTALL usr/include/linux/netfilter/ipset/ (4 files)
  297. INSTALL usr/include/scsi/ufs/ (2 files)
  298. INSTALL usr/include/scsi/ (6 files)
  299. INSTALL usr/include/linux/netfilter/ (85 files)
  300. INSTALL usr/include/sound/ (20 files)
  301. INSTALL usr/include/video/ (5 files)
  302. INSTALL usr/include/xen/ (4 files)
  303. INSTALL usr/include/uapi/ (0 file)
  304. INSTALL usr/include/linux/netfilter_arp/ (2 files)
  305. INSTALL usr/include/linux/netfilter_bridge/ (17 files)
  306. INSTALL usr/include/linux/netfilter_ipv4/ (9 files)
  307. INSTALL usr/include/linux/netfilter_ipv6/ (12 files)
  308. INSTALL usr/include/linux/nfc/ (1 file)
  309. INSTALL usr/include/linux/nfsd/ (5 files)
  310. INSTALL usr/include/linux/raid/ (2 files)
  311. INSTALL usr/include/linux/sunrpc/ (1 file)
  312. INSTALL usr/include/linux/spi/ (1 file)
  313. INSTALL usr/include/linux/tc_act/ (11 files)
  314. INSTALL usr/include/linux/tc_ematch/ (4 files)
  315. INSTALL usr/include/linux/usb/ (12 files)
  316. INSTALL usr/include/linux/wimax/ (1 file)
  317. INSTALL usr/include/linux/ (488 files)
  318. INSTALL usr/include/asm/ (36 files)
  319. make[1]: Leaving directory `/home/kristoffer/hadk/out/target/product/maple/obj/KERNEL_OBJ'
  320. make: Leaving directory `/home/kristoffer/hadk/kernel/sony/msm-4.4/kernel'
  321. [ 7% 1248/15742] build out/target/product/maple/obj/ROOT/hybris-boot_intermediates/init
  322. Fixing mount-points for device maple
  323. [ 7% 1251/15742] Making initramfs : out/target/product/maple/obj/ROOT/hybris-boot_intermediates/boot-initramfs.gz
  324. 2906 blocks
  325. [ 7% 1253/15742] build out/target/product/maple/obj/ROOT/hybris-recovery_intermediates/init
  326. Fixing mount-points for device maple
  327. [ 7% 1254/15742] Making initramfs : out/target/product/maple/obj/ROOT/hybris-recovery_intermediates/recovery-initramfs.gz
  328. 2906 blocks
  329. [ 8% 1356/15742] //external/protobuf:aprotoc clang++ src/google/protobuf/compiler/java/java_file.cc [linux]
  330. In file included from external/protobuf/src/google/protobuf/compiler/java/java_file.cc:41:
  331. In file included from external/libcxx/include/set:389:
  332. external/libcxx/include/__tree:1817:22: warning: the specified comparator type does not provide a const call operator [-Wuser-defined-warnings]
  333. __trigger_diagnostics()), "");
  334. ^
  335. external/libcxx/include/set:400:28: note: in instantiation of member function 'std::__1::__tree<const google::protobuf::FieldDescriptor *, google::protobuf::compiler::java::(anonymous namespace)::FieldDescriptorCompare, std::__1::allocator<const google::protobuf::FieldDescriptor *> >::~__tree' requested here
  336. class _LIBCPP_TEMPLATE_VIS set
  337. ^
  338. external/libcxx/include/__tree:968:7: note: from 'diagnose_if' attribute on '__trigger_diagnostics':
  339. _LIBCPP_DIAGNOSE_WARNING(!__invokable<_Compare const&, _Tp const&, _Tp const&>::value,
  340. ^ ~~~~~~~~~~~~~~~~~~~~~~~~~~~~~~~~~~~~~~~~~~~~~~~~~~~~~~~~~~~~
  341. external/libcxx/include/__config:1058:20: note: expanded from macro '_LIBCPP_DIAGNOSE_WARNING'
  342. __attribute__((diagnose_if(__VA_ARGS__, "warning")))
  343. ^ ~~~~~~~~~~~
  344. 1 warning generated.
  345. [ 9% 1467/15742] //external/e2fsprogs/contrib/android:e2fsdroid clang block_range.c
  346. In file included from external/e2fsprogs/contrib/android/block_range.c:3:
  347. In file included from external/e2fsprogs/contrib/android/block_range.h:5:
  348. In file included from external/e2fsprogs/lib/ext2fs/ext2fs.h:71:
  349. external/e2fsprogs/lib/ext2fs/ext2_types.h:30:9: warning: '__bitwise' macro redefined [-Wmacro-redefined]
  350. #define __bitwise
  351. ^
  352. bionic/libc/kernel/uapi/linux/types.h:25:9: note: previous definition is here
  353. #define __bitwise __bitwise__
  354. ^
  355. 1 warning generated.
  356. [ 9% 1468/15742] //external/e2fsprogs/contrib/android:e2fsdroid clang e2fsdroid.c
  357. In file included from external/e2fsprogs/contrib/android/e2fsdroid.c:6:
  358. In file included from external/e2fsprogs/lib/ext2fs/ext2fs.h:71:
  359. external/e2fsprogs/lib/ext2fs/ext2_types.h:30:9: warning: '__bitwise' macro redefined [-Wmacro-redefined]
  360. #define __bitwise
  361. ^
  362. bionic/libc/kernel/uapi/linux/types.h:25:9: note: previous definition is here
  363. #define __bitwise __bitwise__
  364. ^
  365. 1 warning generated.
  366. [ 9% 1469/15742] //external/e2fsprogs/contrib/android:e2fsdroid clang base_fs.c
  367. In file included from external/e2fsprogs/contrib/android/base_fs.c:1:
  368. In file included from external/e2fsprogs/contrib/android/base_fs.h:4:
  369. In file included from external/e2fsprogs/contrib/android/fsmap.h:11:
  370. In file included from external/e2fsprogs/lib/ext2fs/ext2fs.h:71:
  371. external/e2fsprogs/lib/ext2fs/ext2_types.h:30:9: warning: '__bitwise' macro redefined [-Wmacro-redefined]
  372. #define __bitwise
  373. ^
  374. bionic/libc/kernel/uapi/linux/types.h:25:9: note: previous definition is here
  375. #define __bitwise __bitwise__
  376. ^
  377. 1 warning generated.
  378. [ 9% 1470/15742] //external/e2fsprogs/contrib/android:e2fsdroid clang block_list.c
  379. In file included from external/e2fsprogs/contrib/android/block_list.c:1:
  380. In file included from external/e2fsprogs/contrib/android/block_list.h:4:
  381. In file included from external/e2fsprogs/contrib/android/fsmap.h:11:
  382. In file included from external/e2fsprogs/lib/ext2fs/ext2fs.h:71:
  383. external/e2fsprogs/lib/ext2fs/ext2_types.h:30:9: warning: '__bitwise' macro redefined [-Wmacro-redefined]
  384. #define __bitwise
  385. ^
  386. bionic/libc/kernel/uapi/linux/types.h:25:9: note: previous definition is here
  387. #define __bitwise __bitwise__
  388. ^
  389. 1 warning generated.
  390. [ 9% 1471/15742] //external/e2fsprogs/contrib/android:e2fsdroid clang basefs_allocator.c
  391. In file included from external/e2fsprogs/contrib/android/basefs_allocator.c:3:
  392. In file included from external/e2fsprogs/contrib/android/basefs_allocator.h:5:
  393. In file included from external/e2fsprogs/lib/ext2fs/ext2fs.h:71:
  394. external/e2fsprogs/lib/ext2fs/ext2_types.h:30:9: warning: '__bitwise' macro redefined [-Wmacro-redefined]
  395. #define __bitwise
  396. ^
  397. bionic/libc/kernel/uapi/linux/types.h:25:9: note: previous definition is here
  398. #define __bitwise __bitwise__
  399. ^
  400. 1 warning generated.
  401. [ 9% 1472/15742] //external/e2fsprogs/contrib/android:e2fsdroid clang perms.c
  402. In file included from external/e2fsprogs/contrib/android/perms.c:4:
  403. In file included from external/e2fsprogs/contrib/android/perms.h:5:
  404. In file included from external/e2fsprogs/lib/ext2fs/ext2fs.h:71:
  405. external/e2fsprogs/lib/ext2fs/ext2_types.h:30:9: warning: '__bitwise' macro redefined [-Wmacro-redefined]
  406. #define __bitwise
  407. ^
  408. bionic/libc/kernel/uapi/linux/types.h:25:9: note: previous definition is here
  409. #define __bitwise __bitwise__
  410. ^
  411. external/e2fsprogs/contrib/android/perms.c:291:31: warning: unused parameter 'seopts' [-Wunused-parameter]
  412. struct selinux_opt *seopts,
  413. ^
  414. external/e2fsprogs/contrib/android/perms.c:292:24: warning: unused parameter 'nopt' [-Wunused-parameter]
  415. unsigned int nopt,
  416. ^
  417. 3 warnings generated.
  418. [ 9% 1473/15742] //external/e2fsprogs/contrib/android:e2fsdroid clang fsmap.c
  419. In file included from external/e2fsprogs/contrib/android/fsmap.c:1:
  420. In file included from external/e2fsprogs/contrib/android/fsmap.h:11:
  421. In file included from external/e2fsprogs/lib/ext2fs/ext2fs.h:71:
  422. external/e2fsprogs/lib/ext2fs/ext2_types.h:30:9: warning: '__bitwise' macro redefined [-Wmacro-redefined]
  423. #define __bitwise
  424. ^
  425. bionic/libc/kernel/uapi/linux/types.h:25:9: note: previous definition is here
  426. #define __bitwise __bitwise__
  427. ^
  428. 1 warning generated.
  429. [ 9% 1477/15742] //external/e2fsprogs/contrib/android:e2fsdroid clang e2fsdroid.c [linux]
  430. external/e2fsprogs/contrib/android/e2fsdroid.c:44:3: warning: ignoring return value of function declared with 'warn_unused_result' attribute [-Wunused-result]
  431. getcwd(cwd, PATH_MAX);
  432. ^~~~~~ ~~~~~~~~~~~~~
  433. external/e2fsprogs/contrib/android/e2fsdroid.c:128:7: warning: implicit declaration of function 'asprintf' is invalid in C99 [-Wimplicit-function-declaration]
  434. if (asprintf(&in_file, "(%s)", argv[optind]) == -1) {
  435. ^
  436. 2 warnings generated.
  437. [ 12% 1891/15742] Building Kernel
  438. FAILED: TARGET_KERNEL_BINARIES
  439. /bin/bash -c "(make -j2 CFLAGS_MODULE=\"-fno-pic\" -C kernel/sony/msm-4.4/kernel O=/home/kristoffer/hadk/out/target/product/maple/obj/KERNEL_OBJ ARCH=arm64 CROSS_COMPILE=\" aarch64-linux-android-\" Image.gz-dtb ) && (if grep -q 'CONFIG_OF=y' /home/kristoffer/hadk/out/target/product/maple/obj/KERNEL_OBJ/.config ; then echo \"Building DTBs\" ; make -j2 CFLAGS_MODULE=\"-fno-pic\" -C kernel/sony/msm-4.4/kernel O=/home/kristoffer/hadk/out/target/product/maple/obj/KERNEL_OBJ ARCH=arm64 CROSS_COMPILE=\" aarch64-linux-android-\" dtbs ; else echo \"DTBs not enabled\" ; fi ) && (prebuilts/build-tools/linux-x86/bin/acp -fp /home/kristoffer/hadk/out/target/product/maple/obj/KERNEL_OBJ/arch/arm64/boot/dts/qcom/*.dtb out/target/product/maple/dtbs/ ) && (if grep -q 'CONFIG_MODULES=y' /home/kristoffer/hadk/out/target/product/maple/obj/KERNEL_OBJ/.config ; then echo \"Building Kernel Modules\" ; make -j2 CFLAGS_MODULE=\"-fno-pic\" -C kernel/sony/msm-4.4/kernel O=/home/kristoffer/hadk/out/target/product/maple/obj/KERNEL_OBJ ARCH=arm64 CROSS_COMPILE=\" aarch64-linux-android-\" modules && make -j2 CFLAGS_MODULE=\"-fno-pic\" -C kernel/sony/msm-4.4/kernel O=/home/kristoffer/hadk/out/target/product/maple/obj/KERNEL_OBJ INSTALL_MOD_PATH=../../system ARCH=arm64 CROSS_COMPILE=\" aarch64-linux-android-\" modules_install && mdpath=\`find out/target/product/maple/system/lib/modules -type f -name modules.order\`; if [ \"\$mdpath\" != \"\" ];then mpath=\`dirname \$mdpath\`; ko=\`find \$mpath/kernel -type f -name *.ko\`; for i in \$ko; do aarch64-linux-android-strip --strip-unneeded \$i; mv \$i out/target/product/maple/system/lib/modules/; done; fi && mdpath=\`find out/target/product/maple/system/lib/modules -type f -name modules.order\`; if [ \"\$mdpath\" != \"\" ];then mpath=\`dirname \$mdpath\`; rm -rf \$mpath; fi ; else echo \"Kernel Modules not enabled\" ; fi )"
  440. make: Entering directory `/home/kristoffer/hadk/kernel/sony/msm-4.4/kernel'
  441. make[1]: Entering directory `/home/kristoffer/hadk/out/target/product/maple/obj/KERNEL_OBJ'
  442. GEN ./Makefile
  443. scripts/kconfig/conf --silentoldconfig Kconfig
  444. warning: (SND_SOC_EXT_CODEC && SND_SOC_MSM8998) selects SND_SOC_WCD934X which has unmet direct dependencies (SOUND && !M68K && !UML && SND && SND_SOC && WCD934X_CODEC)
  445. warning: (SND_SOC_EXT_CODEC && SND_SOC_MSM8996 && SND_SOC_MSM8998 && SND_SOC_MSM8952) selects SND_SOC_WCD9335 which has unmet direct dependencies (SOUND && !M68K && !UML && SND && SND_SOC && WCD9335_CODEC)
  446. warning: (SND_SOC_INT_CODEC && SND_SOC_EXT_CODEC && SND_SOC_MSM8996 && SND_SOC_MSM8998) selects SND_SOC_MSM_HDMI_CODEC_RX which has unmet direct dependencies (SOUND && !M68K && !UML && SND && SND_SOC && FB_MSM_MDSS_HDMI_PANEL && (SND_SOC_APQ8084 || SND_SOC_MSM8994 || SND_SOC_MSM8996 || SND_SOC_MSM8998 || SND_SOC_SDM660_COMMON))
  447. warning: (SND_SOC_EXT_CODEC && SND_SOC_MSM8998) selects SND_SOC_WCD934X which has unmet direct dependencies (SOUND && !M68K && !UML && SND && SND_SOC && WCD934X_CODEC)
  448. warning: (SND_SOC_EXT_CODEC && SND_SOC_MSM8996 && SND_SOC_MSM8998 && SND_SOC_MSM8952) selects SND_SOC_WCD9335 which has unmet direct dependencies (SOUND && !M68K && !UML && SND && SND_SOC && WCD9335_CODEC)
  449. warning: (SND_SOC_INT_CODEC && SND_SOC_EXT_CODEC && SND_SOC_MSM8996 && SND_SOC_MSM8998) selects SND_SOC_MSM_HDMI_CODEC_RX which has unmet direct dependencies (SOUND && !M68K && !UML && SND && SND_SOC && FB_MSM_MDSS_HDMI_PANEL && (SND_SOC_APQ8084 || SND_SOC_MSM8994 || SND_SOC_MSM8996 || SND_SOC_MSM8998 || SND_SOC_SDM660_COMMON))
  450. make[1]: Leaving directory `/home/kristoffer/hadk/out/target/product/maple/obj/KERNEL_OBJ'
  451. make[1]: Entering directory `/home/kristoffer/hadk/out/target/product/maple/obj/KERNEL_OBJ'
  452. CHK include/config/kernel.release
  453. GEN ./Makefile
  454. CHK include/generated/uapi/linux/version.h
  455. HOSTCC scripts/basic/bin2c
  456. HOSTCC scripts/dtc/dtc.o
  457. HOSTCC scripts/dtc/flattree.o
  458. HOSTCC scripts/dtc/fstree.o
  459. HOSTCC scripts/dtc/data.o
  460. HOSTCC scripts/dtc/livetree.o
  461. HOSTCC scripts/dtc/treesource.o
  462. HOSTCC scripts/dtc/srcpos.o
  463. HOSTCC scripts/dtc/checks.o
  464. HOSTCC scripts/dtc/util.o
  465. SHIPPED scripts/dtc/dtc-lexer.lex.c
  466. SHIPPED scripts/dtc/dtc-parser.tab.h
  467. SHIPPED scripts/dtc/dtc-parser.tab.c
  468. HOSTCC scripts/dtc/dtc-lexer.lex.o
  469. HOSTCC scripts/dtc/dtc-parser.tab.o
  470. HOSTLD scripts/dtc/dtc
  471. HOSTCC scripts/genksyms/genksyms.o
  472. SHIPPED scripts/genksyms/parse.tab.c
  473. SHIPPED scripts/genksyms/lex.lex.c
  474. SHIPPED scripts/genksyms/keywords.hash.c
  475. SHIPPED scripts/genksyms/parse.tab.h
  476. HOSTCC scripts/genksyms/parse.tab.o
  477. HOSTCC scripts/genksyms/lex.lex.o
  478. HOSTLD scripts/genksyms/genksyms
  479. CC scripts/mod/empty.o
  480. HOSTCC scripts/mod/mk_elfconfig
  481. CC scripts/mod/devicetable-offsets.s
  482. MKELF scripts/mod/elfconfig.h
  483. GEN scripts/mod/devicetable-offsets.h
  484. HOSTCC scripts/mod/sumversion.o
  485. HOSTCC scripts/mod/modpost.o
  486. HOSTCC scripts/mod/file2alias.o
  487. HOSTLD scripts/mod/modpost
  488. HOSTCC scripts/selinux/genheaders/genheaders
  489. HOSTCC scripts/selinux/mdp/mdp
  490. HOSTCC scripts/kallsyms
  491. HOSTCC scripts/recordmcount
  492. UPD include/config/kernel.release
  493. Using /home/kristoffer/hadk/kernel/sony/msm-4.4/kernel as source for kernel
  494. HOSTCC scripts/sortextable
  495. HOSTCC scripts/asn1_compiler
  496. HOSTCC scripts/extract-cert
  497. CHK include/generated/utsrelease.h
  498. UPD include/generated/utsrelease.h
  499. CHK include/generated/timeconst.h
  500. CC kernel/bounds.s
  501. UPD include/generated/timeconst.h
  502. CHK include/generated/bounds.h
  503. UPD include/generated/bounds.h
  504. CC arch/arm64/kernel/asm-offsets.s
  505. CHK include/generated/asm-offsets.h
  506. UPD include/generated/asm-offsets.h
  507. CALL /home/kristoffer/hadk/kernel/sony/msm-4.4/kernel/scripts/checksyscalls.sh
  508. LDS arch/arm64/kernel/vdso/vdso.lds
  509. VDSOA arch/arm64/kernel/vdso/gettimeofday.o
  510. VDSOA arch/arm64/kernel/vdso/note.o
  511. VDSOA arch/arm64/kernel/vdso/sigreturn.o
  512. VDSOL arch/arm64/kernel/vdso/vdso.so.dbg
  513. VDSOSYM include/generated/vdso-offsets.h
  514. CC init/main.o
  515. HOSTCC usr/gen_init_cpio
  516. GEN usr/initramfs_data.cpio.gz
  517. AS usr/initramfs_data.o
  518. LD usr/built-in.o
  519. CC arch/arm64/kernel/debug-monitors.o
  520. CHK include/generated/compile.h
  521. UPD include/generated/compile.h
  522. CC init/do_mounts.o
  523. AS arch/arm64/kernel/entry.o
  524. CC arch/arm64/kernel/irq.o
  525. CC arch/arm64/kernel/fpsimd.o
  526. CC init/do_mounts_rd.o
  527. AS arch/arm64/kernel/entry-fpsimd.o
  528. CC arch/arm64/kernel/process.o
  529. CC init/do_mounts_initrd.o
  530. CC init/do_mounts_md.o
  531. CC arch/arm64/kernel/ptrace.o
  532. CC init/do_mounts_dm.o
  533. CC init/initramfs.o
  534. CC arch/arm64/kernel/setup.o
  535. CC init/calibrate.o
  536. CC init/init_task.o
  537. CC arch/arm64/kernel/signal.o
  538. CC arch/arm64/kernel/sys.o
  539. CC init/version.o
  540. CC arch/arm64/kernel/stacktrace.o
  541. LD init/mounts.o
  542. LD init/built-in.o
  543. CC arch/arm64/mm/dma-mapping.o
  544. CC arch/arm64/kernel/time.o
  545. CC arch/arm64/kernel/traps.o
  546. CC arch/arm64/mm/extable.o
  547. CC arch/arm64/mm/fault.o
  548. CC arch/arm64/kernel/io.o
  549. CC arch/arm64/mm/init.o
  550. CC arch/arm64/kernel/vdso.o
  551. AS arch/arm64/kernel/hyp-stub.o
  552. CC arch/arm64/kernel/psci.o
  553. AS arch/arm64/mm/cache.o
  554. CC arch/arm64/kernel/cpu_ops.o
  555. CC arch/arm64/mm/copypage.o
  556. CC arch/arm64/kernel/insn.o
  557. CC arch/arm64/mm/flush.o
  558. CC arch/arm64/kernel/return_address.o
  559. CC arch/arm64/mm/ioremap.o
  560. CC arch/arm64/mm/mmap.o
  561. CC arch/arm64/kernel/cpuinfo.o
  562. CC arch/arm64/mm/pgd.o
  563. CC arch/arm64/kernel/cpu_errata.o
  564. CC arch/arm64/mm/mmu.o
  565. CC arch/arm64/kernel/cpufeature.o
  566. CC arch/arm64/kernel/alternative.o
  567. CC arch/arm64/mm/context.o
  568. CC arch/arm64/kernel/cacheinfo.o
  569. CC arch/arm64/kernel/smp.o
  570. AS arch/arm64/mm/proc.o
  571. CC arch/arm64/mm/pageattr.o
  572. CC arch/arm64/kernel/smp_spin_table.o
  573. LD arch/arm64/mm/built-in.o
  574. CC arch/arm64/kernel/topology.o
  575. LD arch/arm64/net/built-in.o
  576. AS arch/arm64/kernel/smccc-call.o
  577. CC arch/arm64/kernel/sys32.o
  578. CC arch/arm64/crypto/sha1-ce-glue.o
  579. AS arch/arm64/kernel/kuser32.o
  580. CC arch/arm64/kernel/signal32.o
  581. AS arch/arm64/crypto/sha1-ce-core.o
  582. CC arch/arm64/crypto/sha2-ce-glue.o
  583. AS arch/arm64/crypto/sha2-ce-core.o
  584. CC arch/arm64/crypto/ghash-ce-glue.o
  585. CC arch/arm64/kernel/sys_compat.o
  586. AS arch/arm64/crypto/ghash-ce-core.o
  587. CC arch/arm64/crypto/poly-hash-ce-glue.o
  588. AS arch/arm64/kernel/entry32.o
  589. CC arch/arm64/kernel/ftrace.o
  590. AS arch/arm64/crypto/poly-hash-ce-core.o
  591. CC arch/arm64/crypto/aes-ce-cipher.o
  592. AS arch/arm64/kernel/entry-ftrace.o
  593. CC arch/arm64/kernel/arm64ksyms.o
  594. CC arch/arm64/crypto/aes-ce-ccm-glue.o
  595. CC arch/arm64/kernel/module.o
  596. AS arch/arm64/crypto/aes-ce-ccm-core.o
  597. CC arch/arm64/crypto/aes-glue-ce.o
  598. CC arch/arm64/kernel/module-plts.o
  599. AS arch/arm64/crypto/aes-ce.o
  600. CC arch/arm64/kernel/perf_regs.o
  601. CC arch/arm64/crypto/aes-glue-neon.o
  602. CC arch/arm64/kernel/perf_callchain.o
  603. AS arch/arm64/crypto/aes-neon.o
  604. CC arch/arm64/crypto/crc32-arm64.o
  605. CC arch/arm64/kernel/perf_debug.o
  606. LD arch/arm64/crypto/sha1-ce.o
  607. LD arch/arm64/crypto/sha2-ce.o
  608. LD arch/arm64/crypto/ghash-ce.o
  609. LD arch/arm64/crypto/poly-hash-ce.o
  610. LD arch/arm64/crypto/aes-ce-ccm.o
  611. LD arch/arm64/crypto/aes-ce-blk.o
  612. LD arch/arm64/crypto/aes-neon-blk.o
  613. LD arch/arm64/crypto/built-in.o
  614. CC arch/arm64/kernel/perf_trace_counters.o
  615. CC kernel/fork.o
  616. CC arch/arm64/kernel/perf_trace_user.o
  617. AS arch/arm64/kernel/sleep.o
  618. CC arch/arm64/kernel/suspend.o
  619. CC arch/arm64/kernel/cpuidle.o
  620. CC arch/arm64/kernel/jump_label.o
  621. CC arch/arm64/kernel/pci.o
  622. CC arch/arm64/kernel/armv8_deprecated.o
  623. CC kernel/exec_domain.o
  624. CC arch/arm64/kernel/acpi.o
  625. CC kernel/panic.o
  626. CC arch/arm64/kernel/kaslr.o
  627. CC arch/arm64/kernel/probes/kprobes.o
  628. CC kernel/cpu.o
  629. CC arch/arm64/kernel/probes/decode-insn.o
  630. AS arch/arm64/kernel/probes/kprobes_trampoline.o
  631. CC arch/arm64/kernel/probes/simulate-insn.o
  632. CC kernel/exit.o
  633. LD arch/arm64/kernel/probes/built-in.o
  634. OBJCOPY arch/arm64/kernel/vdso/vdso.so
  635. AS arch/arm64/kernel/vdso/vdso.o
  636. LD arch/arm64/kernel/vdso/built-in.o
  637. AS arch/arm64/kernel/head.o
  638. LDS arch/arm64/kernel/vmlinux.lds
  639. LD arch/arm64/kernel/built-in.o
  640. CC kernel/softirq.o
  641. CC certs/system_keyring.o
  642. CC kernel/resource.o
  643. EXTRACT_CERTS /home/kristoffer/hadk/kernel/sony/msm-4.4/kernel/certs/"verity.x509.pem"
  644. AS certs/system_certificates.o
  645. LD certs/built-in.o
  646. CC mm/filemap.o
  647. CC kernel/sysctl.o
  648. CC kernel/sysctl_binary.o
  649. CC mm/mempool.o
  650. CC kernel/capability.o
  651. CC mm/oom_kill.o
  652. CC kernel/ptrace.o
  653. CC mm/maccess.o
  654. CC mm/page_alloc.o
  655. CC kernel/user.o
  656. CC kernel/signal.o
  657. CC mm/page-writeback.o
  658. CC kernel/sys.o
  659. CC mm/readahead.o
  660. CC kernel/kmod.o
  661. CC mm/swap.o
  662. CC kernel/workqueue.o
  663. CC mm/truncate.o
  664. CC mm/vmscan.o
  665. CC kernel/pid.o
  666. CC kernel/task_work.o
  667. CC kernel/extable.o
  668. CC kernel/params.o
  669. CC mm/shmem.o
  670. CC kernel/kthread.o
  671. CC kernel/sys_ni.o
  672. CC kernel/nsproxy.o
  673. CC mm/util.o
  674. CC kernel/notifier.o
  675. CC mm/mmzone.o
  676. CC mm/vmstat.o
  677. CC kernel/ksysfs.o
  678. CC kernel/cred.o
  679. CC mm/backing-dev.o
  680. CC kernel/reboot.o
  681. CC mm/mm_init.o
  682. CC kernel/async.o
  683. CC mm/mmu_context.o
  684. CC kernel/range.o
  685. CC kernel/smpboot.o
  686. CC mm/percpu.o
  687. CC kernel/groups.o
  688. CC kernel/bpf/core.o
  689. CC mm/slab_common.o
  690. CC kernel/bpf/syscall.o
  691. CC mm/compaction.o
  692. CC kernel/bpf/verifier.o
  693. CC mm/vmacache.o
  694. CC kernel/bpf/inode.o
  695. CC mm/interval_tree.o
  696. CC kernel/bpf/helpers.o
  697. CC mm/list_lru.o
  698. CC kernel/bpf/hashtab.o
  699. CC mm/workingset.o
  700. CC mm/debug.o
  701. CC kernel/bpf/arraymap.o
  702. CC mm/gup.o
  703. LD kernel/bpf/built-in.o
  704. CC kernel/events/core.o
  705. CC mm/highmem.o
  706. CC mm/memory.o
  707. CC mm/mincore.o
  708. CC mm/mlock.o
  709. CC kernel/events/ring_buffer.o
  710. CC kernel/events/callchain.o
  711. CC mm/mmap.o
  712. LD kernel/events/built-in.o
  713. CC kernel/irq/irqdesc.o
  714. CC kernel/irq/handle.o
  715. CC mm/mprotect.o
  716. CC kernel/irq/manage.o
  717. CC mm/mremap.o
  718. CC mm/msync.o
  719. CC kernel/irq/spurious.o
  720. CC mm/rmap.o
  721. CC kernel/irq/resend.o
  722. CC kernel/irq/chip.o
  723. CC mm/vmalloc.o
  724. CC kernel/irq/dummychip.o
  725. CC kernel/irq/devres.o
  726. CC mm/pagewalk.o
  727. CC kernel/irq/autoprobe.o
  728. CC mm/pgtable-generic.o
  729. CC kernel/irq/irqdomain.o
  730. CC mm/process_vm_access.o
  731. CC mm/showmem.o
  732. CC kernel/irq/proc.o
  733. CC mm/vmpressure.o
  734. CC kernel/irq/cpuhotplug.o
  735. CC mm/init-mm.o
  736. CC kernel/irq/pm.o
  737. CC mm/nobootmem.o
  738. CC kernel/irq/msi.o
  739. CC mm/fadvise.o
  740. CC mm/madvise.o
  741. LD kernel/irq/built-in.o
  742. LD kernel/livepatch/built-in.o
  743. CC kernel/locking/mutex.o
  744. CC mm/memblock.o
  745. CC kernel/locking/semaphore.o
  746. CC mm/page_io.o
  747. CC kernel/locking/rwsem.o
  748. CC kernel/locking/percpu-rwsem.o
  749. CC mm/swap_state.o
  750. CC kernel/locking/spinlock.o
  751. CC mm/swapfile.o
  752. CC kernel/locking/osq_lock.o
  753. CC kernel/locking/lglock.o
  754. CC kernel/locking/rtmutex.o
  755. CC mm/swap_ratio.o
  756. CC kernel/locking/rwsem-xadd.o
  757. CC mm/dmapool.o
  758. LD kernel/locking/built-in.o
  759. CC kernel/power/qos.o
  760. CC mm/sparse.o
  761. CC mm/sparse-vmemmap.o
  762. CC kernel/power/main.o
  763. CC mm/ksm.o
  764. CC kernel/power/process.o
  765. CC mm/slub.o
  766. CC kernel/power/suspend.o
  767. CC kernel/power/autosleep.o
  768. CC kernel/power/wakelock.o
  769. CC mm/migrate.o
  770. CC kernel/power/poweroff.o
  771. CC kernel/power/wakeup_reason.o
  772. LD kernel/power/built-in.o
  773. CC kernel/printk/printk.o
  774. CC mm/page_counter.o
  775. CC mm/memcontrol.o
  776. LD kernel/printk/built-in.o
  777. CC kernel/rcu/update.o
  778. CC kernel/rcu/sync.o
  779. CC mm/swap_cgroup.o
  780. CC kernel/rcu/srcu.o
  781. CC mm/page_isolation.o
  782. CC kernel/rcu/tree.o
  783. CC mm/early_ioremap.o
  784. CC mm/cma.o
  785. CC mm/cma_debug.o
  786. CC mm/usercopy.o
  787. LD mm/built-in.o
  788. LD kernel/rcu/built-in.o
  789. CC kernel/sched/core.o
  790. CC fs/open.o
  791. In file included from /home/kristoffer/hadk/kernel/sony/msm-4.4/kernel/include/trace/define_trace.h:90:0,
  792. from /home/kristoffer/hadk/kernel/sony/msm-4.4/kernel/include/trace/events/sched.h:1818,
  793. from /home/kristoffer/hadk/kernel/sony/msm-4.4/kernel/kernel/sched/core.c:99:
  794. /home/kristoffer/hadk/kernel/sony/msm-4.4/kernel/include/trace/events/sched.h: In function 'trace_event_raw_event_sched_load_avg_cpu':
  795. /home/kristoffer/hadk/kernel/sony/msm-4.4/kernel/include/trace/events/sched.h:1548:16: error: 'struct rq' has no member named 'prev_runnable_sum'
  796. cpu_rq(cpu)->prev_runnable_sum << SCHED_LOAD_SHIFT;
  797. ^
  798. /home/kristoffer/hadk/kernel/sony/msm-4.4/kernel/include/trace/trace_events.h:683:4: note: in definition of macro 'DECLARE_EVENT_CLASS'
  799. { assign; } \
  800. ^
  801. /home/kristoffer/hadk/kernel/sony/msm-4.4/kernel/include/trace/trace_events.h:64:9: note: in expansion of macro 'PARAMS'
  802. PARAMS(assign), \
  803. ^
  804. /home/kristoffer/hadk/kernel/sony/msm-4.4/kernel/include/trace/events/sched.h:1526:1: note: in expansion of macro 'TRACE_EVENT'
  805. TRACE_EVENT(sched_load_avg_cpu,
  806. ^
  807. /home/kristoffer/hadk/kernel/sony/msm-4.4/kernel/include/trace/events/sched.h:1540:2: note: in expansion of macro 'TP_fast_assign'
  808. TP_fast_assign(
  809. ^
  810. In file included from /home/kristoffer/hadk/kernel/sony/msm-4.4/kernel/include/trace/define_trace.h:91:0,
  811. from /home/kristoffer/hadk/kernel/sony/msm-4.4/kernel/include/trace/events/sched.h:1818,
  812. from /home/kristoffer/hadk/kernel/sony/msm-4.4/kernel/kernel/sched/core.c:99:
  813. /home/kristoffer/hadk/kernel/sony/msm-4.4/kernel/include/trace/events/sched.h: In function 'perf_trace_sched_load_avg_cpu':
  814. /home/kristoffer/hadk/kernel/sony/msm-4.4/kernel/include/trace/events/sched.h:1548:16: error: 'struct rq' has no member named 'prev_runnable_sum'
  815. cpu_rq(cpu)->prev_runnable_sum << SCHED_LOAD_SHIFT;
  816. ^
  817. /home/kristoffer/hadk/kernel/sony/msm-4.4/kernel/include/trace/perf.h:68:4: note: in definition of macro 'DECLARE_EVENT_CLASS'
  818. { assign; } \
  819. ^
  820. /home/kristoffer/hadk/kernel/sony/msm-4.4/kernel/include/trace/trace_events.h:64:9: note: in expansion of macro 'PARAMS'
  821. PARAMS(assign), \
  822. ^
  823. /home/kristoffer/hadk/kernel/sony/msm-4.4/kernel/include/trace/events/sched.h:1526:1: note: in expansion of macro 'TRACE_EVENT'
  824. TRACE_EVENT(sched_load_avg_cpu,
  825. ^
  826. /home/kristoffer/hadk/kernel/sony/msm-4.4/kernel/include/trace/events/sched.h:1540:2: note: in expansion of macro 'TP_fast_assign'
  827. TP_fast_assign(
  828. ^
  829. make[3]: *** [kernel/sched/core.o] Error 1
  830. make[2]: *** [kernel/sched] Error 2
  831. make[1]: *** [kernel] Error 2
  832. make[1]: *** Waiting for unfinished jobs....
  833. CC fs/read_write.o
  834. CC fs/file_table.o
  835. CC fs/super.o
  836. CC fs/char_dev.o
  837. CC fs/stat.o
  838. CC fs/exec.o
  839. CC fs/pipe.o
  840. CC fs/namei.o
  841. CC fs/fcntl.o
  842. CC fs/ioctl.o
  843. CC fs/readdir.o
  844. CC fs/select.o
  845. CC fs/dcache.o
  846. CC fs/inode.o
  847. CC fs/attr.o
  848. CC fs/bad_inode.o
  849. CC fs/file.o
  850. CC fs/filesystems.o
  851. CC fs/namespace.o
  852. CC fs/seq_file.o
  853. CC fs/xattr.o
  854. CC fs/libfs.o
  855. CC fs/fs-writeback.o
  856. CC fs/pnode.o
  857. CC fs/splice.o
  858. CC fs/sync.o
  859. CC fs/utimes.o
  860. CC fs/stack.o
  861. CC fs/fs_struct.o
  862. CC fs/statfs.o
  863. CC fs/fs_pin.o
  864. CC fs/nsfs.o
  865. CC fs/buffer.o
  866. CC fs/block_dev.o
  867. CC fs/direct-io.o
  868. CC fs/mpage.o
  869. CC fs/proc_namespace.o
  870. CC fs/configfs/inode.o
  871. CC fs/configfs/file.o
  872. CC fs/debugfs/inode.o
  873. CC fs/configfs/dir.o
  874. CC fs/debugfs/file.o
  875. CC fs/configfs/symlink.o
  876. CC fs/configfs/mount.o
  877. CC fs/configfs/item.o
  878. LD fs/debugfs/debugfs.o
  879. LD fs/debugfs/built-in.o
  880. CC fs/devpts/inode.o
  881. LD fs/configfs/configfs.o
  882. LD fs/devpts/devpts.o
  883. LD fs/configfs/built-in.o
  884. LD fs/devpts/built-in.o
  885. LD fs/exofs/built-in.o
  886. CC fs/ecryptfs/dentry.o
  887. CC fs/ecryptfs/file.o
  888. CC fs/ext4/balloc.o
  889. CC fs/ecryptfs/inode.o
  890. CC fs/ext4/bitmap.o
  891. CC fs/ecryptfs/main.o
  892. CC fs/ext4/dir.o
  893. CC fs/ecryptfs/super.o
  894. CC fs/ext4/file.o
  895. CC fs/ecryptfs/mmap.o
  896. CC fs/ecryptfs/read_write.o
  897. CC fs/ext4/fsync.o
  898. CC fs/ecryptfs/events.o
  899. CC fs/ext4/ialloc.o
  900. CC fs/ecryptfs/crypto.o
  901. CC fs/ext4/inode.o
  902. CC fs/ecryptfs/keystore.o
  903. CC fs/ecryptfs/kthread.o
  904. CC fs/ecryptfs/debug.o
  905. CC fs/ecryptfs/messaging.o
  906. CC fs/ecryptfs/miscdev.o
  907. CC fs/ext4/page-io.o
  908. LD fs/ecryptfs/ecryptfs.o
  909. LD fs/ecryptfs/built-in.o
  910. CC fs/ext4/ioctl.o
  911. CC fs/fat/cache.o
  912. CC fs/ext4/namei.o
  913. CC fs/fat/dir.o
  914. CC fs/fat/fatent.o
  915. CC fs/ext4/super.o
  916. CC fs/fat/file.o
  917. CC fs/fat/inode.o
  918. CC fs/fat/misc.o
  919. CC fs/fat/nfs.o
  920. CC fs/fat/namei_vfat.o
  921. CC fs/fat/namei_msdos.o
  922. LD fs/fat/fat.o
  923. LD fs/fat/vfat.o
  924. LD fs/fat/msdos.o
  925. LD fs/fat/built-in.o
  926. CC fs/ext4/symlink.o
  927. CC fs/fuse/dev.o
  928. CC fs/ext4/hash.o
  929. CC fs/ext4/resize.o
  930. CC fs/fuse/dir.o
  931. CC fs/ext4/extents.o
  932. CC fs/fuse/file.o
  933. CC fs/fuse/inode.o
  934. CC fs/ext4/ext4_jbd2.o
  935. CC fs/fuse/control.o
  936. CC fs/ext4/migrate.o
  937. LD fs/fuse/fuse.o
  938. LD fs/fuse/built-in.o
  939. CC fs/jbd2/transaction.o
  940. CC fs/ext4/mballoc.o
  941. CC fs/jbd2/commit.o
  942. CC fs/jbd2/recovery.o
  943. CC fs/jbd2/checkpoint.o
  944. CC fs/ext4/block_validity.o
  945. CC fs/ext4/move_extent.o
  946. CC fs/jbd2/revoke.o
  947. CC fs/ext4/mmp.o
  948. CC fs/jbd2/journal.o
  949. CC fs/ext4/indirect.o
  950. CC fs/ext4/extents_status.o
  951. LD fs/jbd2/jbd2.o
  952. LD fs/jbd2/built-in.o
  953. CC fs/ext4/xattr.o
  954. CC fs/kernfs/mount.o
  955. CC fs/ext4/xattr_user.o
  956. CC fs/kernfs/inode.o
  957. CC fs/ext4/xattr_trusted.o
  958. CC fs/ext4/inline.o
  959. CC fs/kernfs/dir.o
  960. CC fs/kernfs/file.o
  961. CC fs/ext4/readpage.o
  962. CC fs/ext4/sysfs.o
  963. CC fs/kernfs/symlink.o
  964. CC fs/ext4/xattr_security.o
  965. LD fs/kernfs/built-in.o
  966. CC fs/ext4/crypto_policy.o
  967. CC fs/ext4/crypto.o
  968. CC fs/ext4/crypto_key.o
  969. CC fs/ext4/crypto_fname.o
  970. CC fs/ext4/ext4_ice.o
  971. CC fs/nls/nls_base.o
  972. LD fs/ext4/ext4.o
  973. LD fs/ext4/built-in.o
  974. CC fs/notify/fsnotify.o
  975. CC fs/nls/nls_cp437.o
  976. CC fs/nls/nls_ascii.o
  977. CC fs/nls/nls_iso8859-1.o
  978. CC fs/notify/notification.o
  979. CC fs/nls/nls_utf8.o
  980. LD fs/nls/built-in.o
  981. CC fs/notify/group.o
  982. CC fs/proc/task_mmu.o
  983. CC fs/notify/inode_mark.o
  984. CC fs/notify/mark.o
  985. CC fs/proc/inode.o
  986. CC fs/notify/vfsmount_mark.o
  987. CC fs/proc/root.o
  988. CC fs/proc/base.o
  989. CC fs/notify/fdinfo.o
  990. CC fs/notify/dnotify/dnotify.o
  991. LD fs/notify/dnotify/built-in.o
  992. LD fs/notify/fanotify/built-in.o
  993. CC fs/notify/inotify/inotify_fsnotify.o
  994. CC fs/notify/inotify/inotify_user.o
  995. CC fs/proc/generic.o
  996. LD fs/notify/inotify/built-in.o
  997. LD fs/notify/built-in.o
  998. CC fs/pstore/inode.o
  999. CC fs/proc/array.o
  1000. CC fs/pstore/platform.o
  1001. CC fs/proc/fd.o
  1002. CC fs/proc/proc_tty.o
  1003. CC fs/pstore/pmsg.o
  1004. CC fs/proc/cmdline.o
  1005. CC fs/pstore/ram.o
  1006. CC fs/proc/consoles.o
  1007. CC fs/proc/cpuinfo.o
  1008. CC fs/pstore/ram_core.o
  1009. CC fs/proc/devices.o
  1010. CC fs/proc/interrupts.o
  1011. LD fs/pstore/pstore.o
  1012. LD fs/pstore/ramoops.o
  1013. LD fs/pstore/built-in.o
  1014. CC fs/quota/dquot.o
  1015. CC fs/proc/loadavg.o
  1016. CC fs/proc/meminfo.o
  1017. CC fs/proc/stat.o
  1018. CC fs/proc/uptime.o
  1019. CC fs/quota/quota_v2.o
  1020. CC fs/proc/version.o
  1021. CC fs/proc/softirqs.o
  1022. CC fs/quota/quota_tree.o
  1023. CC fs/proc/namespaces.o
  1024. CC fs/quota/quota.o
  1025. CC fs/proc/self.o
  1026. CC fs/proc/thread_self.o
  1027. CC fs/quota/kqid.o
  1028. CC fs/proc/proc_sysctl.o
  1029. CC fs/quota/netlink.o
  1030. LD fs/quota/built-in.o
  1031. CC fs/ramfs/inode.o
  1032. CC fs/proc/proc_net.o
  1033. CC fs/ramfs/file-mmu.o
  1034. LD fs/ramfs/ramfs.o
  1035. LD fs/ramfs/built-in.o
  1036. CC fs/proc/kmsg.o
  1037. CC fs/sdcardfs/dentry.o
  1038. CC fs/proc/page.o
  1039. CC fs/sdcardfs/file.o
  1040. LD fs/proc/proc.o
  1041. LD fs/proc/built-in.o
  1042. CC fs/sdcardfs/inode.o
  1043. CC fs/sdcardfs/main.o
  1044. CC fs/sdcardfs/super.o
  1045. CC fs/sdcardfs/lookup.o
  1046. CC fs/sdcardfs/mmap.o
  1047. CC fs/sdcardfs/packagelist.o
  1048. CC fs/sdcardfs/derived_perm.o
  1049. CC fs/sdfat/sdfat.o
  1050. LD fs/sdcardfs/sdcardfs.o
  1051. LD fs/sdcardfs/built-in.o
  1052. CC fs/sdfat/core.o
  1053. CC fs/sysfs/file.o
  1054. CC fs/sdfat/core_fat.o
  1055. CC fs/sysfs/dir.o
  1056. CC fs/sdfat/core_exfat.o
  1057. CC fs/sysfs/symlink.o
  1058. CC fs/sdfat/api.o
  1059. CC fs/sysfs/mount.o
  1060. CC fs/sysfs/group.o
  1061. CC fs/sdfat/blkdev.o
  1062. LD fs/sysfs/built-in.o
  1063. CC fs/tracefs/inode.o
  1064. CC fs/sdfat/fatent.o
  1065. CC fs/sdfat/amap_smart.o
  1066. LD fs/tracefs/tracefs.o
  1067. LD fs/tracefs/built-in.o
  1068. CC fs/sdfat/cache.o
  1069. CC fs/eventpoll.o
  1070. CC fs/sdfat/dfr.o
  1071. CC fs/sdfat/nls.o
  1072. CC fs/anon_inodes.o
  1073. CC fs/sdfat/misc.o
  1074. CC fs/signalfd.o
  1075. CC fs/sdfat/mpage.o
  1076. CC fs/sdfat/extent.o
  1077. CC fs/timerfd.o
  1078. CC fs/sdfat/xattr.o
  1079. CC fs/sdfat/statistics.o
  1080. CC fs/eventfd.o
  1081. LD fs/sdfat/sdfat_fs.o
  1082. LD fs/sdfat/built-in.o
  1083. CC fs/aio.o
  1084. CC fs/locks.o
  1085. CC fs/compat.o
  1086. CC fs/compat_ioctl.o
  1087. CC fs/binfmt_script.o
  1088. CC fs/binfmt_elf.o
  1089. CC fs/compat_binfmt_elf.o
  1090. CC fs/mbcache.o
  1091. CC fs/mbcache2.o
  1092. CC fs/posix_acl.o
  1093. CC fs/coredump.o
  1094. CC fs/drop_caches.o
  1095. CC fs/dcookies.o
  1096. LD fs/built-in.o
  1097. make[1]: Leaving directory `/home/kristoffer/hadk/out/target/product/maple/obj/KERNEL_OBJ'
  1098. make: *** [sub-make] Error 2
  1099. make: Leaving directory `/home/kristoffer/hadk/kernel/sony/msm-4.4/kernel'
  1100. [ 12% 1894/15742] //frameworks/native/libs/vr/libbufferhub:libbufferhub clang++ buffer_hub_client.cpp [arm]
  1101. ninja: build stopped: subcommand failed.
  1102. 22:58:12 ninja failed with: exit status 1
RAW Paste Data