SHARE
TWEET

Untitled

a guest Aug 18th, 2019 67 Never
Not a member of Pastebin yet? Sign Up, it unlocks many cool features!
  1. [INFO]:    Selecting java build tool:
  2. [INFO]:    Detected highest available build tools version to be 29.0.2
  3. [INFO]:        Building with gradle, as gradle executable is present
  4. [DEBUG]:   -> running gradlew assembleDebug
  5. [DEBUG]:    
  6. [DEBUG]:    FAILURE: Build failed with an exception.
  7. [DEBUG]:    
  8. [DEBUG]:    * Where:
  9. [DEBUG]:    Build file '/home/isaac/Desktop/tusko_roller/.buildozer/android/platform/build/dists/tu2korollertookwaytofuckinglong/build.gradle' line: 30
  10. [DEBUG]:    
  11. [DEBUG]:    * What went wrong:
  12. [DEBUG]:    A problem occurred evaluating root project 'tu2korollertookwaytofuckinglong'.
  13. [DEBUG]:    > Could not find method versionCode() for arguments [7214213869] on DefaultConfig_Decorated{name=main, dimension=null, minSdkVersion=DefaultApiVersion{mApiLevel=21, mCodename='null'}, targetSdkVersion=DefaultApiVersion{mApiLevel=27, mCodename='null'}, renderscriptTargetApi=null, renderscriptSupportModeEnabled=null, renderscriptSupportModeBlasEnabled=null, renderscriptNdkModeEnabled=null, versionCode=null, versionName=null, applicationId=null, testApplicationId=null, testInstrumentationRunner=null, testInstrumentationRunnerArguments={}, testHandleProfiling=null, testFunctionalTest=null, signingConfig=null, resConfig=null, mBuildConfigFields={}, mResValues={}, mProguardFiles=[], mConsumerProguardFiles=[], mManifestPlaceholders={}, mWearAppUnbundled=null} of type com.android.build.gradle.internal.dsl.DefaultConfig.
  14. [DEBUG]:    
  15. [DEBUG]:    * Try:
  16. [DEBUG]:    Run with --stacktrace option to get the stack trace. Run with --info or --debug option to get more log output. Run with --scan to get full insights.
  17. [DEBUG]:    
  18. [DEBUG]:    * Get more help at https://help.gradle.org
  19. [DEBUG]:    
  20. [DEBUG]:    BUILD FAILED in 1s
  21. [DEBUG]:    
  22. [DEBUG]:    
  23. Exception in thread background thread for pid 23379:
  24. Traceback (most recent call last):
  25.   File "/usr/lib/python3.6/threading.py", line 916, in _bootstrap_inner
  26.     self.run()
  27.   File "/usr/lib/python3.6/threading.py", line 864, in run
  28.     self._target(*self._args, **self._kwargs)
  29.   File "/home/isaac/.local/lib/python3.6/site-packages/sh.py", line 1540, in wrap
  30.     fn(*args, **kwargs)
  31.   File "/home/isaac/.local/lib/python3.6/site-packages/sh.py", line 2459, in background_thread
  32.     handle_exit_code(exit_code)
  33.   File "/home/isaac/.local/lib/python3.6/site-packages/sh.py", line 2157, in fn
  34.     return self.command.handle_command_exit_code(exit_code)
  35.   File "/home/isaac/.local/lib/python3.6/site-packages/sh.py", line 815, in handle_command_exit_code
  36.     raise exc
  37. sh.ErrorReturnCode_1:
  38.  
  39.   RAN: /home/isaac/Desktop/tusko_roller/.buildozer/android/platform/build/dists/tu2korollertookwaytofuckinglong/gradlew assembleDebug
  40.  
  41.   STDOUT:
  42.  
  43. FAILURE: Build failed with an exception.
  44.  
  45. * Where:
  46. Build file '/home/isaac/Desktop/tusko_roller/.buildozer/android/platform/build/dists/tu2korollertookwaytofuckinglong/build.gradle' line: 30
  47.  
  48. * What went wrong:
  49. A problem occurred evaluating root project 'tu2korollertookwaytofuckinglong'.
  50. > Could not find method versionCode() for arguments [7214213869] on DefaultConfig_Decorated{name=main, dimension=null, minSdkVersion=DefaultApiVersion{mApiLevel=21, mCodename='null'}, targetSdkVersion=DefaultApiVersion{mApiLevel=27, mCodename='null'}, renderscriptTargetApi=null, renderscriptSupportModeEnabled=null, renderscriptSupportModeBlasEnabled=null, renderscriptNdkModeEnabled=null, versionCode=null, versionName=null, applicationId=null, testApplicationId=null, testInstrumentationRunner=null, testInstrumentationRunnerArguments={}, testHandleProfiling=null, testFunctionalTest=null, signingConfig=null, resConfig=null, mBuildConfigFields={}, mResValues={}, mProguardFiles=[], mConsumerProguardFiles=[], mManifestPlaceholders={}, mWearAppUnbundled=null} of type com.android.build.gradle.internal.dsl.DefaultConfig.
  51.  
  52. * Try:
  53. Run with --stacktrace option to get the stack trace. Run with --info or --debug option to get more log output. Run with --scan to get full insights.
  54.  
  55. * Get more help at https://help.gradle.org
  56.  
  57. BUILD FAILED in 1s
  58.  
  59.  
  60.  
  61.  
  62.   STDERR:
  63.  
  64.    
  65. FAILURE: Build failed with an exception.   
  66.    
  67. * Where:   
  68. Build file '/home/isaac/Desktop/tusko_roller/.buildozer/android/platform/build/dists/tu2korollertookwaytofuckinglong/build.gradle' line: 30
  69.    
  70. * What went wrong: 
  71. A problem occurred evaluating root project 'tu2korollertookwaytofuckinglong'.  
  72. > Could not find method versionCode() for arguments [7214213869] on DefaultConfig_Decorated{name=main, dimension=null, minSdkVersion=DefaultApiVersion{mApiLevel=21, mCodename='null'}, targetSdkVersion=DefaultApiVersion{mApiLevel=27, mCodename='null'}, renderscriptTargetApi=null, renderscriptSupportModeEnabled=null, renderscriptSupportModeBlasEnabled=null, renderscriptNdkModeEnabled=null, versionCode=null, versionName=null, applicationId=null, testApplicationId=null, testInstrumentationRunner=null, testInstrumentationRunnerArguments={}, testHandleProfiling=null, testFunctionalTest=null, signingConfig=null, resConfig=null, mBuildConfigFields={}, mResValues={}, mProguardFiles=[], mConsumerProguardFiles=[], mManifestPlaceholders={}, mWearAppUnbundled=null} of type com.android.build.gradle.internal.dsl.DefaultConfig.
  73.    
  74. * Try: 
  75. Run with --stacktrace option to get the stack trace. Run with --info or --debug option to get more log output. Run with --scan to get full insights.   
  76.    
  77. * Get more help at https://help.gradle.org 
  78.    
  79. BUILD FAILED in 1s 
  80.  
  81. [INFO]:    STDERR:
  82.    
  83. [INFO]:    COMMAND:
  84. cd /home/isaac/Desktop/tusko_roller/.buildozer/android/platform/build/dists/tu2korollertookwaytofuckinglong && /home/isaac/Desktop/tusko_roller/.buildozer/android/platform/build/dists/tu2korollertookwaytofuckinglong/gradlew assembleDebug
  85.  
  86. [WARNING]: ERROR: /home/isaac/Desktop/tusko_roller/.buildozer/android/platform/build/dists/tu2korollertookwaytofuckinglong/gradlew failed!
  87. WARNING: Received a --sdk argument, but this argument is deprecated and does nothing.
  88. No compiled python is present to zip, skipping.
  89. No setup.py/pyproject.toml used, copying full private data into .apk.
  90. Applying Java source code patches...
  91. Applying patch: src/patches/SDLActivity.java.patch
  92. # Command failed: /usr/bin/python3 -m pythonforandroid.toolchain apk --debug --bootstrap=sdl2 --dist_name tu2korollertookwaytofuckinglong --name 'Tu(s)ko Roller' --version 42069.6969 --package org.test.tu2korollertookwaytofuckinglong --android_api 27 --minsdk 21 --ndk-api 21 --private /home/isaac/Desktop/tusko_roller/.buildozer/android/app --orientation sensor --window --copy-libs --arch armeabi-v7a --color=always --storage-dir="/home/isaac/Desktop/tusko_roller/.buildozer/android/platform/build" --ndk-api=21
  93. #
  94. # Buildozer failed to execute the last command
  95. # The error might be hidden in the log above this error
  96. # Please read the full log, and search for it before
  97. # raising an issue with buildozer itself.
  98. # In case of a bug report, please add a full log with log_level = 2
  99. isaac@isaac-VirtualBox:~/Desktop/tusko_roller$
RAW Paste Data
We use cookies for various purposes including analytics. By continuing to use Pastebin, you agree to our use of cookies as described in the Cookies Policy. OK, I Understand
Not a member of Pastebin yet?
Sign Up, it unlocks many cool features!
 
Top