Advertisement
Guest User

Untitled

a guest
May 23rd, 2019
69
Never
Not a member of Pastebin yet? Sign Up, it unlocks many cool features!
text 16.48 KB | None
  1.  
  2. JULIE@JULIE-PC MINGW64 ~/OpenMRS-Tickets/openmrs-core (TRUNK-5528)
  3. $ mvn clean install
  4. [INFO] Scanning for projects...
  5. [INFO] ------------------------------------------------------------------------
  6. [INFO] Reactor Build Order:
  7. [INFO]
  8. [INFO] OpenMRS [pom]
  9. [INFO] openmrs-tools [jar]
  10. [INFO] openmrs-test [pom]
  11. [INFO] openmrs-api [jar]
  12. [INFO] openmrs-web [jar]
  13. [INFO] openmrs-webapp [war]
  14. [INFO]
  15. [INFO] ------------------------< org.openmrs:openmrs >-------------------------
  16. [INFO] Building OpenMRS 2.2.0-SNAPSHOT [1/6]
  17. [INFO] --------------------------------[ pom ]---------------------------------
  18. [INFO]
  19. [INFO] --- maven-clean-plugin:2.5:clean (default-clean) @ openmrs ---
  20. [INFO] Deleting C:\Users\JULIE\OpenMRS-Tickets\openmrs-core\target
  21. [INFO]
  22. [INFO] --- buildnumber-maven-plugin:1.1:create (default) @ openmrs ---
  23. [INFO] Checking for local modifications: skipped.
  24. [INFO] Updating project files from SCM: skipped.
  25. [INFO] ShortRevision tag detected. The value is '6'.
  26. [INFO] Executing: cmd.exe /X /C "git rev-parse --verify --short=6 HEAD"
  27. [INFO] Working directory: C:\Users\JULIE\OpenMRS-Tickets\openmrs-core
  28. [INFO] Storing buildNumber: e13eed at timestamp: 1558618390347
  29. [INFO] ShortRevision tag detected. The value is '6'.
  30. [INFO] Executing: cmd.exe /X /C "git rev-parse --verify --short=6 HEAD"
  31. [INFO] Working directory: C:\Users\JULIE\OpenMRS-Tickets\openmrs-core
  32. [INFO] Storing buildScmBranch: UNKNOWN
  33. [INFO]
  34. [INFO] --- build-helper-maven-plugin:1.5:parse-version (parse-version) @ openmrs ---
  35. [INFO]
  36. [INFO] --- maven-jar-plugin:2.3.2:test-jar (default) @ openmrs ---
  37. [WARNING] JAR will be empty - no content was marked for inclusion!
  38. [INFO] Building jar: C:\Users\JULIE\OpenMRS-Tickets\openmrs-core\target\openmrs-2.2.0-SNAPSHOT-tests.jar
  39. [INFO]
  40. [INFO] --- license-maven-plugin:3.0:check (default) @ openmrs ---
  41. [INFO] Checking licenses...
  42. [INFO]
  43. [INFO] --- maven-install-plugin:2.4:install (default-install) @ openmrs ---
  44. [INFO] Installing C:\Users\JULIE\OpenMRS-Tickets\openmrs-core\pom.xml to C:\Users\JULIE\.m2\repository\org\openmrs\openmrs\2.2.0-SNAPSHOT\openmrs-2.2.0-SNAPSHOT.pom
  45. [INFO] Installing C:\Users\JULIE\OpenMRS-Tickets\openmrs-core\target\openmrs-2.2.0-SNAPSHOT-tests.jar to C:\Users\JULIE\.m2\repository\org\openmrs\openmrs\2.2.0-SNAPSHOT\openmrs-2.2.0-SNAPSHOT-tests.jar
  46. [INFO]
  47. [INFO] ------------------< org.openmrs.tools:openmrs-tools >-------------------
  48. [INFO] Building openmrs-tools 2.2.0-SNAPSHOT [2/6]
  49. [INFO] --------------------------------[ jar ]---------------------------------
  50. [INFO]
  51. [INFO] --- maven-clean-plugin:2.5:clean (default-clean) @ openmrs-tools ---
  52. [INFO] Deleting C:\Users\JULIE\OpenMRS-Tickets\openmrs-core\tools\target
  53. [INFO]
  54. [INFO] --- buildnumber-maven-plugin:1.1:create (default) @ openmrs-tools ---
  55. [INFO]
  56. [INFO] --- build-helper-maven-plugin:1.5:parse-version (parse-version) @ openmrs-tools ---
  57. [INFO]
  58. [INFO] --- maven-resources-plugin:2.4:resources (default-resources) @ openmrs-tools ---
  59. [INFO] Using 'UTF-8' encoding to copy filtered resources.
  60. [INFO] Copying 4 resources
  61. [INFO]
  62. [INFO] --- maven-compiler-plugin:2.1:compile (default-compile) @ openmrs-tools ---
  63. [INFO] Compiling 1 source file to C:\Users\JULIE\OpenMRS-Tickets\openmrs-core\tools\target\classes
  64. [INFO]
  65. [INFO] --- maven-resources-plugin:2.4:testResources (default-testResources) @ openmrs-tools ---
  66. [INFO] Using 'UTF-8' encoding to copy filtered resources.
  67. [INFO] skip non existing resourceDirectory C:\Users\JULIE\OpenMRS-Tickets\openmrs-core\tools\src\test\resources
  68. [INFO]
  69. [INFO] --- maven-compiler-plugin:2.1:testCompile (default-testCompile) @ openmrs-tools ---
  70. [INFO] No sources to compile
  71. [INFO]
  72. [INFO] --- maven-surefire-plugin:2.18.1:test (default-test) @ openmrs-tools ---
  73. [INFO] No tests to run.
  74. [INFO]
  75. [INFO] --- maven-jar-plugin:2.3.2:jar (default-jar) @ openmrs-tools ---
  76. [INFO] Building jar: C:\Users\JULIE\OpenMRS-Tickets\openmrs-core\tools\target\openmrs-tools-2.2.0-SNAPSHOT.jar
  77. [INFO]
  78. [INFO] --- maven-jar-plugin:2.3.2:test-jar (default) @ openmrs-tools ---
  79. [WARNING] JAR will be empty - no content was marked for inclusion!
  80. [INFO] Building jar: C:\Users\JULIE\OpenMRS-Tickets\openmrs-core\tools\target\openmrs-tools-2.2.0-SNAPSHOT-tests.jar
  81. [INFO]
  82. [INFO] --- license-maven-plugin:3.0:check (default) @ openmrs-tools ---
  83. [INFO] Checking licenses...
  84. [INFO]
  85. [INFO] --- maven-install-plugin:2.4:install (default-install) @ openmrs-tools ---
  86. [INFO] Installing C:\Users\JULIE\OpenMRS-Tickets\openmrs-core\tools\target\openmrs-tools-2.2.0-SNAPSHOT.jar to C:\Users\JULIE\.m2\repository\org\openmrs\tools\openmrs-tools\2.2.0-SNAPSHOT\openmrs-tools-2.2.0-SNAPSHOT.jar
  87. [INFO] Installing C:\Users\JULIE\OpenMRS-Tickets\openmrs-core\tools\pom.xml to C:\Users\JULIE\.m2\repository\org\openmrs\tools\openmrs-tools\2.2.0-SNAPSHOT\openmrs-tools-2.2.0-SNAPSHOT.pom
  88. [INFO] Installing C:\Users\JULIE\OpenMRS-Tickets\openmrs-core\tools\target\openmrs-tools-2.2.0-SNAPSHOT-tests.jar to C:\Users\JULIE\.m2\repository\org\openmrs\tools\openmrs-tools\2.2.0-SNAPSHOT\openmrs-tools-2.2.0-SNAPSHOT-tests.jar
  89. [INFO]
  90. [INFO] -------------------< org.openmrs.test:openmrs-test >--------------------
  91. [INFO] Building openmrs-test 2.2.0-SNAPSHOT [3/6]
  92. [INFO] --------------------------------[ pom ]---------------------------------
  93. [INFO]
  94. [INFO] --- maven-clean-plugin:2.5:clean (default-clean) @ openmrs-test ---
  95. [INFO] Deleting C:\Users\JULIE\OpenMRS-Tickets\openmrs-core\test\target
  96. [INFO]
  97. [INFO] --- buildnumber-maven-plugin:1.1:create (default) @ openmrs-test ---
  98. [INFO]
  99. [INFO] --- build-helper-maven-plugin:1.5:parse-version (parse-version) @ openmrs-test ---
  100. [INFO]
  101. [INFO] --- maven-jar-plugin:2.3.2:test-jar (default) @ openmrs-test ---
  102. [WARNING] JAR will be empty - no content was marked for inclusion!
  103. [INFO] Building jar: C:\Users\JULIE\OpenMRS-Tickets\openmrs-core\test\target\openmrs-test-2.2.0-SNAPSHOT-tests.jar
  104. [INFO]
  105. [INFO] --- license-maven-plugin:3.0:check (default) @ openmrs-test ---
  106. [INFO] Checking licenses...
  107. [INFO]
  108. [INFO] --- maven-install-plugin:2.4:install (default-install) @ openmrs-test ---
  109. [INFO] Installing C:\Users\JULIE\OpenMRS-Tickets\openmrs-core\test\pom.xml to C:\Users\JULIE\.m2\repository\org\openmrs\test\openmrs-test\2.2.0-SNAPSHOT\openmrs-test-2.2.0-SNAPSHOT.pom
  110. [INFO] Installing C:\Users\JULIE\OpenMRS-Tickets\openmrs-core\test\target\openmrs-test-2.2.0-SNAPSHOT-tests.jar to C:\Users\JULIE\.m2\repository\org\openmrs\test\openmrs-test\2.2.0-SNAPSHOT\openmrs-test-2.2.0-SNAPSHOT-tests.jar
  111. [INFO]
  112. [INFO] --------------------< org.openmrs.api:openmrs-api >---------------------
  113. [INFO] Building openmrs-api 2.2.0-SNAPSHOT [4/6]
  114. [INFO] --------------------------------[ jar ]---------------------------------
  115. [INFO]
  116. [INFO] --- maven-clean-plugin:2.5:clean (default-clean) @ openmrs-api ---
  117. [INFO] Deleting C:\Users\JULIE\OpenMRS-Tickets\openmrs-core\api\target
  118. [INFO]
  119. [INFO] --- buildnumber-maven-plugin:1.1:create (default) @ openmrs-api ---
  120. [INFO]
  121. [INFO] --- build-helper-maven-plugin:1.5:parse-version (parse-version) @ openmrs-api ---
  122. [INFO]
  123. [INFO] --- jacoco-maven-plugin:0.8.0:prepare-agent (prepare-agent) @ openmrs-api ---
  124. [INFO] argLine set to -javaagent:C:\\Users\\JULIE\\.m2\\repository\\org\\jacoco\\org.jacoco.agent\\0.8.0\\org.jacoco.agent-0.8.0-runtime.jar=destfile=C:\\Users\\JULIE\\OpenMRS-Tickets\\openmrs-core\\api\\target\\jacoco.exec,includes=org/openmrs/** -Duser.language=en -Duser.region=US -Xmx2g
  125. [INFO]
  126. [INFO] --- maven-java-formatter-plugin:0.3:format (default) @ openmrs-api ---
  127. [INFO] Using 'UTF-8' encoding to format source files.
  128. [INFO] Number of files to be formatted: 1021
  129. [INFO] Successfully formatted: 0 file(s)
  130. [INFO] Fail to format : 0 file(s)
  131. [INFO] Skipped : 1021 file(s)
  132. [INFO] Approximate time taken: 6s
  133. [INFO]
  134. [INFO] --- maven-resources-plugin:2.4:resources (default-resources) @ openmrs-api ---
  135. [INFO] Using 'UTF-8' encoding to copy filtered resources.
  136. [INFO] Copying 1 resource
  137. [INFO] Copying 136 resources
  138. [INFO]
  139. [INFO] --- maven-compiler-plugin:2.1:compile (default-compile) @ openmrs-api ---
  140. [INFO] Compiling 689 source files to C:\Users\JULIE\OpenMRS-Tickets\openmrs-core\api\target\classes
  141. [INFO] -------------------------------------------------------------
  142. [ERROR] COMPILATION ERROR :
  143. [INFO] -------------------------------------------------------------
  144. [ERROR] \Users\JULIE\OpenMRS-Tickets\openmrs-core\api\src\main\java\org\openmrs\api\db\hibernate\search\LuceneQuery.java:[21,32] error: cannot find symbol
  145.  
  146. [ERROR] \Users\JULIE\OpenMRS-Tickets\openmrs-core\api\src\main\java\org\openmrs\api\db\hibernate\search\LuceneQuery.java:[48,9] error: cannot find symbol
  147.  
  148. [ERROR] \Users\JULIE\OpenMRS-Tickets\openmrs-core\api\src\main\java\org\openmrs\api\db\hibernate\search\TermsFilterFactory.java:[18,31] error: cannot find symbol
  149.  
  150. [ERROR] \Users\JULIE\OpenMRS-Tickets\openmrs-core\api\src\main\java\org\openmrs\api\db\hibernate\search\TermsFilterFactory.java:[20,31] error: cannot find symbol
  151.  
  152. [ERROR] \Users\JULIE\OpenMRS-Tickets\openmrs-core\api\src\main\java\org\openmrs\api\db\hibernate\search\TermsFilterFactory.java:[51,8] error: cannot find symbol
  153.  
  154. [ERROR] \Users\JULIE\OpenMRS-Tickets\openmrs-core\api\src\main\java\org\openmrs\api\db\hibernate\search\LuceneQuery.java:[322,22] error: cannot find symbol
  155.  
  156. [ERROR] \Users\JULIE\OpenMRS-Tickets\openmrs-core\api\src\main\java\org\openmrs\api\db\hibernate\search\TermsFilterFactory.java:[52,23] error: constructor BooleanQuery in class BooleanQuery cannot be applied to given types;
  157.  
  158. [ERROR] \Users\JULIE\OpenMRS-Tickets\openmrs-core\api\src\main\java\org\openmrs\api\db\hibernate\search\TermsFilterFactory.java:[55,8] error: cannot find symbol
  159.  
  160. [ERROR] \Users\JULIE\OpenMRS-Tickets\openmrs-core\api\src\main\java\org\openmrs\api\db\hibernate\search\TermsFilterFactory.java:[60,10] error: cannot find symbol
  161.  
  162. [ERROR] \Users\JULIE\OpenMRS-Tickets\openmrs-core\api\src\main\java\org\openmrs\api\db\hibernate\search\TermsFilterFactory.java:[62,29] error: constructor BooleanQuery in class BooleanQuery cannot be applied to given types;
  163.  
  164. [ERROR] \Users\JULIE\OpenMRS-Tickets\openmrs-core\api\src\main\java\org\openmrs\api\db\hibernate\search\TermsFilterFactory.java:[64,14] error: cannot find symbol
  165.  
  166. [ERROR] \Users\JULIE\OpenMRS-Tickets\openmrs-core\api\src\main\java\org\openmrs\api\db\hibernate\search\TermsFilterFactory.java:[66,10] error: cannot find symbol
  167.  
  168. [ERROR] \Users\JULIE\OpenMRS-Tickets\openmrs-core\api\src\main\java\org\openmrs\api\db\hibernate\search\TermsFilterFactory.java:[72,8] error: cannot find symbol
  169.  
  170. [ERROR] \Users\JULIE\OpenMRS-Tickets\openmrs-core\api\src\main\java\org\openmrs\api\db\hibernate\search\TermsFilterFactory.java:[75,38] error: cannot find symbol
  171.  
  172. [INFO] 14 errors
  173. [INFO] -------------------------------------------------------------
  174. [INFO] ------------------------------------------------------------------------
  175. [INFO] Reactor Summary:
  176. [INFO]
  177. [INFO] OpenMRS 2.2.0-SNAPSHOT ............................. SUCCESS [ 3.926 s]
  178. [INFO] openmrs-tools ...................................... SUCCESS [ 1.762 s]
  179. [INFO] openmrs-test ....................................... SUCCESS [ 0.262 s]
  180. [INFO] openmrs-api ........................................ FAILURE [ 20.269 s]
  181. [INFO] openmrs-web ........................................ SKIPPED
  182. [INFO] openmrs-webapp 2.2.0-SNAPSHOT ...................... SKIPPED
  183. [INFO] ------------------------------------------------------------------------
  184. [INFO] BUILD FAILURE
  185. [INFO] ------------------------------------------------------------------------
  186. [INFO] Total time: 26.693 s
  187. [INFO] Finished at: 2019-05-23T16:33:35+03:00
  188. [INFO] ------------------------------------------------------------------------
  189. [ERROR] Failed to execute goal org.apache.maven.plugins:maven-compiler-plugin:2.1:compile (default-compile) on project openmrs-api: Compilation failure: Compilation failure:
  190. [ERROR] \Users\JULIE\OpenMRS-Tickets\openmrs-core\api\src\main\java\org\openmrs\api\db\hibernate\search\LuceneQuery.java:[21,32] error: cannot find symbol
  191. [ERROR]
  192. [ERROR] \Users\JULIE\OpenMRS-Tickets\openmrs-core\api\src\main\java\org\openmrs\api\db\hibernate\search\LuceneQuery.java:[48,9] error: cannot find symbol
  193. [ERROR]
  194. [ERROR] \Users\JULIE\OpenMRS-Tickets\openmrs-core\api\src\main\java\org\openmrs\api\db\hibernate\search\TermsFilterFactory.java:[18,31] error: cannot find symbol
  195. [ERROR]
  196. [ERROR] \Users\JULIE\OpenMRS-Tickets\openmrs-core\api\src\main\java\org\openmrs\api\db\hibernate\search\TermsFilterFactory.java:[20,31] error: cannot find symbol
  197. [ERROR]
  198. [ERROR] \Users\JULIE\OpenMRS-Tickets\openmrs-core\api\src\main\java\org\openmrs\api\db\hibernate\search\TermsFilterFactory.java:[51,8] error: cannot find symbol
  199. [ERROR]
  200. [ERROR] \Users\JULIE\OpenMRS-Tickets\openmrs-core\api\src\main\java\org\openmrs\api\db\hibernate\search\LuceneQuery.java:[322,22] error: cannot find symbol
  201. [ERROR]
  202. [ERROR] \Users\JULIE\OpenMRS-Tickets\openmrs-core\api\src\main\java\org\openmrs\api\db\hibernate\search\TermsFilterFactory.java:[52,23] error: constructor BooleanQuery in class BooleanQuery cannot be applied to given types;
  203. [ERROR]
  204. [ERROR] \Users\JULIE\OpenMRS-Tickets\openmrs-core\api\src\main\java\org\openmrs\api\db\hibernate\search\TermsFilterFactory.java:[55,8] error: cannot find symbol
  205. [ERROR]
  206. [ERROR] \Users\JULIE\OpenMRS-Tickets\openmrs-core\api\src\main\java\org\openmrs\api\db\hibernate\search\TermsFilterFactory.java:[60,10] error: cannot find symbol
  207. [ERROR]
  208. [ERROR] \Users\JULIE\OpenMRS-Tickets\openmrs-core\api\src\main\java\org\openmrs\api\db\hibernate\search\TermsFilterFactory.java:[62,29] error: constructor BooleanQuery in class BooleanQuery cannot be applied to given types;
  209. [ERROR]
  210. [ERROR] \Users\JULIE\OpenMRS-Tickets\openmrs-core\api\src\main\java\org\openmrs\api\db\hibernate\search\TermsFilterFactory.java:[64,14] error: cannot find symbol
  211. [ERROR]
  212. [ERROR] \Users\JULIE\OpenMRS-Tickets\openmrs-core\api\src\main\java\org\openmrs\api\db\hibernate\search\TermsFilterFactory.java:[66,10] error: cannot find symbol
  213. [ERROR]
  214. [ERROR] \Users\JULIE\OpenMRS-Tickets\openmrs-core\api\src\main\java\org\openmrs\api\db\hibernate\search\TermsFilterFactory.java:[72,8] error: cannot find symbol
  215. [ERROR]
  216. [ERROR] \Users\JULIE\OpenMRS-Tickets\openmrs-core\api\src\main\java\org\openmrs\api\db\hibernate\search\TermsFilterFactory.java:[75,38] error: cannot find symbol
  217. [ERROR] -> [Help 1]
  218. [ERROR]
  219. [ERROR] To see the full stack trace of the errors, re-run Maven with the -e switch.
  220. [ERROR] Re-run Maven using the -X switch to enable full debug logging.
  221. [ERROR]
  222. [ERROR] For more information about the errors and possible solutions, please read the following articles:
  223. [ERROR] [Help 1] http://cwiki.apache.org/confluence/display/MAVEN/MojoFailureException
  224. [ERROR]
  225. [ERROR] After correcting the problems, you can resume the build with the command
  226. [ERROR] mvn <goals> -rf :openmrs-api
  227.  
  228. JULIE@JULIE-PC MINGW64 ~/OpenMRS-Tickets/openmrs-core (TRUNK-5528)
  229. $ git commit -m"TRUNK-5528:Upgrade org.apache.lucene sub Libraries"
  230. [TRUNK-5528 17adfea0c] TRUNK-5528:Upgrade org.apache.lucene sub Libraries
  231. 1 file changed, 2 insertions(+), 2 deletions(-)
  232.  
  233. JULIE@JULIE-PC MINGW64 ~/OpenMRS-Tickets/openmrs-core (TRUNK-5528)
  234. $ git push
  235. fatal: The current branch TRUNK-5528 has no upstream branch.
  236. To push the current branch and set the remote as upstream, use
  237.  
  238. git push --set-upstream origin TRUNK-5528
  239.  
  240.  
  241. JULIE@JULIE-PC MINGW64 ~/OpenMRS-Tickets/openmrs-core (TRUNK-5528)
  242. $ git push --set-upstream origin TRUNK-5528
  243. Enter passphrase for key '/c/Users/JULIE/.ssh/id_rsa':
  244. Counting objects: 3, done.
  245. Delta compression using up to 4 threads.
  246. Compressing objects: 100% (3/3), done.
  247. Writing objects: 100% (3/3), 348 bytes | 348.00 KiB/s, done.
  248. Total 3 (delta 2), reused 0 (delta 0)
  249. remote: Resolving deltas: 100% (2/2), completed with 2 local objects.
  250. remote:
  251. remote: Create a pull request for 'TRUNK-5528' on GitHub by visiting:
  252. remote: https://github.com/jwnasambu/openmrs-core/pull/new/TRUNK-5528
  253. remote:
  254. To github.com:jwnasambu/openmrs-core.git
  255. * [new branch] TRUNK-5528 -> TRUNK-5528
  256. Branch 'TRUNK-5528' set up to track remote branch 'TRUNK-5528' from 'origin'.
  257.  
  258. JULIE@JULIE-PC MINGW64 ~/OpenMRS-Tickets/openmrs-core (TRUNK-5528)
Advertisement
RAW Paste Data Copied
Advertisement