SHARE
TWEET

gcc43 build failure

a guest Jul 20th, 2016 102 Never
Not a member of Pastebin yet? Sign Up, it unlocks many cool features!
  1. ../../gcc/toplev.c: Auf höchster Ebene:
  2. ../../gcc/toplev.c:545:1: Fehler: Redefinition von »floor_log2«
  3.  floor_log2 (unsigned HOST_WIDE_INT x)
  4.  ^~~~~~~~~~
  5. In file included from ../../gcc/toplev.c:58:0:
  6. ../../gcc/toplev.h:177:1: Anmerkung: Vorherige Definition von »floor_log2« war hier
  7.  floor_log2 (unsigned HOST_WIDE_INT x)
  8.  ^~~~~~~~~~
  9. ../../gcc/toplev.c:580:1: Fehler: Redefinition von »exact_log2«
  10.  exact_log2 (unsigned HOST_WIDE_INT x)
  11.  ^~~~~~~~~~
  12. In file included from ../../gcc/toplev.c:58:0:
  13. ../../gcc/toplev.h:183:1: Anmerkung: Vorherige Definition von »exact_log2« war hier
  14.  exact_log2 (unsigned HOST_WIDE_INT x)
  15.  ^~~~~~~~~~
  16. In file included from ../../gcc/toplev.c:30:0:
  17. ../../gcc/toplev.c: In Funktion »push_srcloc«:
  18. ../../gcc/system.h:577:55: Warnung: ISO C does not support »__FUNCTION__« predefined identifier [-Wpedantic]
  19.     ((void)(!(EXPR) ? fancy_abort (__FILE__, __LINE__, __FUNCTION__), 0 : 0))
  20.                                                        ^
  21. ../../gcc/toplev.c:973:3: Anmerkung: bei Substitution des Makros »gcc_assert«
  22.    gcc_assert (!input_file_stack_restored);
  23.    ^~~~~~~~~~
  24. In file included from ../../gcc/tree.h:29:0,
  25.                  from ../../gcc/toplev.c:45:
  26. ../../gcc/vec.h:435:43: Warnung: ISO C does not support »__FUNCTION__« predefined identifier [-Wpedantic]
  27.  #define VEC_CHECK_INFO ,__FILE__,__LINE__,__FUNCTION__
  28.                                            ^
  29. ../../gcc/vec.h:282:32: Anmerkung: bei Substitution des Makros »VEC_CHECK_INFO«
  30.   (VEC_OP(T,A,safe_push)(&(V),O VEC_CHECK_INFO MEM_STAT_INFO))
  31.                                 ^~~~~~~~~~~~~~
  32. ../../gcc/toplev.c:988:3: Anmerkung: bei Substitution des Makros »VEC_safe_push«
  33.    VEC_safe_push (fs_p, heap, input_file_stack_history, input_file_stack);
  34.    ^~~~~~~~~~~~~
  35. In file included from ../../gcc/toplev.c:30:0:
  36. ../../gcc/toplev.c: In Funktion »pop_srcloc«:
  37. ../../gcc/system.h:577:55: Warnung: ISO C does not support »__FUNCTION__« predefined identifier [-Wpedantic]
  38.     ((void)(!(EXPR) ? fancy_abort (__FILE__, __LINE__, __FUNCTION__), 0 : 0))
  39.                                                        ^
  40. ../../gcc/toplev.c:1000:3: Anmerkung: bei Substitution des Makros »gcc_assert«
  41.    gcc_assert (!input_file_stack_restored);
  42.    ^~~~~~~~~~
  43. In file included from ../../gcc/tree.h:29:0,
  44.                  from ../../gcc/toplev.c:45:
  45. ../../gcc/vec.h:435:43: Warnung: ISO C does not support »__FUNCTION__« predefined identifier [-Wpedantic]
  46.  #define VEC_CHECK_INFO ,__FILE__,__LINE__,__FUNCTION__
  47.                                            ^
  48. ../../gcc/vec.h:282:32: Anmerkung: bei Substitution des Makros »VEC_CHECK_INFO«
  49.   (VEC_OP(T,A,safe_push)(&(V),O VEC_CHECK_INFO MEM_STAT_INFO))
  50.                                 ^~~~~~~~~~~~~~
  51. ../../gcc/toplev.c:1008:3: Anmerkung: bei Substitution des Makros »VEC_safe_push«
  52.    VEC_safe_push (fs_p, heap, input_file_stack_history, input_file_stack);
  53.    ^~~~~~~~~~~~~
  54. ../../gcc/toplev.c: In Funktion »restore_input_file_stack«:
  55. ../../gcc/vec.h:435:43: Warnung: ISO C does not support »__FUNCTION__« predefined identifier [-Wpedantic]
  56.  #define VEC_CHECK_INFO ,__FILE__,__LINE__,__FUNCTION__
  57.                                            ^
  58. ../../gcc/vec.h:174:62: Anmerkung: bei Substitution des Makros »VEC_CHECK_INFO«
  59.  #define VEC_index(T,V,I) (VEC_OP(T,base,index)(VEC_BASE(V),I VEC_CHECK_INFO))
  60.                                                               ^~~~~~~~~~~~~~
  61. ../../gcc/toplev.c:1021:24: Anmerkung: bei Substitution des Makros »VEC_index«
  62.      input_file_stack = VEC_index (fs_p, input_file_stack_history, tick - 1);
  63.                         ^~~~~~~~~
  64. make[3]: *** [Makefile:2376: toplev.o] Fehler 1
  65. make[3]: Verzeichnis „/tmp/yaourt-tmp-photon/aur-gcc43/src/gcc-4.3.6/build/gcc“ wird verlassen
  66. make[2]: *** [Makefile:5038: all-stage1-gcc] Fehler 2
  67. make[2]: Verzeichnis „/tmp/yaourt-tmp-photon/aur-gcc43/src/gcc-4.3.6/build“ wird verlassen
  68. make[1]: *** [Makefile:15697: stage1-bubble] Fehler 2
  69. make[1]: Verzeichnis „/tmp/yaourt-tmp-photon/aur-gcc43/src/gcc-4.3.6/build“ wird verlassen
  70. make: *** [Makefile:704: all] Fehler 2
RAW Paste Data
We use cookies for various purposes including analytics. By continuing to use Pastebin, you agree to our use of cookies as described in the Cookies Policy. OK, I Understand
 
Top