Advertisement
Guest User

Untitled

a guest
Feb 8th, 2022
22
Never
Not a member of Pastebin yet? Sign Up, it unlocks many cool features!
text 94.32 KB | None
  1. Build log
  2. The build generated 871 lines of output. Download or view full build log
  3.  
  4. 11-Dec-2021 11:17:49 Build SDK - SDK - Default Job #447 (SDK-SDK-JOB1-447) started building on agent yue.openmrs.org
  5. 11-Dec-2021 11:17:49 Remote agent on host yue.openmrs.org
  6. 11-Dec-2021 11:17:49 Build working directory is /home/bamboo-agent/bamboo-agent/xml-data/build-dir/SDK-SDK-JOB1
  7. 11-Dec-2021 11:17:49 Executing build SDK - SDK - Default Job #447 (SDK-SDK-JOB1-447)
  8. 11-Dec-2021 11:17:49 Starting task 'Checkout Default Repository' of type 'com.atlassian.bamboo.plugins.vcs:task.vcs.checkout'
  9. 11-Dec-2021 11:17:49 Checking out into /home/bamboo-agent/bamboo-agent/xml-data/build-dir/SDK-SDK-JOB1
  10. 11-Dec-2021 11:17:49 Updating source code to revision: e00396971b71d1eab375bb42a40ab904bd8970a5
  11. 11-Dec-2021 11:17:49 Enforcing full fetch as requested revision has not been found on the configured branch
  12. 11-Dec-2021 11:17:49 Creating local git repository in '/home/bamboo-agent/bamboo-agent/xml-data/build-dir/SDK-SDK-JOB1/.git'.
  13. 11-Dec-2021 11:17:49 Initialized empty Git repository in /home/bamboo-agent/bamboo-agent/xml-data/build-dir/SDK-SDK-JOB1/.git/
  14. 11-Dec-2021 11:17:49 Fetching 'refs/heads/*' from 'https://github.com/openmrs/openmrs-sdk.git'. Will try to do a shallow fetch.
  15. 11-Dec-2021 11:17:52 From https://github.com/openmrs/openmrs-sdk
  16. 11-Dec-2021 11:17:52 * [new branch] 1.x -> 1.x
  17. 11-Dec-2021 11:17:52 * [new branch] 3.0.x -> 3.0.x
  18. 11-Dec-2021 11:17:52 * [new branch] SDK-253 -> SDK-253
  19. 11-Dec-2021 11:17:52 * [new branch] ib_refactor -> ib_refactor
  20. 11-Dec-2021 11:17:52 * [new branch] master -> master
  21. 11-Dec-2021 11:17:52 * [new branch] mfe-setup-interactive -> mfe-setup-interactive
  22. 11-Dec-2021 11:17:52 * [new tag] 2.0.3 -> 2.0.3
  23. 11-Dec-2021 11:17:52 * [new tag] 2.1.2 -> 2.1.2
  24. 11-Dec-2021 11:17:52 * [new tag] 3.0.0 -> 3.0.0
  25. 11-Dec-2021 11:17:52 * [new tag] 3.1.0 -> 3.1.0
  26. 11-Dec-2021 11:17:52 * [new tag] 3.1.0-alpha -> 3.1.0-alpha
  27. 11-Dec-2021 11:17:52 * [new tag] 3.1.1 -> 3.1.1
  28. 11-Dec-2021 11:17:52 * [new tag] 3.1.2 -> 3.1.2
  29. 11-Dec-2021 11:17:52 * [new tag] 3.1.3 -> 3.1.3
  30. 11-Dec-2021 11:17:52 * [new tag] 3.1.3_3.1.4-SNAPSHOT -> 3.1.3_3.1.4-SNAPSHOT
  31. 11-Dec-2021 11:17:52 * [new tag] 3.10.0 -> 3.10.0
  32. 11-Dec-2021 11:17:52 * [new tag] 3.10.0_3.10.1-SNAPSHOT -> 3.10.0_3.10.1-SNAPSHOT
  33. 11-Dec-2021 11:17:52 * [new tag] 3.10.1 -> 3.10.1
  34. 11-Dec-2021 11:17:52 * [new tag] 3.10.1_3.10.2-SNAPSHOT -> 3.10.1_3.10.2-SNAPSHOT
  35. 11-Dec-2021 11:17:52 * [new tag] 3.11.0 -> 3.11.0
  36. 11-Dec-2021 11:17:52 * [new tag] 3.11.0_3.11.1-SNAPSHOT -> 3.11.0_3.11.1-SNAPSHOT
  37. 11-Dec-2021 11:17:52 * [new tag] 3.12.0 -> 3.12.0
  38. 11-Dec-2021 11:17:52 * [new tag] 3.12.1 -> 3.12.1
  39. 11-Dec-2021 11:17:52 * [new tag] 3.12.2 -> 3.12.2
  40. 11-Dec-2021 11:17:52 * [new tag] 3.12.3 -> 3.12.3
  41. 11-Dec-2021 11:17:52 * [new tag] 3.12.3_3.12.4-SNAPSHOT -> 3.12.3_3.12.4-SNAPSHOT
  42. 11-Dec-2021 11:17:52 * [new tag] 3.12.4 -> 3.12.4
  43. 11-Dec-2021 11:17:52 * [new tag] 3.12.4_3.12.5-SNAPSHOT -> 3.12.4_3.12.5-SNAPSHOT
  44. 11-Dec-2021 11:17:52 * [new tag] 3.13.0 -> 3.13.0
  45. 11-Dec-2021 11:17:52 * [new tag] 3.13.0_3.13.1-SNAPSHOT -> 3.13.0_3.13.1-SNAPSHOT
  46. 11-Dec-2021 11:17:52 * [new tag] 3.13.1 -> 3.13.1
  47. 11-Dec-2021 11:17:52 * [new tag] 3.13.2 -> 3.13.2
  48. 11-Dec-2021 11:17:52 * [new tag] 3.13.3 -> 3.13.3
  49. 11-Dec-2021 11:17:52 * [new tag] 3.13.3_3.13.4-SNAPSHOT -> 3.13.3_3.13.4-SNAPSHOT
  50. 11-Dec-2021 11:17:52 * [new tag] 3.13.4 -> 3.13.4
  51. 11-Dec-2021 11:17:52 * [new tag] 3.13.4_3.13.5-SNAPSHOT -> 3.13.4_3.13.5-SNAPSHOT
  52. 11-Dec-2021 11:17:52 * [new tag] 3.13.5 -> 3.13.5
  53. 11-Dec-2021 11:17:52 * [new tag] 3.13.5_3.13.6-SNAPSHOT -> 3.13.5_3.13.6-SNAPSHOT
  54. 11-Dec-2021 11:17:52 * [new tag] 3.13.6 -> 3.13.6
  55. 11-Dec-2021 11:17:52 * [new tag] 3.13.6_3.13.7-SNAPSHOT -> 3.13.6_3.13.7-SNAPSHOT
  56. 11-Dec-2021 11:17:52 * [new tag] 3.13.7 -> 3.13.7
  57. 11-Dec-2021 11:17:52 * [new tag] 3.13.7_3.13.8-SNAPSHOT -> 3.13.7_3.13.8-SNAPSHOT
  58. 11-Dec-2021 11:17:52 * [new tag] 3.2.0 -> 3.2.0
  59. 11-Dec-2021 11:17:52 * [new tag] 3.2.0_3.2.1-SNAPSHOT -> 3.2.0_3.2.1-SNAPSHOT
  60. 11-Dec-2021 11:17:52 * [new tag] 3.2.1 -> 3.2.1
  61. 11-Dec-2021 11:17:52 * [new tag] 3.2.1_3.2.2-SNAPSHOT -> 3.2.1_3.2.2-SNAPSHOT
  62. 11-Dec-2021 11:17:52 * [new tag] 3.3.0 -> 3.3.0
  63. 11-Dec-2021 11:17:52 * [new tag] 3.3.0_3.3.1-SNAPSHOT -> 3.3.0_3.3.1-SNAPSHOT
  64. 11-Dec-2021 11:17:52 * [new tag] 3.3.1 -> 3.3.1
  65. 11-Dec-2021 11:17:52 * [new tag] 3.3.1_3.3.2-SNAPSHOT -> 3.3.1_3.3.2-SNAPSHOT
  66. 11-Dec-2021 11:17:52 * [new tag] 3.3.2 -> 3.3.2
  67. 11-Dec-2021 11:17:52 * [new tag] 3.3.2_3.3.3-SNAPSHOT -> 3.3.2_3.3.3-SNAPSHOT
  68. 11-Dec-2021 11:17:52 * [new tag] 3.4.0 -> 3.4.0
  69. 11-Dec-2021 11:17:52 * [new tag] 3.4.0_3.4.1-SNAPSHOT -> 3.4.0_3.4.1-SNAPSHOT
  70. 11-Dec-2021 11:17:52 * [new tag] 3.4.1 -> 3.4.1
  71. 11-Dec-2021 11:17:52 * [new tag] 3.4.1_3.4.2-SNAPSHOT -> 3.4.1_3.4.2-SNAPSHOT
  72. 11-Dec-2021 11:17:52 * [new tag] 3.4.2 -> 3.4.2
  73. 11-Dec-2021 11:17:52 * [new tag] 3.4.2_3.4.3-SNAPSHOT -> 3.4.2_3.4.3-SNAPSHOT
  74. 11-Dec-2021 11:17:52 * [new tag] 3.4.3 -> 3.4.3
  75. 11-Dec-2021 11:17:52 * [new tag] 3.4.3_3.4.4-SNAPSHOT -> 3.4.3_3.4.4-SNAPSHOT
  76. 11-Dec-2021 11:17:52 * [new tag] 3.4.4 -> 3.4.4
  77. 11-Dec-2021 11:17:52 * [new tag] 3.4.4_3.4.5-SNAPSHOT -> 3.4.4_3.4.5-SNAPSHOT
  78. 11-Dec-2021 11:17:52 * [new tag] 3.4.5 -> 3.4.5
  79. 11-Dec-2021 11:17:52 * [new tag] 3.4.5_3.4.6-SNAPSHOT -> 3.4.5_3.4.6-SNAPSHOT
  80. 11-Dec-2021 11:17:52 * [new tag] 3.4.6 -> 3.4.6
  81. 11-Dec-2021 11:17:52 * [new tag] 3.4.6_3.4.7-SNAPSHOT -> 3.4.6_3.4.7-SNAPSHOT
  82. 11-Dec-2021 11:17:52 * [new tag] 3.4.7 -> 3.4.7
  83. 11-Dec-2021 11:17:52 * [new tag] 3.4.7_3.4.8-SNAPSHOT -> 3.4.7_3.4.8-SNAPSHOT
  84. 11-Dec-2021 11:17:52 * [new tag] 3.5.0 -> 3.5.0
  85. 11-Dec-2021 11:17:52 * [new tag] 3.5.0_3.5.1-SNAPSHOT -> 3.5.0_3.5.1-SNAPSHOT
  86. 11-Dec-2021 11:17:52 * [new tag] 3.6.0 -> 3.6.0
  87. 11-Dec-2021 11:17:52 * [new tag] 3.6.0_3.6.1-SNAPSHOT -> 3.6.0_3.6.1-SNAPSHOT
  88. 11-Dec-2021 11:17:52 * [new tag] 3.6.1 -> 3.6.1
  89. 11-Dec-2021 11:17:52 * [new tag] 3.6.1_3.6.2-SNAPSHOT -> 3.6.1_3.6.2-SNAPSHOT
  90. 11-Dec-2021 11:17:52 * [new tag] 3.7.0 -> 3.7.0
  91. 11-Dec-2021 11:17:52 * [new tag] 3.7.0_3.7.1-SNAPSHOT -> 3.7.0_3.7.1-SNAPSHOT
  92. 11-Dec-2021 11:17:52 * [new tag] 3.8.0 -> 3.8.0
  93. 11-Dec-2021 11:17:52 * [new tag] 3.8.0_3.8.1-SNAPSHOT -> 3.8.0_3.8.1-SNAPSHOT
  94. 11-Dec-2021 11:17:52 * [new tag] 3.8.1 -> 3.8.1
  95. 11-Dec-2021 11:17:52 * [new tag] 3.8.1_3.8.2-SNAPSHOT -> 3.8.1_3.8.2-SNAPSHOT
  96. 11-Dec-2021 11:17:52 * [new tag] 3.8.2 -> 3.8.2
  97. 11-Dec-2021 11:17:52 * [new tag] 3.8.2_3.8.3-SNAPSHOT -> 3.8.2_3.8.3-SNAPSHOT
  98. 11-Dec-2021 11:17:52 * [new tag] 3.9.0 -> 3.9.0
  99. 11-Dec-2021 11:17:52 * [new tag] 3.9.0_3.9.1-SNAPSHOT -> 3.9.0_3.9.1-SNAPSHOT
  100. 11-Dec-2021 11:17:52 * [new tag] 4.3.0 -> 4.3.0
  101. 11-Dec-2021 11:17:52 * [new tag] openmrs-sdk-3.13.8 -> openmrs-sdk-3.13.8
  102. 11-Dec-2021 11:17:52 * [new tag] openmrs-sdk-3.13.9 -> openmrs-sdk-3.13.9
  103. 11-Dec-2021 11:17:52 * [new tag] openmrs-sdk-4.0.0 -> openmrs-sdk-4.0.0
  104. 11-Dec-2021 11:17:52 * [new tag] openmrs-sdk-4.0.1 -> openmrs-sdk-4.0.1
  105. 11-Dec-2021 11:17:52 * [new tag] openmrs-sdk-4.1.0 -> openmrs-sdk-4.1.0
  106. 11-Dec-2021 11:17:52 * [new tag] openmrs-sdk-4.1.1 -> openmrs-sdk-4.1.1
  107. 11-Dec-2021 11:17:52 * [new tag] openmrs-sdk-4.2.0 -> openmrs-sdk-4.2.0
  108. 11-Dec-2021 11:17:52 Checking out revision e00396971b71d1eab375bb42a40ab904bd8970a5.
  109. 11-Dec-2021 11:17:52 Already on 'master'
  110. 11-Dec-2021 11:17:52 Updated source code to revision: e00396971b71d1eab375bb42a40ab904bd8970a5
  111. 11-Dec-2021 11:17:52 Finished task 'Checkout Default Repository' with result: Success
  112. 11-Dec-2021 11:17:52 Running pre-build action: VCS Version Collector
  113. 11-Dec-2021 11:17:52 Running pre-build action: Sauce OnDemand Build Configurator
  114. 11-Dec-2021 11:17:52 Running pre-build action: Run Predator
  115. 11-Dec-2021 11:17:52 [PredatorPreBuildAction] Starting predator plugin, pre build agent cleaner
  116. 11-Dec-2021 11:17:52 [PredatorPreBuildAction] Running these commands: docker ps -q| xargs docker kill; docker ps -qa | xargs docker rm -f; docker system prune -af --filter until=48h; docker volume prune -f;
  117. 11-Dec-2021 11:17:52 [PredatorPreBuildAction] Running command 'docker ps -q| xargs docker kill'
  118. 11-Dec-2021 11:17:54 [PredatorPreBuildAction] Command 'docker ps -q| xargs docker kill' completed with exit code 125
  119. 11-Dec-2021 11:17:54 [PredatorPreBuildAction] Running command 'docker ps -qa | xargs docker rm -f'
  120. 11-Dec-2021 11:17:54 [PredatorPreBuildAction] Command 'docker ps -qa | xargs docker rm -f' completed with exit code 125
  121. 11-Dec-2021 11:17:54 [PredatorPreBuildAction] Running command 'docker system prune -af --filter until=48h'
  122. 11-Dec-2021 11:17:56 [PredatorPreBuildAction] Command 'docker system prune -af --filter until=48h' completed with exit code 0
  123. 11-Dec-2021 11:17:56 [PredatorPreBuildAction] Running command 'docker volume prune -f'
  124. 11-Dec-2021 11:17:56 [PredatorPreBuildAction] Command 'docker volume prune -f' completed with exit code 0
  125. 11-Dec-2021 11:17:56 [PredatorPreBuildAction] Identifying Bamboo agent process (or parent): 24119 java 2110 bamboo-age 3013Mb 492Mb 00:12:11 /usr/lib/jvm/java-8-ope
  126. 11-Dec-2021 11:17:56 [PredatorPreBuildAction] Identifying Bamboo agent process (or parent): 2110 wrapper 1 bamboo-age 22Mb 2Mb 02:10:47 /home/bamboo-agent/bamb
  127. 11-Dec-2021 11:17:56 [PredatorPreBuildAction] Identifying Bamboo agent process (or parent): 1 systemd 0 root 117Mb 3Mb 00:08:15 /lib/systemd/systemd --
  128. 11-Dec-2021 11:17:56 [PredatorPreBuildAction] No processes found for (chromium|chrome|webdriver|mysql|java |mvn )
  129. 11-Dec-2021 11:17:56 [PredatorPreBuildAction] Initial free space: 2.3520126 GB
  130. 11-Dec-2021 11:17:56 [PredatorPreBuildAction] Deleting folder /home/bamboo-agent/bamboo-agent/xml-data/build-dir/OCL-OCLAPI2-BO
  131. 11-Dec-2021 11:17:56 [PredatorPreBuildAction] Deleting folder /home/bamboo-agent/bamboo-agent/xml-data/build-dir/TRUNK-CORE-REL
  132. 11-Dec-2021 11:17:57 [PredatorPreBuildAction] Deleting folder /home/bamboo-agent/bamboo-agent/xml-data/build-dir/OCL-OCLAPI20-BO
  133. 11-Dec-2021 11:18:37 [PredatorPreBuildAction] Deleting 7 snapshot folders from /home/bamboo-agent/.m2/repository
  134. 11-Dec-2021 11:18:37 [PredatorPreBuildAction] Maven snapshot disk freed: 0 GB
  135. 11-Dec-2021 11:18:37 [PredatorPreBuildAction] 0 empty artifacts were found and deleted by Predator
  136. 11-Dec-2021 11:18:38 [PredatorPreBuildAction] Maven stable disk freed: 0.0 GB, deleted 0 files
  137. 11-Dec-2021 11:18:38 [PredatorPreBuildAction] File /home/bamboo-agent/.npmrc does not exist.
  138. 11-Dec-2021 11:18:38 [PredatorPreBuildAction] File /home/bamboo-agent/.docker/config.json does not exist.
  139. 11-Dec-2021 11:18:38 [PredatorPreBuildAction] File /home/bamboo-agent/.OpenMRS/liquibaseUpdateLogs.txt does not exist.
  140. 11-Dec-2021 11:18:38 [PredatorPreBuildAction] Final free space: 3.21072 GB
  141. 11-Dec-2021 11:18:38 [PredatorPreBuildAction] Done
  142. 11-Dec-2021 11:18:38
  143. Substituting variable: ${bamboo.capability.system.builder.mvn3.Maven 3} with /usr/share/apache-maven-3.3.9
  144. 11-Dec-2021 11:18:38
  145. Substituting variable: ${bamboo.capability.system.builder.mvn3.Maven 3} with /usr/share/apache-maven-3.3.9
  146. 11-Dec-2021 11:18:38
  147. Substituting variable: ${bamboo.capability.system.jdk.openjdk-8-jdk} with /usr/lib/jvm/java-8-openjdk-amd64
  148. 11-Dec-2021 11:18:38 Starting task 'Build' of type 'com.atlassian.bamboo.plugins.maven:task.builder.mvn3'
  149. 11-Dec-2021 11:18:38
  150. Beginning to execute external process for build 'SDK - SDK - Default Job #447 (SDK-SDK-JOB1-447)'
  151. ... running command line:
  152. /usr/share/apache-maven-3.3.9/bin/mvn --batch-mode -Djava.io.tmpdir=/home/bamboo-agent/bamboo-agent/.agent_tmp/SDK-SDK-JOB1 clean install
  153. ... in: /home/bamboo-agent/bamboo-agent/xml-data/build-dir/SDK-SDK-JOB1
  154. ... using extra environment variables:
  155. bamboo_planRepository_1_branch=master
  156. bamboo_capability_system_builder_grailsBuilder_Grails_2_3_7=/opt/grails
  157. bamboo_planRepository_2_branch=master
  158. bamboo_planRepository_1_branchDisplayName=master
  159. bamboo_repository_revision_number=c4475a9228b197817dce78683d9da8a1e2c4e3a5
  160. MAVEN2_HOME=/usr/share/apache-maven-3.3.9
  161. bamboo_repository_135168001_revision_number=c4475a9228b197817dce78683d9da8a1e2c4e3a5
  162. bamboo_buildKey=SDK-SDK-JOB1
  163. bamboo_repository_89161779_name=SDK
  164. bamboo_maven_release_version=4.4.0
  165. bamboo_planRepository_2_branchDisplayName=master
  166. bamboo_shortJobName=Default Job
  167. bamboo_buildResultsUrl=https://ci.openmrs.org/browse/SDK-SDK-JOB1-447
  168. bamboo_planRepository_repositoryUrl=https://github.com/openmrs/openmrs-sdk.git
  169. bamboo_agentId=189792258
  170. bamboo_maven_development_version=
  171. bamboo_capability_system_jdk_JDK_8=/usr/lib/jvm/java-8-openjdk-amd64
  172. bamboo_planRepository_revision=e00396971b71d1eab375bb42a40ab904bd8970a5
  173. bamboo_planRepository_previousRevision=f1d9a9024c5771d66292bfa55f180c90adfc6701
  174. bamboo_capability_system_jdk_JDK_1_8_0_265=/usr/lib/jvm/java-1.8.0-openjdk-amd64/
  175. bamboo_repository_135168001_branch_name=master
  176. bamboo_repository_branch_name=master
  177. bamboo_repository_135168001_git_username=
  178. bamboo_dockerhub_username=openmrsci
  179. bamboo_repository_135168001_previous_revision_number=c4475a9228b197817dce78683d9da8a1e2c4e3a5
  180. bamboo_repository_89161779_git_branch=master
  181. bamboo_refapp_distro_scm=git@github.com:openmrs/openmrs-distro-referenceapplication.git
  182. JAVA_HOME=/usr/lib/jvm/java-8-openjdk-amd64
  183. bamboo_planRepository_branch=master
  184. bamboo_repository_135168001_git_repositoryUrl=https://github.com/openmrs/openmrs-contrib-bamboo.git
  185. bamboo_capability_system_jdk_JDK_1_8_0_275=/usr/lib/jvm/java-1.8.0-openjdk-amd64/
  186. bamboo_capability_system_jdk_JDK_1_8_0_272=/usr/lib/jvm/java-1.8.0-openjdk-amd64/
  187. bamboo_capability_system_jdk_JDK_11=/usr/lib/jvm/java-11-openjdk-amd64
  188. bamboo_planRepository_1_type=gh2
  189. bamboo_planRepository_branchName=master
  190. bamboo_capability_system_jdk_JDK=/usr/lib/jvm/java-1.8.0-openjdk-amd64/
  191. bamboo_mavenBuildGoals=clean install
  192. bamboo_hg_cache_directory=/home/bamboo-agent/bamboo-agent/xml-data/build-dir/_hg-repositories-cache
  193. bamboo_planRepository_1_username=rkorytkowski
  194. bamboo_planRepository_type=gh2
  195. bamboo_git_cache_directory=/home/bamboo-agent/bamboo-agent/xml-data/build-dir/_git-repositories-cache
  196. bamboo_planRepository_2_branchName=master
  197. useMavenReturnCode=false
  198. bamboo_capability_system_builder_node_Node_js=/usr/bin/node
  199. bamboo_repository_89161779_revision_number=e00396971b71d1eab375bb42a40ab904bd8970a5
  200. bamboo_repository_89161779_git_username=rkorytkowski
  201. bamboo_capability_system_builder_mvn3_Maven_3=/usr/share/apache-maven-3.3.9
  202. bamboo_tmp_directory=/home/bamboo-agent/bamboo-agent/temp
  203. bamboo_planKey=SDK-SDK
  204. bamboo_capability_system_builder_command_nvm=nvm
  205. bamboo_planRepository_username=rkorytkowski
  206. bamboo_repository_89161779_previous_revision_number=f1d9a9024c5771d66292bfa55f180c90adfc6701
  207. bamboo_capability_system_jdk_JDK_1_8_0_282=/usr/lib/jvm/java-1.8.0-openjdk-amd64/
  208. bamboo_planRepository_1_branchName=master
  209. bamboo_dockerhub_password=********
  210. bamboo_resultsUrl=https://ci.openmrs.org/browse/SDK-SDK-JOB1-447
  211. bamboo_capability_system_builder_command_transifex=/usr/bin/tx
  212. bamboo_build_working_directory=/home/bamboo-agent/bamboo-agent/xml-data/build-dir/SDK-SDK-JOB1
  213. bamboo_planRepository_1_name=SDK
  214. bamboo_capability_system_jdk_JDK_1_8_0_292=/usr/lib/jvm/java-1.8.0-openjdk-amd64/
  215. bamboo_preparing_refapp_distro_release=false
  216. bamboo_shortPlanName=SDK
  217. MAVEN_HOME=/usr/share/apache-maven-3.3.9
  218. bamboo_planRepository_2_username=
  219. bamboo_repository_135168001_git_branch=master
  220. bamboo_planRepository_name=SDK
  221. bamboo_docs_aws_secret_key=********
  222. bamboo_buildNumber=447
  223. bamboo_planName=SDK - SDK
  224. bamboo_shortPlanKey=SDK
  225. bamboo_shortJobKey=JOB1
  226. bamboo_planRepository_2_name=Release scripts
  227. bamboo_buildTimeStamp=2021-12-11T11:15:46.990Z
  228. bamboo_repository_previous_revision_number=c4475a9228b197817dce78683d9da8a1e2c4e3a5
  229. M2_HOME=/usr/share/apache-maven-3.3.9
  230. bamboo_refapp_bamboo_build_number=
  231. bamboo_repository_git_branch=master
  232. bamboo_buildResultKey=SDK-SDK-JOB1-447
  233. bamboo_docs_aws_access_key=AKIAI7KMDL5KP2673G7A
  234. bamboo_buildPlanName=SDK - SDK - Default Job
  235. bamboo_planRepository_1_revision=e00396971b71d1eab375bb42a40ab904bd8970a5
  236. bamboo_repository_name=Release scripts
  237. bamboo_capability_system_jdk_openjdk_8_jdk=/usr/lib/jvm/java-8-openjdk-amd64
  238. bamboo_planRepository_2_previousRevision=c4475a9228b197817dce78683d9da8a1e2c4e3a5
  239. bamboo_transifex_password=********
  240. bamboo_capability_system_jdk_openjdk_11_jdk=/usr/lib/jvm/java-11-openjdk-amd64
  241. bamboo_buildFailed=false
  242. bamboo_capability_system_builder_grailsBuilder_Grails_2=/opt/grails
  243. bamboo_capability_system_docker_executable=/usr/bin/docker
  244. bamboo_capability_system_builder_command_Bash=/bin/bash
  245. bamboo_agentWorkingDirectory=/home/bamboo-agent/bamboo-agent/xml-data/build-dir
  246. bamboo_planRepository_2_revision=c4475a9228b197817dce78683d9da8a1e2c4e3a5
  247. bamboo_capability_system_git_executable=/usr/bin/git
  248. bamboo_repository_git_username=
  249. bamboo_planRepository_1_previousRevision=f1d9a9024c5771d66292bfa55f180c90adfc6701
  250. bamboo_planRepository_branchDisplayName=master
  251. bamboo_planRepository_2_type=gitv2
  252. bamboo_repository_89161779_branch_name=master
  253. bamboo_repository_89161779_git_repositoryUrl=https://github.com/openmrs/openmrs-sdk.git
  254. bamboo_plan_storageTag=SDK-SDK
  255. bamboo_planRepository_2_repositoryUrl=https://github.com/openmrs/openmrs-contrib-bamboo.git
  256. bamboo_repository_git_repositoryUrl=https://github.com/openmrs/openmrs-contrib-bamboo.git
  257. bamboo_transifex_username=api
  258. bamboo_refapp_distro_dev_branch=master
  259. bamboo_working_directory=/home/bamboo-agent/bamboo-agent/xml-data/build-dir/SDK-SDK-JOB1
  260. bamboo_planRepository_1_repositoryUrl=https://github.com/openmrs/openmrs-sdk.git
  261. bamboo_repository_135168001_name=Release scripts
  262. bamboo_capability_system_jdk_JDK_1_8=/usr/lib/jvm/java-1.8.0-openjdk-amd64/
  263. PATH=/usr/lib/jvm/java-8-openjdk-amd64/bin:/home/bamboo-agent/.nvm/versions/node/v10.22.1/bin:/home/bamboo-agent/bin:/home/bamboo-agent/.local/bin:/usr/local/sbin:/usr/local/bin:/usr/sbin:/usr/bin:/sbin:/bin:/usr/games:/usr/local/games:/snap/bin:/opt/puppetlabs/bin
  264. 11-Dec-2021 11:18:39 [INFO] Scanning for projects...
  265. 11-Dec-2021 11:18:40 [INFO] ------------------------------------------------------------------------
  266. 11-Dec-2021 11:18:40 [INFO] Reactor Build Order:
  267. 11-Dec-2021 11:18:40 [INFO]
  268. 11-Dec-2021 11:18:40 [INFO] OpenMRS SDK
  269. 11-Dec-2021 11:18:40 [INFO] OpenMRS Reference Application Module Maven Archetype
  270. 11-Dec-2021 11:18:40 [INFO] OpenMRS Platform Module Maven Archetype
  271. 11-Dec-2021 11:18:40 [INFO] OpenMRS OWA Submodule Maven Archetype
  272. 11-Dec-2021 11:18:40 [INFO] sdk-commons
  273. 11-Dec-2021 11:18:40 [INFO] OpenMRS SDK Docker Maven Plugin
  274. 11-Dec-2021 11:18:40 [INFO] OpenMRS SDK Tomcat7 Maven Plugin
  275. 11-Dec-2021 11:18:40 [INFO] OpenMRS SDK Tomcat9 Maven Plugin
  276. 11-Dec-2021 11:18:40 [INFO] OpenMRS SDK Maven Plugin
  277. 11-Dec-2021 11:18:40 [INFO] OpenMRS SDK Integration Tests
  278. 11-Dec-2021 11:18:40 [INFO]
  279. 11-Dec-2021 11:18:40 [INFO] ------------------------------------------------------------------------
  280. 11-Dec-2021 11:18:40 [INFO] Building OpenMRS SDK 4.4.0-SNAPSHOT
  281. 11-Dec-2021 11:18:40 [INFO] ------------------------------------------------------------------------
  282. 11-Dec-2021 11:18:40 [INFO]
  283. 11-Dec-2021 11:18:40 [INFO] --- maven-clean-plugin:2.5:clean (default-clean) @ openmrs-sdk ---
  284. 11-Dec-2021 11:18:40 [INFO]
  285. 11-Dec-2021 11:18:40 [INFO] --- maven-install-plugin:2.4:install (default-install) @ openmrs-sdk ---
  286. 11-Dec-2021 11:18:40 [INFO] Installing /home/bamboo-agent/bamboo-agent/xml-data/build-dir/SDK-SDK-JOB1/pom.xml to /home/bamboo-agent/.m2/repository/org/openmrs/maven/openmrs-sdk/4.4.0-SNAPSHOT/openmrs-sdk-4.4.0-SNAPSHOT.pom
  287. 11-Dec-2021 11:18:40 [INFO]
  288. 11-Dec-2021 11:18:40 [INFO] ------------------------------------------------------------------------
  289. 11-Dec-2021 11:18:40 [INFO] Building OpenMRS Reference Application Module Maven Archetype 4.4.0-SNAPSHOT
  290. 11-Dec-2021 11:18:40 [INFO] ------------------------------------------------------------------------
  291. 11-Dec-2021 11:18:41 [INFO] Downloading: https://m2proxy.atlassian.com/repository/public/org/apache/maven/plugins/maven-resources-plugin/maven-metadata.xml
  292. 11-Dec-2021 11:18:41 [INFO] Downloading: http://mavenrepo.openmrs.org/nexus/content/repositories/public/org/apache/maven/plugins/maven-resources-plugin/maven-metadata.xml
  293. 11-Dec-2021 11:18:42 [INFO] Downloaded: https://m2proxy.atlassian.com/repository/public/org/apache/maven/plugins/maven-resources-plugin/maven-metadata.xml (874 B at 1.0 KB/sec)
  294. 11-Dec-2021 11:18:42 [INFO] Downloaded: http://mavenrepo.openmrs.org/nexus/content/repositories/public/org/apache/maven/plugins/maven-resources-plugin/maven-metadata.xml (922 B at 0.8 KB/sec)
  295. 11-Dec-2021 11:18:42 [INFO] Downloading: http://mavenrepo.openmrs.org/nexus/content/repositories/public/org/apache/maven/plugins/maven-install-plugin/maven-metadata.xml
  296. 11-Dec-2021 11:18:42 [INFO] Downloading: https://m2proxy.atlassian.com/repository/public/org/apache/maven/plugins/maven-install-plugin/maven-metadata.xml
  297. 11-Dec-2021 11:18:42 [INFO] Downloaded: https://m2proxy.atlassian.com/repository/public/org/apache/maven/plugins/maven-install-plugin/maven-metadata.xml (663 B at 4.4 KB/sec)
  298. 11-Dec-2021 11:18:42 [INFO] Downloaded: http://mavenrepo.openmrs.org/nexus/content/repositories/public/org/apache/maven/plugins/maven-install-plugin/maven-metadata.xml (714 B at 2.5 KB/sec)
  299. 11-Dec-2021 11:18:43 [INFO] Downloading: http://mavenrepo.openmrs.org/nexus/content/repositories/public/org/apache/maven/plugins/maven-deploy-plugin/maven-metadata.xml
  300. 11-Dec-2021 11:18:43 [INFO] Downloading: https://m2proxy.atlassian.com/repository/public/org/apache/maven/plugins/maven-deploy-plugin/maven-metadata.xml
  301. 11-Dec-2021 11:18:43 [INFO] Downloaded: https://m2proxy.atlassian.com/repository/public/org/apache/maven/plugins/maven-deploy-plugin/maven-metadata.xml (749 B at 4.3 KB/sec)
  302. 11-Dec-2021 11:18:43 [INFO] Downloaded: http://mavenrepo.openmrs.org/nexus/content/repositories/public/org/apache/maven/plugins/maven-deploy-plugin/maven-metadata.xml (800 B at 2.9 KB/sec)
  303. 11-Dec-2021 11:18:43 [INFO]
  304. 11-Dec-2021 11:18:43 [INFO] --- maven-clean-plugin:2.5:clean (default-clean) @ openmrs-sdk-archetype-module-refapp ---
  305. 11-Dec-2021 11:18:43 [INFO]
  306. 11-Dec-2021 11:18:43 [INFO] --- maven-resources-plugin:3.2.0:resources (default-resources) @ openmrs-sdk-archetype-module-refapp ---
  307. 11-Dec-2021 11:18:44 [INFO] Using 'UTF-8' encoding to copy filtered resources.
  308. 11-Dec-2021 11:18:44 [INFO] Using 'UTF-8' encoding to copy filtered properties files.
  309. 11-Dec-2021 11:18:44 [INFO] Copying 28 resources
  310. 11-Dec-2021 11:18:44 [INFO]
  311. 11-Dec-2021 11:18:44 [INFO] --- maven-resources-plugin:3.2.0:testResources (default-testResources) @ openmrs-sdk-archetype-module-refapp ---
  312. 11-Dec-2021 11:18:44 [INFO] Using 'UTF-8' encoding to copy filtered resources.
  313. 11-Dec-2021 11:18:44 [INFO] Using 'UTF-8' encoding to copy filtered properties files.
  314. 11-Dec-2021 11:18:44 [INFO] Copying 1 resource
  315. 11-Dec-2021 11:18:44 [INFO]
  316. 11-Dec-2021 11:18:44 [INFO] --- maven-archetype-plugin:2.2:jar (default-jar) @ openmrs-sdk-archetype-module-refapp ---
  317. 11-Dec-2021 11:18:46 [INFO] Building archetype jar: /home/bamboo-agent/bamboo-agent/xml-data/build-dir/SDK-SDK-JOB1/archetype-module-refapp/target/openmrs-sdk-archetype-module-refapp-4.4.0-SNAPSHOT
  318. 11-Dec-2021 11:18:46 [INFO]
  319. 11-Dec-2021 11:18:46 [INFO] --- maven-archetype-plugin:2.2:integration-test (default-integration-test) @ openmrs-sdk-archetype-module-refapp ---
  320. 11-Dec-2021 11:18:46 [WARNING] No Archetype IT projects: no directory with goal.txt found.
  321. 11-Dec-2021 11:18:46 [INFO]
  322. 11-Dec-2021 11:18:46 [INFO] --- maven-install-plugin:3.0.0-M1:install (default-install) @ openmrs-sdk-archetype-module-refapp ---
  323. 11-Dec-2021 11:18:47 [INFO] Installing /home/bamboo-agent/bamboo-agent/xml-data/build-dir/SDK-SDK-JOB1/archetype-module-refapp/target/openmrs-sdk-archetype-module-refapp-4.4.0-SNAPSHOT.jar to /home/bamboo-agent/.m2/repository/org/openmrs/maven/archetypes/openmrs-sdk-archetype-module-refapp/4.4.0-SNAPSHOT/openmrs-sdk-archetype-module-refapp-4.4.0-SNAPSHOT.jar
  324. 11-Dec-2021 11:18:47 [INFO] Installing /home/bamboo-agent/bamboo-agent/xml-data/build-dir/SDK-SDK-JOB1/archetype-module-refapp/pom.xml to /home/bamboo-agent/.m2/repository/org/openmrs/maven/archetypes/openmrs-sdk-archetype-module-refapp/4.4.0-SNAPSHOT/openmrs-sdk-archetype-module-refapp-4.4.0-SNAPSHOT.pom
  325. 11-Dec-2021 11:18:47 [INFO]
  326. 11-Dec-2021 11:18:47 [INFO] --- maven-archetype-plugin:2.2:update-local-catalog (default-update-local-catalog) @ openmrs-sdk-archetype-module-refapp ---
  327. 11-Dec-2021 11:18:47 [INFO]
  328. 11-Dec-2021 11:18:47 [INFO] ------------------------------------------------------------------------
  329. 11-Dec-2021 11:18:47 [INFO] Building OpenMRS Platform Module Maven Archetype 4.4.0-SNAPSHOT
  330. 11-Dec-2021 11:18:47 [INFO] ------------------------------------------------------------------------
  331. 11-Dec-2021 11:18:47 [INFO]
  332. 11-Dec-2021 11:18:47 [INFO] --- maven-clean-plugin:2.5:clean (default-clean) @ openmrs-sdk-archetype-module-platform ---
  333. 11-Dec-2021 11:18:47 [INFO]
  334. 11-Dec-2021 11:18:47 [INFO] --- maven-resources-plugin:3.2.0:resources (default-resources) @ openmrs-sdk-archetype-module-platform ---
  335. 11-Dec-2021 11:18:47 [INFO] Using 'UTF-8' encoding to copy filtered resources.
  336. 11-Dec-2021 11:18:47 [INFO] Using 'UTF-8' encoding to copy filtered properties files.
  337. 11-Dec-2021 11:18:47 [INFO] Copying 25 resources
  338. 11-Dec-2021 11:18:47 [INFO]
  339. 11-Dec-2021 11:18:47 [INFO] --- maven-resources-plugin:3.2.0:testResources (default-testResources) @ openmrs-sdk-archetype-module-platform ---
  340. 11-Dec-2021 11:18:47 [INFO] Using 'UTF-8' encoding to copy filtered resources.
  341. 11-Dec-2021 11:18:47 [INFO] Using 'UTF-8' encoding to copy filtered properties files.
  342. 11-Dec-2021 11:18:47 [INFO] Copying 2 resources
  343. 11-Dec-2021 11:18:47 [INFO]
  344. 11-Dec-2021 11:18:47 [INFO] --- maven-archetype-plugin:2.0:jar (default-jar) @ openmrs-sdk-archetype-module-platform ---
  345. 11-Dec-2021 11:18:48 [INFO]
  346. 11-Dec-2021 11:18:48 [INFO] --- maven-archetype-plugin:2.0:add-archetype-metadata (default-add-archetype-metadata) @ openmrs-sdk-archetype-module-platform ---
  347. 11-Dec-2021 11:18:48 [INFO]
  348. 11-Dec-2021 11:18:48 [INFO] --- maven-archetype-plugin:2.0:integration-test (default-integration-test) @ openmrs-sdk-archetype-module-platform ---
  349. 11-Dec-2021 11:18:48 [INFO] Parent element not overwritten in /home/bamboo-agent/bamboo-agent/xml-data/build-dir/SDK-SDK-JOB1/archetype-module-platform/target/test-classes/projects/basic/project/basicmodule/api/pom.xml
  350. 11-Dec-2021 11:18:48 [INFO] Parent element not overwritten in /home/bamboo-agent/bamboo-agent/xml-data/build-dir/SDK-SDK-JOB1/archetype-module-platform/target/test-classes/projects/basic/project/basicmodule/omod/pom.xml
  351. 11-Dec-2021 11:18:48 [INFO]
  352. 11-Dec-2021 11:18:48 [INFO] --- maven-install-plugin:3.0.0-M1:install (default-install) @ openmrs-sdk-archetype-module-platform ---
  353. 11-Dec-2021 11:18:48 [INFO] Installing /home/bamboo-agent/bamboo-agent/xml-data/build-dir/SDK-SDK-JOB1/archetype-module-platform/target/openmrs-sdk-archetype-module-platform-4.4.0-SNAPSHOT.jar to /home/bamboo-agent/.m2/repository/org/openmrs/maven/archetypes/openmrs-sdk-archetype-module-platform/4.4.0-SNAPSHOT/openmrs-sdk-archetype-module-platform-4.4.0-SNAPSHOT.jar
  354. 11-Dec-2021 11:18:48 [INFO] Installing /home/bamboo-agent/bamboo-agent/xml-data/build-dir/SDK-SDK-JOB1/archetype-module-platform/pom.xml to /home/bamboo-agent/.m2/repository/org/openmrs/maven/archetypes/openmrs-sdk-archetype-module-platform/4.4.0-SNAPSHOT/openmrs-sdk-archetype-module-platform-4.4.0-SNAPSHOT.pom
  355. 11-Dec-2021 11:18:48 [INFO]
  356. 11-Dec-2021 11:18:48 [INFO] --- maven-archetype-plugin:2.0:update-local-catalog (default-update-local-catalog) @ openmrs-sdk-archetype-module-platform ---
  357. 11-Dec-2021 11:18:48 [INFO]
  358. 11-Dec-2021 11:18:48 [INFO] ------------------------------------------------------------------------
  359. 11-Dec-2021 11:18:48 [INFO] Building OpenMRS OWA Submodule Maven Archetype 4.4.0-SNAPSHOT
  360. 11-Dec-2021 11:18:48 [INFO] ------------------------------------------------------------------------
  361. 11-Dec-2021 11:18:48 [INFO]
  362. 11-Dec-2021 11:18:48 [INFO] --- maven-clean-plugin:2.5:clean (default-clean) @ openmrs-sdk-archetype-submodule-owa ---
  363. 11-Dec-2021 11:18:48 [INFO]
  364. 11-Dec-2021 11:18:48 [INFO] --- maven-resources-plugin:3.2.0:resources (default-resources) @ openmrs-sdk-archetype-submodule-owa ---
  365. 11-Dec-2021 11:18:48 [INFO] Using 'UTF-8' encoding to copy filtered resources.
  366. 11-Dec-2021 11:18:48 [INFO] Using 'UTF-8' encoding to copy filtered properties files.
  367. 11-Dec-2021 11:18:48 [INFO] Copying 0 resource
  368. 11-Dec-2021 11:18:48 [INFO] Copying 3 resources
  369. 11-Dec-2021 11:18:48 [INFO]
  370. 11-Dec-2021 11:18:48 [INFO] --- maven-resources-plugin:3.2.0:testResources (default-testResources) @ openmrs-sdk-archetype-submodule-owa ---
  371. 11-Dec-2021 11:18:48 [INFO] Using 'UTF-8' encoding to copy filtered resources.
  372. 11-Dec-2021 11:18:48 [INFO] Using 'UTF-8' encoding to copy filtered properties files.
  373. 11-Dec-2021 11:18:48 [INFO] skip non existing resourceDirectory /home/bamboo-agent/bamboo-agent/xml-data/build-dir/SDK-SDK-JOB1/archetype-submodule-owa/src/test/resources
  374. 11-Dec-2021 11:18:48 [INFO]
  375. 11-Dec-2021 11:18:48 [INFO] --- maven-archetype-plugin:2.2:jar (default-jar) @ openmrs-sdk-archetype-submodule-owa ---
  376. 11-Dec-2021 11:18:48 [INFO] Building archetype jar: /home/bamboo-agent/bamboo-agent/xml-data/build-dir/SDK-SDK-JOB1/archetype-submodule-owa/target/openmrs-sdk-archetype-submodule-owa-4.4.0-SNAPSHOT
  377. 11-Dec-2021 11:18:48 [INFO]
  378. 11-Dec-2021 11:18:48 [INFO] --- maven-archetype-plugin:2.2:integration-test (default-integration-test) @ openmrs-sdk-archetype-submodule-owa ---
  379. 11-Dec-2021 11:18:48 [WARNING] No Archetype IT projects: root 'projects' directory not found.
  380. 11-Dec-2021 11:18:48 [INFO]
  381. 11-Dec-2021 11:18:48 [INFO] --- maven-install-plugin:3.0.0-M1:install (default-install) @ openmrs-sdk-archetype-submodule-owa ---
  382. 11-Dec-2021 11:18:48 [INFO] Installing /home/bamboo-agent/bamboo-agent/xml-data/build-dir/SDK-SDK-JOB1/archetype-submodule-owa/target/openmrs-sdk-archetype-submodule-owa-4.4.0-SNAPSHOT.jar to /home/bamboo-agent/.m2/repository/org/openmrs/maven/archetypes/openmrs-sdk-archetype-submodule-owa/4.4.0-SNAPSHOT/openmrs-sdk-archetype-submodule-owa-4.4.0-SNAPSHOT.jar
  383. 11-Dec-2021 11:18:48 [INFO] Installing /home/bamboo-agent/bamboo-agent/xml-data/build-dir/SDK-SDK-JOB1/archetype-submodule-owa/pom.xml to /home/bamboo-agent/.m2/repository/org/openmrs/maven/archetypes/openmrs-sdk-archetype-submodule-owa/4.4.0-SNAPSHOT/openmrs-sdk-archetype-submodule-owa-4.4.0-SNAPSHOT.pom
  384. 11-Dec-2021 11:18:48 [INFO]
  385. 11-Dec-2021 11:18:48 [INFO] --- maven-archetype-plugin:2.2:update-local-catalog (default-update-local-catalog) @ openmrs-sdk-archetype-submodule-owa ---
  386. 11-Dec-2021 11:18:48 [INFO]
  387. 11-Dec-2021 11:18:48 [INFO] ------------------------------------------------------------------------
  388. 11-Dec-2021 11:18:48 [INFO] Building sdk-commons 4.4.0-SNAPSHOT
  389. 11-Dec-2021 11:18:48 [INFO] ------------------------------------------------------------------------
  390. 11-Dec-2021 11:18:51 [INFO]
  391. 11-Dec-2021 11:18:51 [INFO] --- maven-clean-plugin:2.5:clean (default-clean) @ sdk-commons ---
  392. 11-Dec-2021 11:18:51 [INFO]
  393. 11-Dec-2021 11:18:51 [INFO] --- maven-resources-plugin:2.6:resources (default-resources) @ sdk-commons ---
  394. 11-Dec-2021 11:18:51 [INFO] Using 'UTF-8' encoding to copy filtered resources.
  395. 11-Dec-2021 11:18:51 [INFO] Copying 1 resource
  396. 11-Dec-2021 11:18:51 [INFO] Copying 1 resource
  397. 11-Dec-2021 11:18:51 [INFO]
  398. 11-Dec-2021 11:18:51 [INFO] --- maven-compiler-plugin:3.8.1:compile (default-compile) @ sdk-commons ---
  399. 11-Dec-2021 11:18:51 [INFO] Changes detected - recompiling the module!
  400. 11-Dec-2021 11:18:51 [INFO] Compiling 19 source files to /home/bamboo-agent/bamboo-agent/xml-data/build-dir/SDK-SDK-JOB1/sdk-commons/target/classes
  401. 11-Dec-2021 11:18:55 [INFO] /home/bamboo-agent/bamboo-agent/xml-data/build-dir/SDK-SDK-JOB1/sdk-commons/src/main/java/org/openmrs/maven/plugins/utility/VersionsHelper.java: Some input files use or override a deprecated API.
  402. 11-Dec-2021 11:18:55 [INFO] /home/bamboo-agent/bamboo-agent/xml-data/build-dir/SDK-SDK-JOB1/sdk-commons/src/main/java/org/openmrs/maven/plugins/utility/VersionsHelper.java: Recompile with -Xlint:deprecation for details.
  403. 11-Dec-2021 11:18:55 [INFO]
  404. 11-Dec-2021 11:18:55 [INFO] --- plexus-component-metadata:2.1.0:generate-metadata (process-classes) @ sdk-commons ---
  405. 11-Dec-2021 11:18:57 [INFO] Discovered 1 component descriptors(s)
  406. 11-Dec-2021 11:18:57 [INFO]
  407. 11-Dec-2021 11:18:57 [INFO] --- maven-resources-plugin:2.6:testResources (default-testResources) @ sdk-commons ---
  408. 11-Dec-2021 11:18:57 [INFO] Using 'UTF-8' encoding to copy filtered resources.
  409. 11-Dec-2021 11:18:57 [INFO] skip non existing resourceDirectory /home/bamboo-agent/bamboo-agent/xml-data/build-dir/SDK-SDK-JOB1/sdk-commons/src/test/resources
  410. 11-Dec-2021 11:18:57 [INFO]
  411. 11-Dec-2021 11:18:57 [INFO] --- maven-compiler-plugin:3.8.1:testCompile (default-testCompile) @ sdk-commons ---
  412. 11-Dec-2021 11:18:57 [INFO] Changes detected - recompiling the module!
  413. 11-Dec-2021 11:18:57 [INFO] Compiling 7 source files to /home/bamboo-agent/bamboo-agent/xml-data/build-dir/SDK-SDK-JOB1/sdk-commons/target/test-classes
  414. 11-Dec-2021 11:18:58 [INFO]
  415. 11-Dec-2021 11:18:58 [INFO] --- plexus-component-metadata:2.1.0:generate-test-metadata (process-test-classes) @ sdk-commons ---
  416. 11-Dec-2021 11:18:58 [INFO]
  417. 11-Dec-2021 11:18:58 [INFO] --- maven-surefire-plugin:2.22.2:test (default-test) @ sdk-commons ---
  418. 11-Dec-2021 11:18:58 [INFO]
  419. 11-Dec-2021 11:18:58 [INFO] -------------------------------------------------------
  420. 11-Dec-2021 11:18:58 [INFO] T E S T S
  421. 11-Dec-2021 11:18:58 [INFO] -------------------------------------------------------
  422. 11-Dec-2021 11:18:59 [INFO] Running org.openmrs.maven.plugins.model.ServerTest
  423. 11-Dec-2021 11:18:59 [INFO] Tests run: 4, Failures: 0, Errors: 0, Skipped: 0, Time elapsed: 0.131 s - in org.openmrs.maven.plugins.model.ServerTest
  424. 11-Dec-2021 11:18:59 [INFO] Running org.openmrs.maven.plugins.model.SdkStatisticsTest
  425. 11-Dec-2021 11:18:59 [INFO] Tests run: 2, Failures: 0, Errors: 0, Skipped: 0, Time elapsed: 0.006 s - in org.openmrs.maven.plugins.model.SdkStatisticsTest
  426. 11-Dec-2021 11:18:59 [INFO] Running org.openmrs.maven.plugins.model.ArtifactTest
  427. 11-Dec-2021 11:18:59 [INFO] Tests run: 1, Failures: 0, Errors: 0, Skipped: 0, Time elapsed: 0.005 s - in org.openmrs.maven.plugins.model.ArtifactTest
  428. 11-Dec-2021 11:18:59 [INFO] Running org.openmrs.maven.plugins.model.DistroPropertiesTest
  429. 11-Dec-2021 11:18:59 [INFO] Tests run: 2, Failures: 0, Errors: 0, Skipped: 0, Time elapsed: 0.001 s - in org.openmrs.maven.plugins.model.DistroPropertiesTest
  430. 11-Dec-2021 11:18:59 [INFO] Running org.openmrs.maven.plugins.utility.DistroHelperTest
  431. 11-Dec-2021 11:18:59 [INFO] Tests run: 12, Failures: 0, Errors: 0, Skipped: 0, Time elapsed: 0.037 s - in org.openmrs.maven.plugins.utility.DistroHelperTest
  432. 11-Dec-2021 11:18:59 [INFO] Running org.openmrs.maven.plugins.utility.DefaultWizardTest
  433. 11-Dec-2021 11:18:59 Dec 11, 2021 11:18:59 AM org.jline.utils.Log logr
  434. 11-Dec-2021 11:18:59 WARNING: Unable to create a system terminal, creating a dumb terminal (enable debug logging for more information)
  435. 11-Dec-2021 11:19:00 Dec 11, 2021 11:19:00 AM org.jline.utils.Log logr
  436. 11-Dec-2021 11:19:00 WARNING: Unable to create a system terminal, creating a dumb terminal (enable debug logging for more information)
  437. 11-Dec-2021 11:19:00 Dec 11, 2021 11:19:00 AM org.jline.utils.Log logr
  438. 11-Dec-2021 11:19:00 WARNING: Unable to create a system terminal, creating a dumb terminal (enable debug logging for more information)
  439. 11-Dec-2021 11:19:00 Dec 11, 2021 11:19:00 AM org.jline.utils.Log logr
  440. 11-Dec-2021 11:19:00 WARNING: Unable to create a system terminal, creating a dumb terminal (enable debug logging for more information)
  441. 11-Dec-2021 11:19:00 [INFO] Tests run: 4, Failures: 0, Errors: 0, Skipped: 0, Time elapsed: 0.748 s - in org.openmrs.maven.plugins.utility.DefaultWizardTest
  442. 11-Dec-2021 11:19:00 [INFO] Running org.openmrs.maven.plugins.utility.VersionsHelperTest
  443. 11-Dec-2021 11:19:00 [INFO] Tests run: 8, Failures: 0, Errors: 0, Skipped: 0, Time elapsed: 0.03 s - in org.openmrs.maven.plugins.utility.VersionsHelperTest
  444. 11-Dec-2021 11:19:00 [INFO]
  445. 11-Dec-2021 11:19:00 [INFO] Results:
  446. 11-Dec-2021 11:19:00 [INFO]
  447. 11-Dec-2021 11:19:00 [INFO] Tests run: 33, Failures: 0, Errors: 0, Skipped: 0
  448. 11-Dec-2021 11:19:00 [INFO]
  449. 11-Dec-2021 11:19:00 [INFO]
  450. 11-Dec-2021 11:19:00 [INFO] --- maven-jar-plugin:2.4:jar (default-jar) @ sdk-commons ---
  451. 11-Dec-2021 11:19:01 [INFO] Building jar: /home/bamboo-agent/bamboo-agent/xml-data/build-dir/SDK-SDK-JOB1/sdk-commons/target/sdk-commons-4.4.0-SNAPSHOT.jar
  452. 11-Dec-2021 11:19:01 [INFO]
  453. 11-Dec-2021 11:19:01 [INFO] --- maven-install-plugin:2.4:install (default-install) @ sdk-commons ---
  454. 11-Dec-2021 11:19:01 [INFO] Installing /home/bamboo-agent/bamboo-agent/xml-data/build-dir/SDK-SDK-JOB1/sdk-commons/target/sdk-commons-4.4.0-SNAPSHOT.jar to /home/bamboo-agent/.m2/repository/org/openmrs/maven/sdk-commons/4.4.0-SNAPSHOT/sdk-commons-4.4.0-SNAPSHOT.jar
  455. 11-Dec-2021 11:19:01 [INFO] Installing /home/bamboo-agent/bamboo-agent/xml-data/build-dir/SDK-SDK-JOB1/sdk-commons/pom.xml to /home/bamboo-agent/.m2/repository/org/openmrs/maven/sdk-commons/4.4.0-SNAPSHOT/sdk-commons-4.4.0-SNAPSHOT.pom
  456. 11-Dec-2021 11:19:01 [INFO]
  457. 11-Dec-2021 11:19:01 [INFO] ------------------------------------------------------------------------
  458. 11-Dec-2021 11:19:01 [INFO] Building OpenMRS SDK Docker Maven Plugin 4.4.0-SNAPSHOT
  459. 11-Dec-2021 11:19:01 [INFO] ------------------------------------------------------------------------
  460. 11-Dec-2021 11:19:01 [INFO] Downloading: http://mavenrepo.openmrs.org/nexus/content/repositories/public/org/slf4j/slf4j-api/1.7.30/slf4j-api-1.7.30.pom
  461. 11-Dec-2021 11:19:01 [INFO] Downloaded: http://mavenrepo.openmrs.org/nexus/content/repositories/public/org/slf4j/slf4j-api/1.7.30/slf4j-api-1.7.30.pom (4 KB at 13.7 KB/sec)
  462. 11-Dec-2021 11:19:02 [INFO] Downloading: http://mavenrepo.openmrs.org/nexus/content/repositories/public/org/slf4j/jcl-over-slf4j/1.7.30/jcl-over-slf4j-1.7.30.pom
  463. 11-Dec-2021 11:19:02 [INFO] Downloaded: http://mavenrepo.openmrs.org/nexus/content/repositories/public/org/slf4j/jcl-over-slf4j/1.7.30/jcl-over-slf4j-1.7.30.pom (2 KB at 4.5 KB/sec)
  464. 11-Dec-2021 11:19:02 [INFO] Downloading: http://mavenrepo.openmrs.org/nexus/content/repositories/public/org/hamcrest/hamcrest/2.1/hamcrest-2.1.pom
  465. 11-Dec-2021 11:19:02 [INFO] Downloaded: http://mavenrepo.openmrs.org/nexus/content/repositories/public/org/hamcrest/hamcrest/2.1/hamcrest-2.1.pom (2 KB at 4.1 KB/sec)
  466. 11-Dec-2021 11:19:02 [INFO] Downloading: http://mavenrepo.openmrs.org/nexus/content/repositories/public/org/slf4j/slf4j-api/1.7.30/slf4j-api-1.7.30.jar
  467. 11-Dec-2021 11:19:02 [INFO] Downloading: http://mavenrepo.openmrs.org/nexus/content/repositories/public/org/slf4j/jcl-over-slf4j/1.7.30/jcl-over-slf4j-1.7.30.jar
  468. 11-Dec-2021 11:19:02 [INFO] Downloading: http://mavenrepo.openmrs.org/nexus/content/repositories/public/org/hamcrest/hamcrest/2.1/hamcrest-2.1.jar
  469. 11-Dec-2021 11:19:03 [INFO] Downloaded: http://mavenrepo.openmrs.org/nexus/content/repositories/public/org/slf4j/slf4j-api/1.7.30/slf4j-api-1.7.30.jar (41 KB at 106.9 KB/sec)
  470. 11-Dec-2021 11:19:03 [INFO] Downloaded: http://mavenrepo.openmrs.org/nexus/content/repositories/public/org/slf4j/jcl-over-slf4j/1.7.30/jcl-over-slf4j-1.7.30.jar (17 KB at 19.1 KB/sec)
  471. 11-Dec-2021 11:19:03 [INFO] Downloaded: http://mavenrepo.openmrs.org/nexus/content/repositories/public/org/hamcrest/hamcrest/2.1/hamcrest-2.1.jar (121 KB at 121.6 KB/sec)
  472. 11-Dec-2021 11:19:03 [INFO]
  473. 11-Dec-2021 11:19:03 [INFO] --- maven-clean-plugin:2.5:clean (default-clean) @ openmrs-sdk-docker-maven-plugin ---
  474. 11-Dec-2021 11:19:03 [INFO]
  475. 11-Dec-2021 11:19:03 [INFO] --- maven-resources-plugin:2.6:resources (default-resources) @ openmrs-sdk-docker-maven-plugin ---
  476. 11-Dec-2021 11:19:03 [INFO] Using 'UTF-8' encoding to copy filtered resources.
  477. 11-Dec-2021 11:19:03 [INFO] skip non existing resourceDirectory /home/bamboo-agent/bamboo-agent/xml-data/build-dir/SDK-SDK-JOB1/docker-maven-plugin/src/main/resources
  478. 11-Dec-2021 11:19:03 [INFO]
  479. 11-Dec-2021 11:19:03 [INFO] --- maven-compiler-plugin:3.8.1:compile (default-compile) @ openmrs-sdk-docker-maven-plugin ---
  480. 11-Dec-2021 11:19:03 [INFO] Changes detected - recompiling the module!
  481. 11-Dec-2021 11:19:03 [INFO] Compiling 3 source files to /home/bamboo-agent/bamboo-agent/xml-data/build-dir/SDK-SDK-JOB1/docker-maven-plugin/target/classes
  482. 11-Dec-2021 11:19:05 [INFO]
  483. 11-Dec-2021 11:19:05 [INFO] --- maven-plugin-plugin:3.6.1:descriptor (default-descriptor) @ openmrs-sdk-docker-maven-plugin ---
  484. 11-Dec-2021 11:19:08 [INFO] Using 'UTF-8' encoding to read mojo source files.
  485. 11-Dec-2021 11:19:08 [INFO] java-javadoc mojo extractor found 2 mojo descriptors.
  486. 11-Dec-2021 11:19:08 [INFO] bsh mojo extractor found 0 mojo descriptor.
  487. 11-Dec-2021 11:19:08 [INFO] ant mojo extractor found 0 mojo descriptor.
  488. 11-Dec-2021 11:19:10 [INFO] java-annotations mojo extractor found 0 mojo descriptor.
  489. 11-Dec-2021 11:19:10 [INFO]
  490. 11-Dec-2021 11:19:10 [INFO] --- plexus-component-metadata:2.1.0:generate-metadata (process-classes) @ openmrs-sdk-docker-maven-plugin ---
  491. 11-Dec-2021 11:19:10 [INFO]
  492. 11-Dec-2021 11:19:10 [INFO] --- maven-resources-plugin:2.6:testResources (default-testResources) @ openmrs-sdk-docker-maven-plugin ---
  493. 11-Dec-2021 11:19:10 [INFO] Using 'UTF-8' encoding to copy filtered resources.
  494. 11-Dec-2021 11:19:10 [INFO] skip non existing resourceDirectory /home/bamboo-agent/bamboo-agent/xml-data/build-dir/SDK-SDK-JOB1/docker-maven-plugin/src/test/resources
  495. 11-Dec-2021 11:19:10 [INFO]
  496. 11-Dec-2021 11:19:10 [INFO] --- maven-compiler-plugin:3.8.1:testCompile (default-testCompile) @ openmrs-sdk-docker-maven-plugin ---
  497. 11-Dec-2021 11:19:10 [INFO] No sources to compile
  498. 11-Dec-2021 11:19:10 [INFO]
  499. 11-Dec-2021 11:19:10 [INFO] --- plexus-component-metadata:2.1.0:generate-test-metadata (process-test-classes) @ openmrs-sdk-docker-maven-plugin ---
  500. 11-Dec-2021 11:19:10 [INFO]
  501. 11-Dec-2021 11:19:10 [INFO] --- maven-surefire-plugin:2.22.2:test (default-test) @ openmrs-sdk-docker-maven-plugin ---
  502. 11-Dec-2021 11:19:10 [INFO] No tests to run.
  503. 11-Dec-2021 11:19:10 [INFO]
  504. 11-Dec-2021 11:19:10 [INFO] --- maven-jar-plugin:2.4:jar (default-jar) @ openmrs-sdk-docker-maven-plugin ---
  505. 11-Dec-2021 11:19:10 [INFO] Building jar: /home/bamboo-agent/bamboo-agent/xml-data/build-dir/SDK-SDK-JOB1/docker-maven-plugin/target/openmrs-sdk-docker-maven-plugin-4.4.0-SNAPSHOT.jar
  506. 11-Dec-2021 11:19:10 [INFO]
  507. 11-Dec-2021 11:19:10 [INFO] --- maven-plugin-plugin:3.6.1:addPluginArtifactMetadata (default-addPluginArtifactMetadata) @ openmrs-sdk-docker-maven-plugin ---
  508. 11-Dec-2021 11:19:10 [INFO]
  509. 11-Dec-2021 11:19:10 [INFO] --- maven-install-plugin:2.4:install (default-install) @ openmrs-sdk-docker-maven-plugin ---
  510. 11-Dec-2021 11:19:10 [INFO] Installing /home/bamboo-agent/bamboo-agent/xml-data/build-dir/SDK-SDK-JOB1/docker-maven-plugin/target/openmrs-sdk-docker-maven-plugin-4.4.0-SNAPSHOT.jar to /home/bamboo-agent/.m2/repository/org/openmrs/maven/plugins/openmrs-sdk-docker-maven-plugin/4.4.0-SNAPSHOT/openmrs-sdk-docker-maven-plugin-4.4.0-SNAPSHOT.jar
  511. 11-Dec-2021 11:19:10 [INFO] Installing /home/bamboo-agent/bamboo-agent/xml-data/build-dir/SDK-SDK-JOB1/docker-maven-plugin/pom.xml to /home/bamboo-agent/.m2/repository/org/openmrs/maven/plugins/openmrs-sdk-docker-maven-plugin/4.4.0-SNAPSHOT/openmrs-sdk-docker-maven-plugin-4.4.0-SNAPSHOT.pom
  512. 11-Dec-2021 11:19:10 [INFO]
  513. 11-Dec-2021 11:19:10 [INFO] ------------------------------------------------------------------------
  514. 11-Dec-2021 11:19:10 [INFO] Building OpenMRS SDK Tomcat7 Maven Plugin 4.4.0-SNAPSHOT
  515. 11-Dec-2021 11:19:10 [INFO] ------------------------------------------------------------------------
  516. 11-Dec-2021 11:19:10 [INFO]
  517. 11-Dec-2021 11:19:10 [INFO] --- maven-clean-plugin:2.5:clean (default-clean) @ openmrs-sdk-tomcat7-maven-plugin ---
  518. 11-Dec-2021 11:19:10 [INFO]
  519. 11-Dec-2021 11:19:10 [INFO] --- maven-resources-plugin:2.6:resources (default-resources) @ openmrs-sdk-tomcat7-maven-plugin ---
  520. 11-Dec-2021 11:19:10 [INFO] Using 'UTF-8' encoding to copy filtered resources.
  521. 11-Dec-2021 11:19:10 [INFO] skip non existing resourceDirectory /home/bamboo-agent/bamboo-agent/xml-data/build-dir/SDK-SDK-JOB1/tomcat7-maven-plugin/src/main/resources
  522. 11-Dec-2021 11:19:10 [INFO]
  523. 11-Dec-2021 11:19:10 [INFO] --- maven-compiler-plugin:3.8.1:compile (default-compile) @ openmrs-sdk-tomcat7-maven-plugin ---
  524. 11-Dec-2021 11:19:10 [INFO] Changes detected - recompiling the module!
  525. 11-Dec-2021 11:19:10 [INFO] Compiling 2 source files to /home/bamboo-agent/bamboo-agent/xml-data/build-dir/SDK-SDK-JOB1/tomcat7-maven-plugin/target/classes
  526. 11-Dec-2021 11:19:11 [INFO]
  527. 11-Dec-2021 11:19:11 [INFO] --- maven-plugin-plugin:3.6.1:descriptor (default-descriptor) @ openmrs-sdk-tomcat7-maven-plugin ---
  528. 11-Dec-2021 11:19:11 [INFO] Using 'UTF-8' encoding to read mojo source files.
  529. 11-Dec-2021 11:19:11 [INFO] java-javadoc mojo extractor found 0 mojo descriptor.
  530. 11-Dec-2021 11:19:11 [INFO] bsh mojo extractor found 0 mojo descriptor.
  531. 11-Dec-2021 11:19:11 [INFO] ant mojo extractor found 0 mojo descriptor.
  532. 11-Dec-2021 11:19:13 [INFO] java-annotations mojo extractor found 1 mojo descriptor.
  533. 11-Dec-2021 11:19:13 [INFO]
  534. 11-Dec-2021 11:19:13 [INFO] --- plexus-component-metadata:2.1.0:generate-metadata (process-classes) @ openmrs-sdk-tomcat7-maven-plugin ---
  535. 11-Dec-2021 11:19:13 [INFO]
  536. 11-Dec-2021 11:19:13 [INFO] --- maven-resources-plugin:2.6:testResources (default-testResources) @ openmrs-sdk-tomcat7-maven-plugin ---
  537. 11-Dec-2021 11:19:13 [INFO] Using 'UTF-8' encoding to copy filtered resources.
  538. 11-Dec-2021 11:19:13 [INFO] skip non existing resourceDirectory /home/bamboo-agent/bamboo-agent/xml-data/build-dir/SDK-SDK-JOB1/tomcat7-maven-plugin/src/test/resources
  539. 11-Dec-2021 11:19:13 [INFO]
  540. 11-Dec-2021 11:19:13 [INFO] --- maven-compiler-plugin:3.8.1:testCompile (default-testCompile) @ openmrs-sdk-tomcat7-maven-plugin ---
  541. 11-Dec-2021 11:19:13 [INFO] Changes detected - recompiling the module!
  542. 11-Dec-2021 11:19:13 [INFO] Compiling 1 source file to /home/bamboo-agent/bamboo-agent/xml-data/build-dir/SDK-SDK-JOB1/tomcat7-maven-plugin/target/test-classes
  543. 11-Dec-2021 11:19:13 [INFO]
  544. 11-Dec-2021 11:19:13 [INFO] --- plexus-component-metadata:2.1.0:generate-test-metadata (process-test-classes) @ openmrs-sdk-tomcat7-maven-plugin ---
  545. 11-Dec-2021 11:19:13 [INFO]
  546. 11-Dec-2021 11:19:13 [INFO] --- maven-surefire-plugin:2.22.2:test (default-test) @ openmrs-sdk-tomcat7-maven-plugin ---
  547. 11-Dec-2021 11:19:13 [INFO]
  548. 11-Dec-2021 11:19:13 [INFO] -------------------------------------------------------
  549. 11-Dec-2021 11:19:13 [INFO] T E S T S
  550. 11-Dec-2021 11:19:13 [INFO] -------------------------------------------------------
  551. 11-Dec-2021 11:19:14 [INFO] Running org.openmrs.maven.plugins.utility.OpenMRSSDKRedirectServletTest
  552. 11-Dec-2021 11:19:15 [INFO] Tests run: 5, Failures: 0, Errors: 0, Skipped: 0, Time elapsed: 1.628 s - in org.openmrs.maven.plugins.utility.OpenMRSSDKRedirectServletTest
  553. 11-Dec-2021 11:19:16 [INFO]
  554. 11-Dec-2021 11:19:16 [INFO] Results:
  555. 11-Dec-2021 11:19:16 [INFO]
  556. 11-Dec-2021 11:19:16 [INFO] Tests run: 5, Failures: 0, Errors: 0, Skipped: 0
  557. 11-Dec-2021 11:19:16 [INFO]
  558. 11-Dec-2021 11:19:16 [INFO]
  559. 11-Dec-2021 11:19:16 [INFO] --- maven-jar-plugin:2.4:jar (default-jar) @ openmrs-sdk-tomcat7-maven-plugin ---
  560. 11-Dec-2021 11:19:16 [INFO] Building jar: /home/bamboo-agent/bamboo-agent/xml-data/build-dir/SDK-SDK-JOB1/tomcat7-maven-plugin/target/openmrs-sdk-tomcat7-maven-plugin-4.4.0-SNAPSHOT.jar
  561. 11-Dec-2021 11:19:16 [INFO]
  562. 11-Dec-2021 11:19:16 [INFO] --- maven-plugin-plugin:3.6.1:addPluginArtifactMetadata (default-addPluginArtifactMetadata) @ openmrs-sdk-tomcat7-maven-plugin ---
  563. 11-Dec-2021 11:19:16 [INFO]
  564. 11-Dec-2021 11:19:16 [INFO] --- maven-install-plugin:2.4:install (default-install) @ openmrs-sdk-tomcat7-maven-plugin ---
  565. 11-Dec-2021 11:19:16 [INFO] Installing /home/bamboo-agent/bamboo-agent/xml-data/build-dir/SDK-SDK-JOB1/tomcat7-maven-plugin/target/openmrs-sdk-tomcat7-maven-plugin-4.4.0-SNAPSHOT.jar to /home/bamboo-agent/.m2/repository/org/openmrs/maven/plugins/openmrs-sdk-tomcat7-maven-plugin/4.4.0-SNAPSHOT/openmrs-sdk-tomcat7-maven-plugin-4.4.0-SNAPSHOT.jar
  566. 11-Dec-2021 11:19:16 [INFO] Installing /home/bamboo-agent/bamboo-agent/xml-data/build-dir/SDK-SDK-JOB1/tomcat7-maven-plugin/pom.xml to /home/bamboo-agent/.m2/repository/org/openmrs/maven/plugins/openmrs-sdk-tomcat7-maven-plugin/4.4.0-SNAPSHOT/openmrs-sdk-tomcat7-maven-plugin-4.4.0-SNAPSHOT.pom
  567. 11-Dec-2021 11:19:16 [INFO]
  568. 11-Dec-2021 11:19:16 [INFO] ------------------------------------------------------------------------
  569. 11-Dec-2021 11:19:16 [INFO] Building OpenMRS SDK Tomcat9 Maven Plugin 4.4.0-SNAPSHOT
  570. 11-Dec-2021 11:19:16 [INFO] ------------------------------------------------------------------------
  571. 11-Dec-2021 11:19:16 [INFO]
  572. 11-Dec-2021 11:19:16 [INFO] --- maven-clean-plugin:2.5:clean (default-clean) @ openmrs-sdk-tomcat9-maven-plugin ---
  573. 11-Dec-2021 11:19:16 [INFO]
  574. 11-Dec-2021 11:19:16 [INFO] --- maven-resources-plugin:2.6:resources (default-resources) @ openmrs-sdk-tomcat9-maven-plugin ---
  575. 11-Dec-2021 11:19:16 [INFO] Using 'UTF-8' encoding to copy filtered resources.
  576. 11-Dec-2021 11:19:16 [INFO] skip non existing resourceDirectory /home/bamboo-agent/bamboo-agent/xml-data/build-dir/SDK-SDK-JOB1/tomcat9-maven-plugin/src/main/resources
  577. 11-Dec-2021 11:19:16 [INFO]
  578. 11-Dec-2021 11:19:16 [INFO] --- maven-compiler-plugin:3.8.1:compile (default-compile) @ openmrs-sdk-tomcat9-maven-plugin ---
  579. 11-Dec-2021 11:19:16 [INFO] Changes detected - recompiling the module!
  580. 11-Dec-2021 11:19:16 [INFO] Compiling 2 source files to /home/bamboo-agent/bamboo-agent/xml-data/build-dir/SDK-SDK-JOB1/tomcat9-maven-plugin/target/classes
  581. 11-Dec-2021 11:19:17 [INFO]
  582. 11-Dec-2021 11:19:17 [INFO] --- maven-plugin-plugin:3.6.1:descriptor (default-descriptor) @ openmrs-sdk-tomcat9-maven-plugin ---
  583. 11-Dec-2021 11:19:17 [INFO] Using 'UTF-8' encoding to read mojo source files.
  584. 11-Dec-2021 11:19:17 [INFO] java-javadoc mojo extractor found 0 mojo descriptor.
  585. 11-Dec-2021 11:19:17 [INFO] bsh mojo extractor found 0 mojo descriptor.
  586. 11-Dec-2021 11:19:17 [INFO] ant mojo extractor found 0 mojo descriptor.
  587. 11-Dec-2021 11:19:18 [INFO] java-annotations mojo extractor found 1 mojo descriptor.
  588. 11-Dec-2021 11:19:18 [INFO]
  589. 11-Dec-2021 11:19:18 [INFO] --- plexus-component-metadata:2.1.0:generate-metadata (process-classes) @ openmrs-sdk-tomcat9-maven-plugin ---
  590. 11-Dec-2021 11:19:18 [INFO]
  591. 11-Dec-2021 11:19:18 [INFO] --- maven-resources-plugin:2.6:testResources (default-testResources) @ openmrs-sdk-tomcat9-maven-plugin ---
  592. 11-Dec-2021 11:19:18 [INFO] Using 'UTF-8' encoding to copy filtered resources.
  593. 11-Dec-2021 11:19:18 [INFO] skip non existing resourceDirectory /home/bamboo-agent/bamboo-agent/xml-data/build-dir/SDK-SDK-JOB1/tomcat9-maven-plugin/src/test/resources
  594. 11-Dec-2021 11:19:18 [INFO]
  595. 11-Dec-2021 11:19:18 [INFO] --- maven-compiler-plugin:3.8.1:testCompile (default-testCompile) @ openmrs-sdk-tomcat9-maven-plugin ---
  596. 11-Dec-2021 11:19:18 [INFO] Changes detected - recompiling the module!
  597. 11-Dec-2021 11:19:18 [INFO] Compiling 1 source file to /home/bamboo-agent/bamboo-agent/xml-data/build-dir/SDK-SDK-JOB1/tomcat9-maven-plugin/target/test-classes
  598. 11-Dec-2021 11:19:18 [INFO]
  599. 11-Dec-2021 11:19:18 [INFO] --- plexus-component-metadata:2.1.0:generate-test-metadata (process-test-classes) @ openmrs-sdk-tomcat9-maven-plugin ---
  600. 11-Dec-2021 11:19:18 [INFO]
  601. 11-Dec-2021 11:19:18 [INFO] --- maven-surefire-plugin:2.22.2:test (default-test) @ openmrs-sdk-tomcat9-maven-plugin ---
  602. 11-Dec-2021 11:19:18 [INFO]
  603. 11-Dec-2021 11:19:18 [INFO] -------------------------------------------------------
  604. 11-Dec-2021 11:19:18 [INFO] T E S T S
  605. 11-Dec-2021 11:19:18 [INFO] -------------------------------------------------------
  606. 11-Dec-2021 11:19:18 [INFO] Running org.openmrs.maven.plugins.utility.OpenMRSSDKRedirectServletTest
  607. 11-Dec-2021 11:19:19 [INFO] Tests run: 5, Failures: 0, Errors: 0, Skipped: 0, Time elapsed: 0.848 s - in org.openmrs.maven.plugins.utility.OpenMRSSDKRedirectServletTest
  608. 11-Dec-2021 11:19:19 [INFO]
  609. 11-Dec-2021 11:19:19 [INFO] Results:
  610. 11-Dec-2021 11:19:19 [INFO]
  611. 11-Dec-2021 11:19:19 [INFO] Tests run: 5, Failures: 0, Errors: 0, Skipped: 0
  612. 11-Dec-2021 11:19:19 [INFO]
  613. 11-Dec-2021 11:19:19 [INFO]
  614. 11-Dec-2021 11:19:19 [INFO] --- maven-jar-plugin:2.4:jar (default-jar) @ openmrs-sdk-tomcat9-maven-plugin ---
  615. 11-Dec-2021 11:19:19 [INFO] Building jar: /home/bamboo-agent/bamboo-agent/xml-data/build-dir/SDK-SDK-JOB1/tomcat9-maven-plugin/target/openmrs-sdk-tomcat9-maven-plugin-4.4.0-SNAPSHOT.jar
  616. 11-Dec-2021 11:19:19 [INFO]
  617. 11-Dec-2021 11:19:19 [INFO] --- maven-plugin-plugin:3.6.1:addPluginArtifactMetadata (default-addPluginArtifactMetadata) @ openmrs-sdk-tomcat9-maven-plugin ---
  618. 11-Dec-2021 11:19:19 [INFO]
  619. 11-Dec-2021 11:19:19 [INFO] --- maven-install-plugin:2.4:install (default-install) @ openmrs-sdk-tomcat9-maven-plugin ---
  620. 11-Dec-2021 11:19:19 [INFO] Installing /home/bamboo-agent/bamboo-agent/xml-data/build-dir/SDK-SDK-JOB1/tomcat9-maven-plugin/target/openmrs-sdk-tomcat9-maven-plugin-4.4.0-SNAPSHOT.jar to /home/bamboo-agent/.m2/repository/org/openmrs/maven/plugins/openmrs-sdk-tomcat9-maven-plugin/4.4.0-SNAPSHOT/openmrs-sdk-tomcat9-maven-plugin-4.4.0-SNAPSHOT.jar
  621. 11-Dec-2021 11:19:19 [INFO] Installing /home/bamboo-agent/bamboo-agent/xml-data/build-dir/SDK-SDK-JOB1/tomcat9-maven-plugin/pom.xml to /home/bamboo-agent/.m2/repository/org/openmrs/maven/plugins/openmrs-sdk-tomcat9-maven-plugin/4.4.0-SNAPSHOT/openmrs-sdk-tomcat9-maven-plugin-4.4.0-SNAPSHOT.pom
  622. 11-Dec-2021 11:19:19 [INFO]
  623. 11-Dec-2021 11:19:19 [INFO] ------------------------------------------------------------------------
  624. 11-Dec-2021 11:19:19 [INFO] Building OpenMRS SDK Maven Plugin 4.4.0-SNAPSHOT
  625. 11-Dec-2021 11:19:19 [INFO] ------------------------------------------------------------------------
  626. 11-Dec-2021 11:19:20 [INFO] Downloading: http://mavenrepo.openmrs.org/nexus/content/repositories/public/com/google/j2objc/j2objc-annotations/1.1/j2objc-annotations-1.1.pom
  627. 11-Dec-2021 11:19:21 [INFO] Downloaded: http://mavenrepo.openmrs.org/nexus/content/repositories/public/com/google/j2objc/j2objc-annotations/1.1/j2objc-annotations-1.1.pom (3 KB at 9.1 KB/sec)
  628. 11-Dec-2021 11:19:22 [INFO] Downloading: http://mavenrepo.openmrs.org/nexus/content/repositories/public/com/google/j2objc/j2objc-annotations/1.1/j2objc-annotations-1.1.jar
  629. 11-Dec-2021 11:19:22 [INFO] Downloaded: http://mavenrepo.openmrs.org/nexus/content/repositories/public/com/google/j2objc/j2objc-annotations/1.1/j2objc-annotations-1.1.jar (9 KB at 30.2 KB/sec)
  630. 11-Dec-2021 11:19:22 [INFO]
  631. 11-Dec-2021 11:19:22 [INFO] --- maven-clean-plugin:2.5:clean (default-clean) @ openmrs-sdk-maven-plugin ---
  632. 11-Dec-2021 11:19:22 [INFO]
  633. 11-Dec-2021 11:19:22 [INFO] --- maven-resources-plugin:2.6:resources (default-resources) @ openmrs-sdk-maven-plugin ---
  634. 11-Dec-2021 11:19:22 [INFO] Using 'UTF-8' encoding to copy filtered resources.
  635. 11-Dec-2021 11:19:22 [INFO] Copying 1 resource
  636. 11-Dec-2021 11:19:22 [INFO] Copying 1 resource to ${project.parent.basedir}
  637. 11-Dec-2021 11:19:22 [INFO] Copying 25 resources
  638. 11-Dec-2021 11:19:22 [INFO]
  639. 11-Dec-2021 11:19:22 [INFO] --- maven-compiler-plugin:3.8.1:compile (default-compile) @ openmrs-sdk-maven-plugin ---
  640. 11-Dec-2021 11:19:22 [INFO] Changes detected - recompiling the module!
  641. 11-Dec-2021 11:19:22 [INFO] Compiling 39 source files to /home/bamboo-agent/bamboo-agent/xml-data/build-dir/SDK-SDK-JOB1/maven-plugin/target/classes
  642. 11-Dec-2021 11:19:26 [INFO] /home/bamboo-agent/bamboo-agent/xml-data/build-dir/SDK-SDK-JOB1/maven-plugin/src/main/java/org/openmrs/maven/plugins/AbstractTask.java: Some input files use or override a deprecated API.
  643. 11-Dec-2021 11:19:26 [INFO] /home/bamboo-agent/bamboo-agent/xml-data/build-dir/SDK-SDK-JOB1/maven-plugin/src/main/java/org/openmrs/maven/plugins/AbstractTask.java: Recompile with -Xlint:deprecation for details.
  644. 11-Dec-2021 11:19:26 [INFO]
  645. 11-Dec-2021 11:19:26 [INFO] --- maven-plugin-plugin:3.6.1:descriptor (default-descriptor) @ openmrs-sdk-maven-plugin ---
  646. 11-Dec-2021 11:19:26 [INFO] Using 'UTF-8' encoding to read mojo source files.
  647. 11-Dec-2021 11:19:26 [INFO] java-javadoc mojo extractor found 0 mojo descriptor.
  648. 11-Dec-2021 11:19:26 [INFO] bsh mojo extractor found 0 mojo descriptor.
  649. 11-Dec-2021 11:19:26 [INFO] ant mojo extractor found 0 mojo descriptor.
  650. 11-Dec-2021 11:19:30 [INFO] java-annotations mojo extractor found 20 mojo descriptors.
  651. 11-Dec-2021 11:19:30 [INFO]
  652. 11-Dec-2021 11:19:30 [INFO] --- plexus-component-metadata:2.1.0:generate-metadata (process-classes) @ openmrs-sdk-maven-plugin ---
  653. 11-Dec-2021 11:19:30 [INFO]
  654. 11-Dec-2021 11:19:30 [INFO] --- maven-resources-plugin:2.6:testResources (default-testResources) @ openmrs-sdk-maven-plugin ---
  655. 11-Dec-2021 11:19:30 [INFO] Using 'UTF-8' encoding to copy filtered resources.
  656. 11-Dec-2021 11:19:30 [INFO] Copying 3 resources
  657. 11-Dec-2021 11:19:30 [INFO]
  658. 11-Dec-2021 11:19:30 [INFO] --- maven-compiler-plugin:3.8.1:testCompile (default-testCompile) @ openmrs-sdk-maven-plugin ---
  659. 11-Dec-2021 11:19:30 [INFO] Changes detected - recompiling the module!
  660. 11-Dec-2021 11:19:30 [INFO] Compiling 6 source files to /home/bamboo-agent/bamboo-agent/xml-data/build-dir/SDK-SDK-JOB1/maven-plugin/target/test-classes
  661. 11-Dec-2021 11:19:30 [INFO]
  662. 11-Dec-2021 11:19:30 [INFO] --- plexus-component-metadata:2.1.0:generate-test-metadata (process-test-classes) @ openmrs-sdk-maven-plugin ---
  663. 11-Dec-2021 11:19:30 [INFO]
  664. 11-Dec-2021 11:19:30 [INFO] --- maven-surefire-plugin:2.22.2:test (default-test) @ openmrs-sdk-maven-plugin ---
  665. 11-Dec-2021 11:19:30 [INFO]
  666. 11-Dec-2021 11:19:30 [INFO] -------------------------------------------------------
  667. 11-Dec-2021 11:19:30 [INFO] T E S T S
  668. 11-Dec-2021 11:19:30 [INFO] -------------------------------------------------------
  669. 11-Dec-2021 11:19:31 [INFO] Running org.openmrs.maven.plugins.PullRequestTest
  670. 11-Dec-2021 11:19:33 [INFO] Tests run: 6, Failures: 0, Errors: 0, Skipped: 0, Time elapsed: 1.766 s - in org.openmrs.maven.plugins.PullRequestTest
  671. 11-Dec-2021 11:19:33 [INFO] Running org.openmrs.maven.plugins.SetupTest
  672. 11-Dec-2021 11:19:33 [INFO] Tests run: 5, Failures: 0, Errors: 0, Skipped: 0, Time elapsed: 0.039 s - in org.openmrs.maven.plugins.SetupTest
  673. 11-Dec-2021 11:19:33 [INFO] Running org.openmrs.maven.plugins.BuildOwaTest
  674. 11-Dec-2021 11:19:38 Cannot run program "node/node": error=2, No such file or directory
  675. 11-Dec-2021 11:19:38 Cannot run program "node/npm": error=2, No such file or directory
  676. 11-Dec-2021 11:19:39 Cannot run program "node/node": error=2, No such file or directory
  677. 11-Dec-2021 11:19:39 Cannot run program "node/npm": error=2, No such file or directory
  678. 11-Dec-2021 11:19:39 Cannot run program "node/node": error=2, No such file or directory
  679. 11-Dec-2021 11:19:39 Cannot run program "node/npm": error=2, No such file or directory
  680. 11-Dec-2021 11:19:39 Cannot run program "node/node": error=2, No such file or directory
  681. 11-Dec-2021 11:19:39 Cannot run program "node/npm": error=2, No such file or directory
  682. 11-Dec-2021 11:19:40 Cannot run program "node/node": error=2, No such file or directory
  683. 11-Dec-2021 11:19:40 Cannot run program "node/npm": error=2, No such file or directory
  684. 11-Dec-2021 11:19:40 [INFO] Tests run: 9, Failures: 0, Errors: 0, Skipped: 0, Time elapsed: 7.134 s - in org.openmrs.maven.plugins.BuildOwaTest
  685. 11-Dec-2021 11:19:40 [INFO] Running org.openmrs.maven.plugins.RunTest
  686. 11-Dec-2021 11:19:40 [INFO] Tests run: 11, Failures: 0, Errors: 0, Skipped: 0, Time elapsed: 0.016 s - in org.openmrs.maven.plugins.RunTest
  687. 11-Dec-2021 11:19:40 [INFO] Running org.openmrs.maven.plugins.utility.XmlHelperTest
  688. 11-Dec-2021 11:19:40 [INFO] Tests run: 2, Failures: 0, Errors: 0, Skipped: 0, Time elapsed: 0.024 s - in org.openmrs.maven.plugins.utility.XmlHelperTest
  689. 11-Dec-2021 11:19:40 [INFO] Running org.openmrs.maven.plugins.utility.SpaInstallerTest
  690. 11-Dec-2021 11:19:40 [INFO] Tests run: 2, Failures: 0, Errors: 0, Skipped: 0, Time elapsed: 0.275 s - in org.openmrs.maven.plugins.utility.SpaInstallerTest
  691. 11-Dec-2021 11:19:40 [INFO]
  692. 11-Dec-2021 11:19:40 [INFO] Results:
  693. 11-Dec-2021 11:19:40 [INFO]
  694. 11-Dec-2021 11:19:40 [INFO] Tests run: 35, Failures: 0, Errors: 0, Skipped: 0
  695. 11-Dec-2021 11:19:40 [INFO]
  696. 11-Dec-2021 11:19:40 [INFO]
  697. 11-Dec-2021 11:19:40 [INFO] --- maven-jar-plugin:2.4:jar (default-jar) @ openmrs-sdk-maven-plugin ---
  698. 11-Dec-2021 11:19:40 [INFO] Building jar: /home/bamboo-agent/bamboo-agent/xml-data/build-dir/SDK-SDK-JOB1/maven-plugin/target/openmrs-sdk-maven-plugin-4.4.0-SNAPSHOT.jar
  699. 11-Dec-2021 11:19:41 [INFO]
  700. 11-Dec-2021 11:19:41 [INFO] --- maven-plugin-plugin:3.6.1:addPluginArtifactMetadata (default-addPluginArtifactMetadata) @ openmrs-sdk-maven-plugin ---
  701. 11-Dec-2021 11:19:41 [INFO]
  702. 11-Dec-2021 11:19:41 [INFO] --- maven-install-plugin:2.4:install (default-install) @ openmrs-sdk-maven-plugin ---
  703. 11-Dec-2021 11:19:41 [INFO] Installing /home/bamboo-agent/bamboo-agent/xml-data/build-dir/SDK-SDK-JOB1/maven-plugin/target/openmrs-sdk-maven-plugin-4.4.0-SNAPSHOT.jar to /home/bamboo-agent/.m2/repository/org/openmrs/maven/plugins/openmrs-sdk-maven-plugin/4.4.0-SNAPSHOT/openmrs-sdk-maven-plugin-4.4.0-SNAPSHOT.jar
  704. 11-Dec-2021 11:19:41 [INFO] Installing /home/bamboo-agent/bamboo-agent/xml-data/build-dir/SDK-SDK-JOB1/maven-plugin/pom.xml to /home/bamboo-agent/.m2/repository/org/openmrs/maven/plugins/openmrs-sdk-maven-plugin/4.4.0-SNAPSHOT/openmrs-sdk-maven-plugin-4.4.0-SNAPSHOT.pom
  705. 11-Dec-2021 11:19:41 [INFO]
  706. 11-Dec-2021 11:19:41 [INFO] ------------------------------------------------------------------------
  707. 11-Dec-2021 11:19:41 [INFO] Building OpenMRS SDK Integration Tests 4.4.0-SNAPSHOT
  708. 11-Dec-2021 11:19:41 [INFO] ------------------------------------------------------------------------
  709. 11-Dec-2021 11:19:41 [INFO]
  710. 11-Dec-2021 11:19:41 [INFO] --- maven-clean-plugin:2.5:clean (default-clean) @ openmrs-sdk-integration-tests ---
  711. 11-Dec-2021 11:19:41 [INFO]
  712. 11-Dec-2021 11:19:41 [INFO] --- maven-resources-plugin:2.6:resources (default-resources) @ openmrs-sdk-integration-tests ---
  713. 11-Dec-2021 11:19:41 [INFO] Using 'UTF-8' encoding to copy filtered resources.
  714. 11-Dec-2021 11:19:41 [INFO] skip non existing resourceDirectory /home/bamboo-agent/bamboo-agent/xml-data/build-dir/SDK-SDK-JOB1/integration-tests/src/main/resources
  715. 11-Dec-2021 11:19:41 [INFO]
  716. 11-Dec-2021 11:19:41 [INFO] --- maven-compiler-plugin:3.8.1:compile (default-compile) @ openmrs-sdk-integration-tests ---
  717. 11-Dec-2021 11:19:41 [INFO] No sources to compile
  718. 11-Dec-2021 11:19:41 [INFO]
  719. 11-Dec-2021 11:19:41 [INFO] --- maven-resources-plugin:2.6:testResources (default-testResources) @ openmrs-sdk-integration-tests ---
  720. 11-Dec-2021 11:19:41 [INFO] Using 'UTF-8' encoding to copy filtered resources.
  721. 11-Dec-2021 11:19:41 [INFO] Copying 36 resources
  722. 11-Dec-2021 11:19:41 [INFO]
  723. 11-Dec-2021 11:19:41 [INFO] --- maven-compiler-plugin:3.8.1:testCompile (default-testCompile) @ openmrs-sdk-integration-tests ---
  724. 11-Dec-2021 11:19:41 [INFO] Changes detected - recompiling the module!
  725. 11-Dec-2021 11:19:41 [INFO] Compiling 11 source files to /home/bamboo-agent/bamboo-agent/xml-data/build-dir/SDK-SDK-JOB1/integration-tests/target/test-classes
  726. 11-Dec-2021 11:19:41 [INFO] /home/bamboo-agent/bamboo-agent/xml-data/build-dir/SDK-SDK-JOB1/integration-tests/src/test/java/org/openmrs/maven/plugins/AbstractSdkIntegrationTest.java: /home/bamboo-agent/bamboo-agent/xml-data/build-dir/SDK-SDK-JOB1/integration-tests/src/test/java/org/openmrs/maven/plugins/AbstractSdkIntegrationTest.java uses or overrides a deprecated API.
  727. 11-Dec-2021 11:19:41 [INFO] /home/bamboo-agent/bamboo-agent/xml-data/build-dir/SDK-SDK-JOB1/integration-tests/src/test/java/org/openmrs/maven/plugins/AbstractSdkIntegrationTest.java: Recompile with -Xlint:deprecation for details.
  728. 11-Dec-2021 11:19:41 [INFO]
  729. 11-Dec-2021 11:19:41 [INFO] --- maven-surefire-plugin:2.22.2:test (default-test) @ openmrs-sdk-integration-tests ---
  730. 11-Dec-2021 11:19:41 [INFO]
  731. 11-Dec-2021 11:19:41 [INFO] -------------------------------------------------------
  732. 11-Dec-2021 11:19:41 [INFO] T E S T S
  733. 11-Dec-2021 11:19:41 [INFO] -------------------------------------------------------
  734. 11-Dec-2021 11:19:42 [INFO] Running org.openmrs.maven.plugins.ResetIntegrationTest
  735. 11-Dec-2021 11:20:01 [INFO] Tests run: 1, Failures: 0, Errors: 0, Skipped: 0, Time elapsed: 19.267 s - in org.openmrs.maven.plugins.ResetIntegrationTest
  736. 11-Dec-2021 11:20:01 [INFO] Running org.openmrs.maven.plugins.CloneIntegrationTest
  737. 11-Dec-2021 11:20:08 [INFO] Tests run: 1, Failures: 0, Errors: 0, Skipped: 0, Time elapsed: 6.778 s - in org.openmrs.maven.plugins.CloneIntegrationTest
  738. 11-Dec-2021 11:20:08 [INFO] Running org.openmrs.maven.plugins.DeployIntegrationTest
  739. 11-Dec-2021 11:30:18 [ERROR] Tests run: 8, Failures: 1, Errors: 0, Skipped: 0, Time elapsed: 610.615 s <<< FAILURE! - in org.openmrs.maven.plugins.DeployIntegrationTest
  740. 11-Dec-2021 11:30:19 [ERROR] deploy_shouldUpgradeDistroFromDistroProperties(org.openmrs.maven.plugins.DeployIntegrationTest) Time elapsed: 499.1 s <<< FAILURE!
  741. 11-Dec-2021 11:30:19 java.lang.AssertionError:
  742. 11-Dec-2021 11:30:19 Expected /home/bamboo-agent/bamboo-agent/xml-data/build-dir/SDK-SDK-JOB1/integration-tests/target/test-classes/integration-test/5030c8f0-d971-4a44-b218-7d8da0515843/frontend/index.html to be an existing file or directory
  743. 11-Dec-2021 11:30:19 Expected: an existing file or directory
  744. 11-Dec-2021 11:30:19 but: does not exist
  745. 11-Dec-2021 11:30:19 at org.openmrs.maven.plugins.DeployIntegrationTest.deploy_shouldUpgradeDistroFromDistroProperties(DeployIntegrationTest.java:124)
  746. 11-Dec-2021 11:30:19
  747. 11-Dec-2021 11:30:19 [INFO] Running org.openmrs.maven.plugins.BuildIntegrationTest
  748. 11-Dec-2021 11:32:11 [INFO] Tests run: 3, Failures: 0, Errors: 0, Skipped: 0, Time elapsed: 112.682 s - in org.openmrs.maven.plugins.BuildIntegrationTest
  749. 11-Dec-2021 11:32:11 [INFO] Running org.openmrs.maven.plugins.FetchIntegrationTest
  750. 11-Dec-2021 11:32:26 [INFO] Tests run: 3, Failures: 0, Errors: 0, Skipped: 0, Time elapsed: 14.368 s - in org.openmrs.maven.plugins.FetchIntegrationTest
  751. 11-Dec-2021 11:32:26 [INFO] Running org.openmrs.maven.plugins.BuildDistroIntegrationTest
  752. 11-Dec-2021 11:41:59 [ERROR] Tests run: 3, Failures: 1, Errors: 0, Skipped: 0, Time elapsed: 573.811 s <<< FAILURE! - in org.openmrs.maven.plugins.BuildDistroIntegrationTest
  753. 11-Dec-2021 11:41:59 [ERROR] testBuildDistroFromDistroFile(org.openmrs.maven.plugins.BuildDistroIntegrationTest) Time elapsed: 534.79 s <<< FAILURE!
  754. 11-Dec-2021 11:41:59 java.lang.AssertionError:
  755. 11-Dec-2021 11:41:59 Expected /home/bamboo-agent/bamboo-agent/xml-data/build-dir/SDK-SDK-JOB1/integration-tests/target/test-classes/integration-test/target/web/frontend/index.html to be an existing file or directory
  756. 11-Dec-2021 11:41:59 Expected: an existing file or directory
  757. 11-Dec-2021 11:41:59 but: does not exist
  758. 11-Dec-2021 11:41:59 at org.openmrs.maven.plugins.BuildDistroIntegrationTest.testBuildDistroFromDistroFile(BuildDistroIntegrationTest.java:21)
  759. 11-Dec-2021 11:41:59
  760. 11-Dec-2021 11:41:59 [INFO] Running org.openmrs.maven.plugins.CreateProjectIntegrationTest
  761. 11-Dec-2021 11:42:21 [INFO] Tests run: 3, Failures: 0, Errors: 0, Skipped: 0, Time elapsed: 21.508 s - in org.openmrs.maven.plugins.CreateProjectIntegrationTest
  762. 11-Dec-2021 11:42:21 [INFO] Running org.openmrs.maven.plugins.PullIntegrationTest
  763. 11-Dec-2021 11:43:23 [INFO] Tests run: 4, Failures: 0, Errors: 0, Skipped: 0, Time elapsed: 62.245 s - in org.openmrs.maven.plugins.PullIntegrationTest
  764. 11-Dec-2021 11:43:23 [INFO] Running org.openmrs.maven.plugins.SetupIntegrationTest
  765. 11-Dec-2021 11:55:34 [ERROR] Tests run: 12, Failures: 1, Errors: 1, Skipped: 0, Time elapsed: 730.937 s <<< FAILURE! - in org.openmrs.maven.plugins.SetupIntegrationTest
  766. 11-Dec-2021 11:55:34 [ERROR] setup_shouldInstallServerFromDistroPropertiesDir(org.openmrs.maven.plugins.SetupIntegrationTest) Time elapsed: 494.357 s <<< FAILURE!
  767. 11-Dec-2021 11:55:34 java.lang.AssertionError:
  768. 11-Dec-2021 11:55:34 Expected /home/bamboo-agent/bamboo-agent/xml-data/build-dir/SDK-SDK-JOB1/integration-tests/target/test-classes/integration-test/e775f7a0-f1f8-4e40-9cb0-d39e99368b84/frontend/index.html to be an existing file or directory
  769. 11-Dec-2021 11:55:34 Expected: an existing file or directory
  770. 11-Dec-2021 11:55:34 but: does not exist
  771. 11-Dec-2021 11:55:34 at org.openmrs.maven.plugins.SetupIntegrationTest.setup_shouldInstallServerFromDistroPropertiesDir(SetupIntegrationTest.java:165)
  772. 11-Dec-2021 11:55:34
  773. 11-Dec-2021 11:55:34 [ERROR] setup_shouldInstallServerFromGivenDistroProperties(org.openmrs.maven.plugins.SetupIntegrationTest) Time elapsed: 123.99 s <<< ERROR!
  774. 11-Dec-2021 11:55:34 org.apache.maven.it.VerificationException:
  775. 11-Dec-2021 11:55:34 Exit code was non-zero: 1; command line and log =
  776. 11-Dec-2021 11:55:34 /usr/share/apache-maven-3.3.9/bin/mvn -DopenMRSPath=/home/bamboo-agent/bamboo-agent/xml-data/build-dir/SDK-SDK-JOB1/integration-tests/target/test-classes/integration-test -Ddistro=/home/bamboo-agent/bamboo-agent/xml-data/build-dir/SDK-SDK-JOB1/integration-tests/target/test-classes/integration-test/openmrs-distro.properties -Ddebug=1044 -DdbDriver=mysql -DdbUser=mysql -DdbPassword=mysql -DdbUri=@DBNAME@ -DdbSql=null -DbatchAnswers=42119b03-cfdd-4774-b247-3eda16c0e42a,nameValue,/usr/lib/jvm/java-8-openjdk-amd64/jre,8080 -DtestMode=true -e --batch-mode -Dmaven.repo.local=/home/bamboo-agent/.m2/repository org.openmrs.maven.plugins:openmrs-sdk-maven-plugin:4.4.0-SNAPSHOT:setup
  777. 11-Dec-2021 11:55:34 [INFO] Error stacktraces are turned on.
  778. 11-Dec-2021 11:55:34 [INFO] Scanning for projects...
  779. 11-Dec-2021 11:55:34 [INFO]
  780. 11-Dec-2021 11:55:34 [INFO] ------------------------------------------------------------------------
  781. 11-Dec-2021 11:55:34 [INFO] Building owa 1.4
  782. 11-Dec-2021 11:55:34 [INFO] ------------------------------------------------------------------------
  783. 11-Dec-2021 11:55:34 [INFO]
  784. 11-Dec-2021 11:55:34 [INFO] --- openmrs-sdk-maven-plugin:4.4.0-SNAPSHOT:setup (default-cli) @ owa ---
  785. 11-Dec-2021 11:55:34 Dec 11, 2021 11:52:28 AM org.jline.utils.Log logr
  786. 11-Dec-2021 11:55:34 WARNING: Unable to create a system terminal, creating a dumb terminal (enable debug logging for more information)
  787. 11-Dec-2021 11:55:34
  788. 11-Dec-2021 11:55:34 Setting up a new server...
  789. 11-Dec-2021 11:55:34 [INFO] Configured Artifact: org.openmrs.web:openmrs-webapp:1.11.5:war
  790. 11-Dec-2021 11:55:34 [INFO] Copying openmrs-webapp-1.11.5.war to /home/bamboo-agent/bamboo-agent/xml-data/build-dir/SDK-SDK-JOB1/integration-tests/target/test-classes/integration-test/42119b03-cfdd-4774-b247-3eda16c0e42a/openmrs-1.11.5.war
  791. 11-Dec-2021 11:55:34 [INFO] Configured Artifact: org.openmrs.module:owa-omod:1.4:jar
  792. 11-Dec-2021 11:55:34 [WARNING] The POM for org.openmrs.module:owa-omod:jar:1.4 is invalid, transitive dependencies (if any) will not be available, enable debug logging for more details
  793. 11-Dec-2021 11:55:34 [INFO] Configured Artifact: org.openmrs.module:uicommons-omod:1.7:jar
  794. 11-Dec-2021 11:55:34 [INFO] Downloading: http://mavenrepo.openmrs.org/nexus/content/repositories/public/org/openmrs/distro/referenceapplication/maven-metadata.xml
  795. 11-Dec-2021 11:55:34 [INFO] Downloaded: http://mavenrepo.openmrs.org/nexus/content/repositories/public/org/openmrs/distro/referenceapplication/maven-metadata.xml (33 KB at 31.5 KB/sec)
  796. 11-Dec-2021 11:55:34 [WARNING] The POM for org.openmrs.module:uicommons-omod:jar:1.7 is invalid, transitive dependencies (if any) will not be available, enable debug logging for more details
  797. 11-Dec-2021 11:55:34 [INFO] Configured Artifact: org.openmrs.module:uiframework-omod:3.6:jar
  798. 11-Dec-2021 11:55:34 [INFO] Copying owa-omod-1.4.jar to /home/bamboo-agent/bamboo-agent/xml-data/build-dir/SDK-SDK-JOB1/integration-tests/target/test-classes/integration-test/42119b03-cfdd-4774-b247-3eda16c0e42a/modules/owa-1.4.omod
  799. 11-Dec-2021 11:55:34 [INFO] Copying uicommons-omod-1.7.jar to /home/bamboo-agent/bamboo-agent/xml-data/build-dir/SDK-SDK-JOB1/integration-tests/target/test-classes/integration-test/42119b03-cfdd-4774-b247-3eda16c0e42a/modules/uicommons-1.7.omod
  800. 11-Dec-2021 11:55:34 [INFO] Copying uiframework-omod-3.6.jar to /home/bamboo-agent/bamboo-agent/xml-data/build-dir/SDK-SDK-JOB1/integration-tests/target/test-classes/integration-test/42119b03-cfdd-4774-b247-3eda16c0e42a/modules/uiframework-3.6.omod
  801. 11-Dec-2021 11:55:34 [INFO] Installing node version v16.2.0
  802. 11-Dec-2021 11:55:34 [INFO] Unpacking /home/bamboo-agent/.m2/repository/com/github/eirslett/node/16.2.0/node-16.2.0-linux-x64.tar.gz into /home/bamboo-agent/bamboo-agent/xml-data/build-dir/SDK-SDK-JOB1/integration-tests/target/test-classes/integration-test/target/node/node/tmp
  803. 11-Dec-2021 11:55:34 [INFO] Copying node binary from /home/bamboo-agent/bamboo-agent/xml-data/build-dir/SDK-SDK-JOB1/integration-tests/target/test-classes/integration-test/target/node/node/tmp/node-v16.2.0-linux-x64/bin/node to /home/bamboo-agent/bamboo-agent/xml-data/build-dir/SDK-SDK-JOB1/integration-tests/target/test-classes/integration-test/target/node/node/node
  804. 11-Dec-2021 11:55:34 [INFO] Installed node locally.
  805. 11-Dec-2021 11:55:34 [INFO] Installing npm version 7.13.0
  806. 11-Dec-2021 11:55:34 [INFO] Unpacking /home/bamboo-agent/.m2/repository/com/github/eirslett/npm/7.13.0/npm-7.13.0.tar.gz into /home/bamboo-agent/bamboo-agent/xml-data/build-dir/SDK-SDK-JOB1/integration-tests/target/test-classes/integration-test/target/node/node/node_modules
  807. 11-Dec-2021 11:55:34 [INFO] Installed npm locally.
  808. 11-Dec-2021 11:55:34 [INFO] npm not inheriting proxy config from Maven
  809. 11-Dec-2021 11:55:34 [INFO] Running 'npm --cache=/home/bamboo-agent/bamboo-agent/xml-data/build-dir/SDK-SDK-JOB1/integration-tests/target/test-classes/integration-test/target/npm-cache exec -- openmrs@3.1.12 --version' in /home/bamboo-agent/bamboo-agent/xml-data/build-dir/SDK-SDK-JOB1/integration-tests/target/test-classes/integration-test
  810. 11-Dec-2021 11:55:34 [INFO] npm WARN exec The following package was not found and will be installed: openmrs@3.1.12
  811. 11-Dec-2021 11:55:34 [INFO] npm WARN ERESOLVE overriding peer dependency
  812. 11-Dec-2021 11:55:34 [INFO] npm WARN Found: webpack@5.65.0
  813. 11-Dec-2021 11:55:34 [INFO] npm WARN node_modules/webpack
  814. 11-Dec-2021 11:55:34 [INFO] npm WARN webpack@"^5.36.2" from openmrs@3.1.12
  815. 11-Dec-2021 11:55:34 [INFO] npm WARN node_modules/openmrs
  816. 11-Dec-2021 11:55:34 [INFO] npm WARN openmrs@"3.1.12" from the root project
  817. 11-Dec-2021 11:55:34 [INFO] npm WARN 4 more (babel-loader, clean-webpack-plugin, ...)
  818. 11-Dec-2021 11:55:34 [INFO] npm WARN
  819. 11-Dec-2021 11:55:34 [INFO] npm WARN Could not resolve dependency:
  820. 11-Dec-2021 11:55:34 [INFO] npm WARN peer webpack@"^4.0.0" from file-loader@4.3.0
  821. 11-Dec-2021 11:55:34 [INFO] npm WARN node_modules/file-loader
  822. 11-Dec-2021 11:55:34 [INFO] npm WARN file-loader@"^4.2.0" from openmrs@3.1.12
  823. 11-Dec-2021 11:55:34 [INFO] npm WARN node_modules/openmrs
  824. 11-Dec-2021 11:55:34 [INFO] npm WARN deprecated har-validator@5.1.5: this library is no longer supported
  825. 11-Dec-2021 11:55:34 [INFO] npm WARN deprecated querystring@0.2.0: The querystring API is considered Legacy. new code should use the URLSearchParams API instead.
  826. 11-Dec-2021 11:55:34 [INFO] npm WARN deprecated intl-messageformat-parser@1.4.0: We've written a new parser that's 6x faster and is backwards compatible. Please use @formatjs/icu-messageformat-parser
  827. 11-Dec-2021 11:55:34 [INFO] npm WARN deprecated uuid@3.4.0: Please upgrade to version 7 or higher. Older versions may use Math.random() in certain circumstances, which is known to be problematic. See https://v8.dev/blog/math-random for details.
  828. 11-Dec-2021 11:55:34 [INFO] npm WARN deprecated request@2.88.2: request has been deprecated, see https://github.com/request/request/issues/3142
  829. 11-Dec-2021 11:55:34 [INFO] npm WARN deprecated svgo@1.3.2: This SVGO version is no longer supported. Upgrade to v2.x.x.
  830. 11-Dec-2021 11:55:34 [INFO] 3.1.12
  831. 11-Dec-2021 11:55:34 [INFO] npm notice
  832. 11-Dec-2021 11:55:34 [INFO] npm notice New major version of npm available! 7.13.0 -> 8.3.0
  833. 11-Dec-2021 11:55:34 [INFO] npm notice Changelog: <https://github.com/npm/cli/releases/tag/v8.3.0>
  834. 11-Dec-2021 11:55:34 [INFO] npm notice Run `npm install -g npm@8.3.0` to update!
  835. 11-Dec-2021 11:55:34 [INFO] npm notice
  836. 11-Dec-2021 11:55:34 [INFO] npm not inheriting proxy config from Maven
  837. 11-Dec-2021 11:55:34 [INFO] Running 'npm --cache=/home/bamboo-agent/bamboo-agent/xml-data/build-dir/SDK-SDK-JOB1/integration-tests/target/test-classes/integration-test/target/npm-cache exec -- openmrs@3.1.12 build --target /home/bamboo-agent/bamboo-agent/xml-data/build-dir/SDK-SDK-JOB1/integration-tests/target/test-classes/integration-test/42119b03-cfdd-4774-b247-3eda16c0e42a/frontend --build-config /home/bamboo-agent/bamboo-agent/xml-data/build-dir/SDK-SDK-JOB1/integration-tests/target/test-classes/integration-test/42119b03-cfdd-4774-b247-3eda16c0e42a/spa-build-config.json' in /home/bamboo-agent/bamboo-agent/xml-data/build-dir/SDK-SDK-JOB1/integration-tests/target/test-classes/integration-test
  838. 11-Dec-2021 11:55:34 [INFO] [openmrs] Cannot find module 'webpack-pwa-manifest'
  839. 11-Dec-2021 11:55:34 [INFO] Require stack:
  840. 11-Dec-2021 11:55:34 [INFO] - /home/bamboo-agent/bamboo-agent/xml-data/build-dir/SDK-SDK-JOB1/integration-tests/target/test-classes/integration-test/target/npm-cache/_npx/9cdca6a487c2f3b9/node_modules/@openmrs/esm-app-shell/webpack.config.js
  841. 11-Dec-2021 11:55:34 [INFO] - /home/bamboo-agent/bamboo-agent/xml-data/build-dir/SDK-SDK-JOB1/integration-tests/target/test-classes/integration-test/target/npm-cache/_npx/9cdca6a487c2f3b9/node_modules/openmrs/dist/utils/config.js
  842. 11-Dec-2021 11:55:34 [INFO] - /home/bamboo-agent/bamboo-agent/xml-data/build-dir/SDK-SDK-JOB1/integration-tests/target/test-classes/integration-test/target/npm-cache/_npx/9cdca6a487c2f3b9/node_modules/openmrs/dist/utils/index.js
  843. 11-Dec-2021 11:55:34 [INFO] - /home/bamboo-agent/bamboo-agent/xml-data/build-dir/SDK-SDK-JOB1/integration-tests/target/test-classes/integration-test/target/npm-cache/_npx/9cdca6a487c2f3b9/node_modules/openmrs/dist/commands/assemble.js
  844. 11-Dec-2021 11:55:34 [INFO] - /home/bamboo-agent/bamboo-agent/xml-data/build-dir/SDK-SDK-JOB1/integration-tests/target/test-classes/integration-test/target/npm-cache/_npx/9cdca6a487c2f3b9/node_modules/openmrs/dist/commands/index.js
  845. 11-Dec-2021 11:55:34 [INFO] - /home/bamboo-agent/bamboo-agent/xml-data/build-dir/SDK-SDK-JOB1/integration-tests/target/test-classes/integration-test/target/npm-cache/_npx/9cdca6a487c2f3b9/node_modules/openmrs/dist/runner.js
  846. 11-Dec-2021 11:55:34 [INFO] ------------------------------------------------------------------------
  847. 11-Dec-2021 11:55:34 [INFO] BUILD FAILURE
  848. 11-Dec-2021 11:55:34 [INFO] ------------------------------------------------------------------------
  849. 11-Dec-2021 11:55:34 [INFO] Total time: 02:02 min
  850. 11-Dec-2021 11:55:34 [INFO] Finished at: 2021-12-11T11:54:28+00:00
  851. 11-Dec-2021 11:55:34 [INFO] Final Memory: 25M/320M
  852. 11-Dec-2021 11:55:34 [INFO] ------------------------------------------------------------------------
  853. 11-Dec-2021 11:55:34 [ERROR] Failed to execute goal org.openmrs.maven.plugins:openmrs-sdk-maven-plugin:4.4.0-SNAPSHOT:setup (default-cli) on project owa: Failed to setup server: Unable to execute mojo: Failed to run task: 'npm --cache=/home/bamboo-agent/bamboo-agent/xml-data/build-dir/SDK-SDK-JOB1/integration-tests/target/test-classes/integration-test/target/npm-cache exec -- openmrs@3.1.12 build --target /home/bamboo-agent/bamboo-agent/xml-data/build-dir/SDK-SDK-JOB1/integration-tests/target/test-classes/integration-test/42119b03-cfdd-4774-b247-3eda16c0e42a/frontend --build-config /home/bamboo-agent/bamboo-agent/xml-data/build-dir/SDK-SDK-JOB1/integration-tests/target/test-classes/integration-test/42119b03-cfdd-4774-b247-3eda16c0e42a/spa-build-config.json' failed. org.apache.commons.exec.ExecuteException: Process exited with an error: 1 (Exit value: 1) -> [Help 1]
  854. 11-Dec-2021 11:55:34 org.apache.maven.lifecycle.LifecycleExecutionException: Failed to execute goal org.openmrs.maven.plugins:openmrs-sdk-maven-plugin:4.4.0-SNAPSHOT:setup (default-cli) on project owa: Failed to setup server
  855. 11-Dec-2021 11:55:34 at org.apache.maven.lifecycle.internal.MojoExecutor.execute(MojoExecutor.java:212)
  856. 11-Dec-2021 11:55:34 at org.apache.maven.lifecycle.internal.MojoExecutor.execute(MojoExecutor.java:153)
  857. 11-Dec-2021 11:55:34 at org.apache.maven.lifecycle.internal.MojoExecutor.execute(MojoExecutor.java:145)
  858. 11-Dec-2021 11:55:34 at org.apache.maven.lifecycle.internal.LifecycleModuleBuilder.buildProject(LifecycleModuleBuilder.java:116)
  859. 11-Dec-2021 11:55:34 at org.apache.maven.lifecycle.internal.LifecycleModuleBuilder.buildProject(LifecycleModuleBuilder.java:80)
  860. 11-Dec-2021 11:55:34 at org.apache.maven.lifecycle.internal.builder.singlethreaded.SingleThreadedBuilder.build(SingleThreadedBuilder.java:51)
  861. 11-Dec-2021 11:55:34 at org.apache.maven.lifecycle.internal.LifecycleStarter.execute(LifecycleStarter.java:128)
  862. 11-Dec-2021 11:55:34 at org.apache.maven.DefaultMaven.doExecute(DefaultMaven.java:307)
  863. 11-Dec-2021 11:55:34 at org.apache.maven.DefaultMaven.doExecute(DefaultMaven.java:193)
  864. 11-Dec-2021 11:55:34 at org.apache.maven.DefaultMaven.execute(DefaultMaven.java:106)
  865. 11-Dec-2021 11:55:34 at org.apache.maven.cli.MavenCli.execute(MavenCli.java:863)
  866. 11-Dec-2021 11:55:34 at org.apache.maven.cli.MavenCli.doMain(MavenCli.java:288)
  867. 11-Dec-2021 11:55:34 at org.apache.maven.cli.MavenCli.main(MavenCli.java:199)
  868. 11-Dec-2021 11:55:34 at sun.reflect.NativeMethodAccessorImpl.invoke0(Native Method)
  869. 11-Dec-2021 11:55:34 at sun.reflect.NativeMethodAccessorImpl.invoke(NativeMethodAccessorImpl.java:62)
  870. 11-Dec-2021 11:55:34 at sun.reflect.DelegatingMethodAccessorImpl.invoke(DelegatingMethodAccessorImpl.java:43)
  871. 11-Dec-2021 11:55:34 at java.lang.reflect.Method.invoke(Method.java:498)
  872. 11-Dec-2021 11:55:34 at org.codehaus.plexus.classworlds.launcher.Launcher.launchEnhanced(Launcher.java:289)
  873. 11-Dec-2021 11:55:34 at org.codehaus.plexus.classworlds.launcher.Launcher.launch(Launcher.java:229)
  874. 11-Dec-2021 11:55:34 at org.codehaus.plexus.classworlds.launcher.Launcher.mainWithExitCode(Launcher.java:415)
  875. 11-Dec-2021 11:55:34 at org.codehaus.plexus.classworlds.launcher.Launcher.main(Launcher.java:356)
  876. 11-Dec-2021 11:55:34 Caused by: org.apache.maven.plugin.MojoExecutionException: Failed to setup server
  877. 11-Dec-2021 11:55:34 at org.openmrs.maven.plugins.Setup.executeTask(Setup.java:601)
  878. 11-Dec-2021 11:55:34 at org.openmrs.maven.plugins.AbstractTask.execute(AbstractTask.java:201)
  879. 11-Dec-2021 11:55:34 at org.apache.maven.plugin.DefaultBuildPluginManager.executeMojo(DefaultBuildPluginManager.java:134)
  880. 11-Dec-2021 11:55:34 at org.apache.maven.lifecycle.internal.MojoExecutor.execute(MojoExecutor.java:207)
  881. 11-Dec-2021 11:55:34 ... 20 more
  882. 11-Dec-2021 11:55:34 Caused by: org.apache.maven.plugin.MojoExecutionException: Unable to execute mojo
  883. 11-Dec-2021 11:55:34 at org.twdata.maven.mojoexecutor.MojoExecutor.executeMojo(MojoExecutor.java:122)
  884. 11-Dec-2021 11:55:34 at org.openmrs.maven.plugins.utility.NodeHelper.runFrontendMavenPlugin(NodeHelper.java:88)
  885. 11-Dec-2021 11:55:34 at org.openmrs.maven.plugins.utility.NodeHelper.runNpx(NodeHelper.java:77)
  886. 11-Dec-2021 11:55:34 at org.openmrs.maven.plugins.utility.SpaInstaller.installFromDistroProperties(SpaInstaller.java:71)
  887. 11-Dec-2021 11:55:34 at org.openmrs.maven.plugins.Setup.setup(Setup.java:247)
  888. 11-Dec-2021 11:55:34 at org.openmrs.maven.plugins.Setup.executeTask(Setup.java:597)
  889. 11-Dec-2021 11:55:34 ... 23 more
  890. 11-Dec-2021 11:55:34 Caused by: org.apache.maven.plugin.MojoFailureException: Failed to run task
  891. 11-Dec-2021 11:55:34 at com.github.eirslett.maven.plugins.frontend.mojo.AbstractFrontendMojo.execute(AbstractFrontendMojo.java:100)
  892. 11-Dec-2021 11:55:34 at org.apache.maven.plugin.DefaultBuildPluginManager.executeMojo(DefaultBuildPluginManager.java:134)
  893. 11-Dec-2021 11:55:34 at org.twdata.maven.mojoexecutor.MojoExecutor.executeMojo(MojoExecutor.java:120)
  894. 11-Dec-2021 11:55:34 ... 28 more
  895. 11-Dec-2021 11:55:34 Caused by: com.github.eirslett.maven.plugins.frontend.lib.TaskRunnerException: 'npm --cache=/home/bamboo-agent/bamboo-agent/xml-data/build-dir/SDK-SDK-JOB1/integration-tests/target/test-classes/integration-test/target/npm-cache exec -- openmrs@3.1.12 build --target /home/bamboo-agent/bamboo-agent/xml-data/build-dir/SDK-SDK-JOB1/integration-tests/target/test-classes/integration-test/42119b03-cfdd-4774-b247-3eda16c0e42a/frontend --build-config /home/bamboo-agent/bamboo-agent/xml-data/build-dir/SDK-SDK-JOB1/integration-tests/target/test-classes/integration-test/42119b03-cfdd-4774-b247-3eda16c0e42a/spa-build-config.json' failed.
  896. 11-Dec-2021 11:55:34 at com.github.eirslett.maven.plugins.frontend.lib.NodeTaskExecutor.execute(NodeTaskExecutor.java:63)
  897. 11-Dec-2021 11:55:34 at com.github.eirslett.maven.plugins.frontend.mojo.NpmMojo.execute(NpmMojo.java:62)
  898. 11-Dec-2021 11:55:34 at com.github.eirslett.maven.plugins.frontend.mojo.AbstractFrontendMojo.execute(AbstractFrontendMojo.java:94)
  899. 11-Dec-2021 11:55:34 ... 30 more
  900. 11-Dec-2021 11:55:34 Caused by: com.github.eirslett.maven.plugins.frontend.lib.ProcessExecutionException: org.apache.commons.exec.ExecuteException: Process exited with an error: 1 (Exit value: 1)
  901. 11-Dec-2021 11:55:34 at com.github.eirslett.maven.plugins.frontend.lib.ProcessExecutor.execute(ProcessExecutor.java:82)
  902. 11-Dec-2021 11:55:34 at com.github.eirslett.maven.plugins.frontend.lib.ProcessExecutor.executeAndRedirectOutput(ProcessExecutor.java:64)
  903. 11-Dec-2021 11:55:34 at com.github.eirslett.maven.plugins.frontend.lib.NodeExecutor.executeAndRedirectOutput(NodeExecutor.java:29)
  904. 11-Dec-2021 11:55:34 at com.github.eirslett.maven.plugins.frontend.lib.NodeTaskExecutor.execute(NodeTaskExecutor.java:58)
  905. 11-Dec-2021 11:55:34 ... 32 more
  906. 11-Dec-2021 11:55:34 Caused by: org.apache.commons.exec.ExecuteException: Process exited with an error: 1 (Exit value: 1)
  907. 11-Dec-2021 11:55:34 at org.apache.commons.exec.DefaultExecutor.executeInternal(DefaultExecutor.java:404)
  908. 11-Dec-2021 11:55:34 at org.apache.commons.exec.DefaultExecutor.execute(DefaultExecutor.java:166)
  909. 11-Dec-2021 11:55:34 at com.github.eirslett.maven.plugins.frontend.lib.ProcessExecutor.execute(ProcessExecutor.java:74)
  910. 11-Dec-2021 11:55:34 ... 35 more
  911. 11-Dec-2021 11:55:34 [ERROR]
  912. 11-Dec-2021 11:55:34 [ERROR] Re-run Maven using the -X switch to enable full debug logging.
  913. 11-Dec-2021 11:55:34 [ERROR]
  914. 11-Dec-2021 11:55:34 [ERROR] For more information about the errors and possible solutions, please read the following articles:
  915. 11-Dec-2021 11:55:34 [ERROR] [Help 1] http://cwiki.apache.org/confluence/display/MAVEN/MojoExecutionException
  916. 11-Dec-2021 11:55:34
  917. 11-Dec-2021 11:55:34 at org.openmrs.maven.plugins.SetupIntegrationTest.setup_shouldInstallServerFromGivenDistroProperties(SetupIntegrationTest.java:128)
  918. 11-Dec-2021 11:55:34
  919. 11-Dec-2021 11:55:35 [INFO]
  920. 11-Dec-2021 11:55:35 [INFO] Results:
  921. 11-Dec-2021 11:55:35 [INFO]
  922. 11-Dec-2021 11:55:35 [ERROR] Failures:
  923. 11-Dec-2021 11:55:35 [ERROR] BuildDistroIntegrationTest.testBuildDistroFromDistroFile:21->AbstractSdkIntegrationTest.assertFilePresent:222->AbstractSdkIntegrationTest.assertPathPresent:244 Expected /home/bamboo-agent/bamboo-agent/xml-data/build-dir/SDK-SDK-JOB1/integration-tests/target/test-classes/integration-test/target/web/frontend/index.html to be an existing file or directory
  924. 11-Dec-2021 11:55:35 Expected: an existing file or directory
  925. 11-Dec-2021 11:55:35 but: does not exist
  926. 11-Dec-2021 11:55:35 [ERROR] DeployIntegrationTest.deploy_shouldUpgradeDistroFromDistroProperties:124->AbstractSdkIntegrationTest.assertFilePresent:231->AbstractSdkIntegrationTest.assertPathPresent:244 Expected /home/bamboo-agent/bamboo-agent/xml-data/build-dir/SDK-SDK-JOB1/integration-tests/target/test-classes/integration-test/5030c8f0-d971-4a44-b218-7d8da0515843/frontend/index.html to be an existing file or directory
  927. 11-Dec-2021 11:55:35 Expected: an existing file or directory
  928. 11-Dec-2021 11:55:35 but: does not exist
  929. 11-Dec-2021 11:55:35 [ERROR] SetupIntegrationTest.setup_shouldInstallServerFromDistroPropertiesDir:165->AbstractSdkIntegrationTest.assertPathPresent:244 Expected /home/bamboo-agent/bamboo-agent/xml-data/build-dir/SDK-SDK-JOB1/integration-tests/target/test-classes/integration-test/e775f7a0-f1f8-4e40-9cb0-d39e99368b84/frontend/index.html to be an existing file or directory
  930. 11-Dec-2021 11:55:35 Expected: an existing file or directory
  931. 11-Dec-2021 11:55:35 but: does not exist
  932. 11-Dec-2021 11:55:35 [ERROR] Errors:
  933. 11-Dec-2021 11:55:35 [ERROR] SetupIntegrationTest.setup_shouldInstallServerFromGivenDistroProperties:128->AbstractSdkIntegrationTest.executeTask:180 » Verification
  934. 11-Dec-2021 11:55:35 [INFO]
  935. 11-Dec-2021 11:55:35 [ERROR] Tests run: 38, Failures: 3, Errors: 1, Skipped: 0
  936. 11-Dec-2021 11:55:35 [INFO]
  937. 11-Dec-2021 11:55:35 [INFO] ------------------------------------------------------------------------
  938. 11-Dec-2021 11:55:35 [INFO] Reactor Summary:
  939. 11-Dec-2021 11:55:35 [INFO]
  940. 11-Dec-2021 11:55:35 [INFO] OpenMRS SDK ........................................ SUCCESS [ 0.342 s]
  941. 11-Dec-2021 11:55:35 [INFO] OpenMRS Reference Application Module Maven Archetype SUCCESS [ 6.577 s]
  942. 11-Dec-2021 11:55:35 [INFO] OpenMRS Platform Module Maven Archetype ............ SUCCESS [ 1.119 s]
  943. 11-Dec-2021 11:55:35 [INFO] OpenMRS OWA Submodule Maven Archetype .............. SUCCESS [ 0.073 s]
  944. 11-Dec-2021 11:55:35 [INFO] sdk-commons ........................................ SUCCESS [ 12.625 s]
  945. 11-Dec-2021 11:55:35 [INFO] OpenMRS SDK Docker Maven Plugin .................... SUCCESS [ 9.162 s]
  946. 11-Dec-2021 11:55:35 [INFO] OpenMRS SDK Tomcat7 Maven Plugin ................... SUCCESS [ 5.664 s]
  947. 11-Dec-2021 11:55:35 [INFO] OpenMRS SDK Tomcat9 Maven Plugin ................... SUCCESS [ 3.691 s]
  948. 11-Dec-2021 11:55:35 [INFO] OpenMRS SDK Maven Plugin ........................... SUCCESS [ 21.167 s]
  949. 11-Dec-2021 11:55:35 [INFO] OpenMRS SDK Integration Tests ...................... FAILURE [35:54 min]
  950. 11-Dec-2021 11:55:35 [INFO] ------------------------------------------------------------------------
  951. 11-Dec-2021 11:55:35 [INFO] BUILD FAILURE
  952. 11-Dec-2021 11:55:35 [INFO] ------------------------------------------------------------------------
  953. 11-Dec-2021 11:55:35 [INFO] Total time: 36:55 min
  954. 11-Dec-2021 11:55:35 [INFO] Finished at: 2021-12-11T11:55:35+00:00
  955. 11-Dec-2021 11:55:35 [INFO] Final Memory: 52M/402M
  956. 11-Dec-2021 11:55:35 [INFO] ------------------------------------------------------------------------
  957. 11-Dec-2021 11:55:35 [ERROR] Failed to execute goal org.apache.maven.plugins:maven-surefire-plugin:2.22.2:test (default-test) on project openmrs-sdk-integration-tests: There are test failures.
  958. 11-Dec-2021 11:55:35 [ERROR]
  959. 11-Dec-2021 11:55:35 [ERROR] Please refer to /home/bamboo-agent/bamboo-agent/xml-data/build-dir/SDK-SDK-JOB1/integration-tests/target/surefire-reports for the individual test results.
  960. 11-Dec-2021 11:55:35 [ERROR] Please refer to dump files (if any exist) [date].dump, [date]-jvmRun[N].dump and [date].dumpstream.
  961. 11-Dec-2021 11:55:35 [ERROR] -> [Help 1]
  962. 11-Dec-2021 11:55:35 [ERROR]
  963. 11-Dec-2021 11:55:35 [ERROR] To see the full stack trace of the errors, re-run Maven with the -e switch.
  964. 11-Dec-2021 11:55:35 [ERROR] Re-run Maven using the -X switch to enable full debug logging.
  965. 11-Dec-2021 11:55:35 [ERROR]
  966. 11-Dec-2021 11:55:35 [ERROR] For more information about the errors and possible solutions, please read the following articles:
  967. 11-Dec-2021 11:55:35 [ERROR] [Help 1] http://cwiki.apache.org/confluence/display/MAVEN/MojoFailureException
  968. 11-Dec-2021 11:55:35 [ERROR]
  969. 11-Dec-2021 11:55:35 [ERROR] After correcting the problems, you can resume the build with the command
  970. 11-Dec-2021 11:55:35 [ERROR] mvn <goals> -rf :openmrs-sdk-integration-tests
  971. 11-Dec-2021 11:55:35 Failing task since return code of [/usr/share/apache-maven-3.3.9/bin/mvn --batch-mode -Djava.io.tmpdir=/home/bamboo-agent/bamboo-agent/.agent_tmp/SDK-SDK-JOB1 clean install] was 1 while expected 0
  972. 11-Dec-2021 11:55:35 Finished task 'Build' with result: Failed
  973. 11-Dec-2021 11:55:35 Running post build plugin 'Docker Container Cleanup'
  974. 11-Dec-2021 11:55:35 Running post build plugin 'NCover Results Collector'
  975. 11-Dec-2021 11:55:35 Running post build plugin 'Clover Results Collector'
  976. 11-Dec-2021 11:55:35 Running post build plugin 'Sauce OnDemand Post Runner'
  977. 11-Dec-2021 11:55:35 Running post build plugin 'npm Cache Cleanup'
  978. 11-Dec-2021 11:55:35 Running post build plugin 'Artifact Copier'
  979. 11-Dec-2021 11:55:35 Finalising the build...
  980. 11-Dec-2021 11:55:35 Stopping timer.
  981. 11-Dec-2021 11:55:35 Build SDK-SDK-JOB1-447 completed.
  982. 11-Dec-2021 11:55:35 Running on server: post build plugin 'NCover Results Collector'
  983. 11-Dec-2021 11:55:35 Running on server: post build plugin 'Build Hanging Detection Configuration'
  984. 11-Dec-2021 11:55:35 Running on server: post build plugin 'Clover Delta Calculator'
  985. 11-Dec-2021 11:55:36 Running on server: post build plugin 'Maven Dependencies Postprocessor'
  986. 11-Dec-2021 11:55:36 All post build plugins have finished
  987. 11-Dec-2021 11:55:36 Generating build results summary...
  988. 11-Dec-2021 11:55:36 Saving build results to disk...
  989. 11-Dec-2021 11:55:36 Logging substituted variables...
  990. 11-Dec-2021 11:55:36 Indexing build results...
  991. 11-Dec-2021 11:55:36 Finished building SDK-SDK-JOB1-447.
Advertisement
RAW Paste Data Copied
Advertisement