SHARE
TWEET

Untitled

a guest Jun 16th, 2019 49 Never
Not a member of Pastebin yet? Sign Up, it unlocks many cool features!
  1. libcurl.a(formdata.o) : warning LNK4217: locally defined symbol __acrt_iob_func imported in function Curl_getformdata
  2. libcurl.a(setopt.o) : warning LNK4217: locally defined symbol __acrt_iob_func imported in function vsetopt
  3. libcurl.a(url.o) : warning LNK4217: locally defined symbol __acrt_iob_func imported in function Curl_builtin_scheme
  4. libcurl.a(cookie.o) : warning LNK4217: locally defined symbol __acrt_iob_func imported in function Curl_cookie_init
  5. libcurl.a(mprintf.o) : warning LNK4217: locally defined symbol __acrt_iob_func imported in function dprintf_formatf
  6. libcurl.a(inet_ntop.o) : warning LNK4049: locally defined symbol _errno imported
  7. libcurl.a(strtoofft.o) : warning LNK4049: locally defined symbol _errno imported
  8. libcurl.a(parsedate.o) : warning LNK4049: locally defined symbol _errno imported
  9. libcurl.a(strerror.o) : warning LNK4217: locally defined symbol _errno imported in function Curl_strerror
  10. libcurl.a(asyn-thread.o) : warning LNK4217: locally defined symbol _errno imported in function Curl_resolver_cancel
  11. libcurl.a(connect.o) : warning LNK4217: locally defined symbol _errno imported in function Curl_is_connected
  12. libcurl.a(inet_pton.o) : warning LNK4049: locally defined symbol _errno imported
  13. libcurl.a(strerror.o) : warning LNK4217: locally defined symbol _sys_nerr imported in function Curl_strerror
  14. libcurl.a(hostip.o) : warning LNK4217: locally defined symbol tolower imported in function fetch_addr
  15. libcurl.a(url.o) : warning LNK4217: locally defined symbol tolower imported in function Curl_freeset
  16. libcurl.a(urlapi.o) : warning LNK4217: locally defined symbol tolower imported in function parseurl
  17. libcurl.a(x509asn1.o) : warning LNK4217: locally defined symbol isupper imported in function ASN1tostr
  18. libcurl.a(easy.o) : error LNK2019: unresolved external symbol strdup referenced in function global_init
  19. libcurl.a(easy.o) : error LNK2019: unresolved external symbol libssh2_init referenced in function global_init
  20. libcurl.a(easy.o) : error LNK2019: unresolved external symbol libssh2_exit referenced in function curl_global_cleanup
  21. libcurl.a(system_win32.o) : error LNK2019: unresolved external symbol __imp_WSAStartup referenced in function Curl_win32_init
  22. libcurl.a(telnet.o) : error LNK2001: unresolved external symbol __imp_WSAStartup
  23. libcurl.a(system_win32.o) : error LNK2019: unresolved external symbol __imp_WSACleanup referenced in function Curl_win32_init
  24. libcurl.a(telnet.o) : error LNK2001: unresolved external symbol __imp_WSACleanup
  25. libcurl.a(tftp.o) : error LNK2019: unresolved external symbol __imp_WSAGetLastError referenced in function tftp_disconnect
  26. libcurl.a(openssl.o) : error LNK2001: unresolved external symbol __imp_WSAGetLastError
  27. libcurl.a(schannel.o) : error LNK2001: unresolved external symbol __imp_WSAGetLastError
  28. libcurl.a(ftp.o) : error LNK2001: unresolved external symbol __imp_WSAGetLastError
  29. libcurl.a(telnet.o) : error LNK2001: unresolved external symbol __imp_WSAGetLastError
  30. libcurl.a(asyn-thread.o) : error LNK2001: unresolved external symbol __imp_WSAGetLastError
  31. libcurl.a(select.o) : error LNK2001: unresolved external symbol __imp_WSAGetLastError
  32. libcurl.a(sendf.o) : error LNK2001: unresolved external symbol __imp_WSAGetLastError
  33. libcurl.a(connect.o) : error LNK2001: unresolved external symbol __imp_WSAGetLastError
  34. libcurl.a(hostip6.o) : error LNK2019: unresolved external symbol __imp_socket referenced in function Curl_ipv6works
  35. libcurl.a(connect.o) : error LNK2001: unresolved external symbol __imp_socket
  36. libcurl.a(select.o) : error LNK2019: unresolved external symbol __imp_WSASetLastError referenced in function Curl_wait_ms
  37. libcurl.a(connect.o) : error LNK2001: unresolved external symbol __imp_WSASetLastError
  38. libcurl.a(curl_addrinfo.o) : error LNK2001: unresolved external symbol __imp_WSASetLastError
  39. libcurl.a(select.o) : error LNK2019: unresolved external symbol __imp_select referenced in function Curl_socket_check
  40. libcurl.a(select.o) : error LNK2019: unresolved external symbol __WSAFDIsSet referenced in function Curl_socket_check
  41. libcurl.a(version.o) : error LNK2019: unresolved external symbol zlibVersion referenced in function curl_version
  42. libcurl.a(content_encoding.o) : error LNK2001: unresolved external symbol zlibVersion
  43. libcurl.a(version.o) : error LNK2019: unresolved external symbol BrotliDecoderVersion referenced in function curl_version
  44. libcurl.a(version.o) : error LNK2019: unresolved external symbol libssh2_version referenced in function curl_version
  45. libcurl.a(tftp.o) : error LNK2019: unresolved external symbol __imp__time64 referenced in function tftp_done
  46. libcurl.a(hostip.o) : error LNK2001: unresolved external symbol __imp__time64
  47. libcurl.a(cookie.o) : error LNK2001: unresolved external symbol __imp__time64
  48. libcurl.a(http.o) : error LNK2001: unresolved external symbol __imp__time64
  49. libcurl.a(ftp.o) : error LNK2001: unresolved external symbol __imp__time64
  50. libcurl.a(rtsp.o) : error LNK2001: unresolved external symbol sscanf
  51. libcurl.a(parsedate.o) : error LNK2001: unresolved external symbol sscanf
  52. libcurl.a(http.o) : error LNK2001: unresolved external symbol sscanf
  53. libcurl.a(ftp.o) : error LNK2001: unresolved external symbol sscanf
  54. libcurl.a(telnet.o) : error LNK2001: unresolved external symbol sscanf
  55. libcurl.a(imap.o) : error LNK2001: unresolved external symbol sscanf
  56. libcurl.a(hostip.o) : error LNK2001: unresolved external symbol sscanf
  57. libcurl.a(cookie.o) : error LNK2001: unresolved external symbol sscanf
  58. libcurl.a(urlapi.o) : error LNK2001: unresolved external symbol sscanf
  59. libcurl.a(http_proxy.o) : error LNK2001: unresolved external symbol sscanf
  60. libcurl.a(sendf.o) : error LNK2019: unresolved external symbol __imp_recv referenced in function Curl_send_plain
  61. libcurl.a(connect.o) : error LNK2001: unresolved external symbol __imp_recv
  62. libcurl.a(openssl.o) : error LNK2001: unresolved external symbol __imp_recv
  63. libcurl.a(sendf.o) : error LNK2019: unresolved external symbol __imp_send referenced in function Curl_send_plain
  64. libcurl.a(telnet.o) : error LNK2001: unresolved external symbol __imp_send
  65. libcurl.a(mime.o) : error LNK2019: unresolved external symbol __imp__stat64 referenced in function curl_mime_data
  66. libcurl.a(mime.o) : error LNK2019: unresolved external symbol access referenced in function curl_mime_data
  67. libcurl.a(ssh.o) : error LNK2001: unresolved external symbol access
  68. libcurl.a(warnless.o) : error LNK2019: unresolved external symbol read referenced in function curlx_read
  69. libcurl.a(warnless.o) : error LNK2019: unresolved external symbol write referenced in function curlx_write
  70. libcurl.a(cookie.o) : error LNK2019: unresolved external symbol ___chkstk_ms referenced in function Curl_cookie_add
  71. libcurl.a(mprintf.o) : error LNK2001: unresolved external symbol ___chkstk_ms
  72. libcurl.a(netrc.o) : error LNK2001: unresolved external symbol ___chkstk_ms
  73. libcurl.a(formdata.o) : error LNK2001: unresolved external symbol ___chkstk_ms
  74. libcurl.a(connect.o) : error LNK2019: unresolved external symbol __imp_getpeername referenced in function Curl_updateconninfo
  75. libcurl.a(connect.o) : error LNK2019: unresolved external symbol __imp_getsockname referenced in function Curl_updateconninfo
  76. libcurl.a(ftp.o) : error LNK2001: unresolved external symbol __imp_getsockname
  77. libcurl.a(connect.o) : error LNK2019: unresolved external symbol __imp_ntohs referenced in function getaddressinfo
  78. libcurl.a(ftp.o) : error LNK2001: unresolved external symbol __imp_ntohs
  79. libcurl.a(socks_sspi.o) : error LNK2001: unresolved external symbol __imp_ntohs
  80. libcurl.a(connect.o) : error LNK2019: unresolved external symbol __imp_getsockopt referenced in function Curl_is_connected
  81. libcurl.a(connect.o) : error LNK2019: unresolved external symbol __imp_closesocket referenced in function Curl_closesocket
  82. libcurl.a(connect.o) : error LNK2019: unresolved external symbol __imp_setsockopt referenced in function Curl_sndbufset
  83. libcurl.a(transfer.o) : error LNK2001: unresolved external symbol __imp_setsockopt
  84. libcurl.a(connect.o) : error LNK2019: unresolved external symbol __imp_WSAIoctl referenced in function Curl_connecthost
  85. libcurl.a(transfer.o) : error LNK2001: unresolved external symbol __imp_WSAIoctl
  86. libcurl.a(telnet.o) : error LNK2001: unresolved external symbol __imp_htons
  87. libcurl.a(smb.o) : error LNK2001: unresolved external symbol __imp_htons
  88. libcurl.a(socks_sspi.o) : error LNK2001: unresolved external symbol __imp_htons
  89. libcurl.a(connect.o) : error LNK2001: unresolved external symbol __imp_htons
  90. libcurl.a(curl_addrinfo.o) : error LNK2001: unresolved external symbol __imp_htons
  91. libcurl.a(doh.o) : error LNK2001: unresolved external symbol __imp_htons
  92. libcurl.a(ftp.o) : error LNK2001: unresolved external symbol __imp_htons
  93. libcurl.a(connect.o) : error LNK2019: unresolved external symbol __imp_bind referenced in function Curl_connecthost
  94. libcurl.a(ftp.o) : error LNK2001: unresolved external symbol __imp_bind
  95. libcurl.a(tftp.o) : error LNK2001: unresolved external symbol __imp_bind
  96. libcurl.a(connect.o) : error LNK2019: unresolved external symbol __imp_connect referenced in function Curl_connecthost
  97. libcurl.a(http2.o) : error LNK2019: unresolved external symbol nghttp2_version referenced in function Curl_http2_ver
  98. libcurl.a(http2.o) : error LNK2019: unresolved external symbol nghttp2_submit_rst_stream referenced in function Curl_http2_done
  99. libcurl.a(http2.o) : error LNK2019: unresolved external symbol nghttp2_session_send referenced in function Curl_http2_done
  100. libcurl.a(http2.o) : error LNK2019: unresolved external symbol nghttp2_session_set_stream_user_data referenced in function Curl_http2_done
  101. libcurl.a(http2.o) : error LNK2019: unresolved external symbol nghttp2_pack_settings_payload referenced in function Curl_http2_request_upgrade
  102. libcurl.a(http2.o) : error LNK2019: unresolved external symbol nghttp2_session_resume_data referenced in function Curl_http2_done_sending
  103. libcurl.a(http2.o) : error LNK2019: unresolved external symbol nghttp2_session_mem_recv referenced in function h2_process_pending_input
  104. libcurl.a(http2.o) : error LNK2019: unresolved external symbol nghttp2_strerror referenced in function h2_process_pending_input
  105. libcurl.a(http2.o) : error LNK2019: unresolved external symbol nghttp2_priority_spec_init referenced in function h2_process_pending_input
  106. libcurl.a(http2.o) : error LNK2019: unresolved external symbol nghttp2_submit_priority referenced in function h2_process_pending_input
  107. libcurl.a(http2.o) : error LNK2019: unresolved external symbol nghttp2_session_want_read referenced in function h2_process_pending_input
  108. libcurl.a(http2.o) : error LNK2019: unresolved external symbol nghttp2_session_want_write referenced in function h2_process_pending_input
  109. libcurl.a(http2.o) : error LNK2019: unresolved external symbol nghttp2_session_callbacks_new referenced in function Curl_http2_setup
  110. libcurl.a(http2.o) : error LNK2019: unresolved external symbol nghttp2_session_callbacks_set_send_callback referenced in function Curl_http2_setup
  111. libcurl.a(http2.o) : error LNK2019: unresolved external symbol nghttp2_session_callbacks_set_on_frame_recv_callback referenced in function Curl_http2_setup
  112. libcurl.a(http2.o) : error LNK2019: unresolved external symbol nghttp2_session_callbacks_set_on_data_chunk_recv_callback referenced in function Curl_http2_setup
  113. libcurl.a(http2.o) : error LNK2019: unresolved external symbol nghttp2_session_callbacks_set_on_stream_close_callback referenced in function Curl_http2_setup
  114. libcurl.a(http2.o) : error LNK2019: unresolved external symbol nghttp2_session_callbacks_set_on_begin_headers_callback referenced in function Curl_http2_setup
  115. libcurl.a(http2.o) : error LNK2019: unresolved external symbol nghttp2_session_callbacks_set_on_header_callback referenced in function Curl_http2_setup
  116. libcurl.a(http2.o) : error LNK2019: unresolved external symbol nghttp2_session_callbacks_set_error_callback referenced in function Curl_http2_setup
  117. libcurl.a(http2.o) : error LNK2019: unresolved external symbol nghttp2_session_client_new referenced in function Curl_http2_setup
  118. libcurl.a(http2.o) : error LNK2019: unresolved external symbol nghttp2_session_callbacks_del referenced in function Curl_http2_setup
  119. libcurl.a(http2.o) : error LNK2019: unresolved external symbol nghttp2_session_upgrade referenced in function Curl_http2_switched
  120. libcurl.a(http2.o) : error LNK2019: unresolved external symbol nghttp2_submit_settings referenced in function Curl_http2_switched
  121. libcurl.a(http2.o) : error LNK2019: unresolved external symbol nghttp2_session_set_local_window_size referenced in function Curl_http2_switched
  122. libcurl.a(http2.o) : error LNK2019: unresolved external symbol nghttp2_is_fatal referenced in function Curl_http2_switched
  123. libcurl.a(http2.o) : error LNK2019: unresolved external symbol nghttp2_submit_request referenced in function http2_send
  124. libcurl.a(http2.o) : error LNK2019: unresolved external symbol nghttp2_session_del referenced in function http2_disconnect
  125. libcurl.a(http2.o) : error LNK2019: unresolved external symbol nghttp2_submit_ping referenced in function http2_conncheck
  126. libcurl.a(http2.o) : error LNK2019: unresolved external symbol nghttp2_session_get_stream_user_data referenced in function http2_conncheck
  127. libcurl.a(http2.o) : error LNK2019: unresolved external symbol nghttp2_session_get_remote_settings referenced in function http2_conncheck
  128. libcurl.a(http2.o) : error LNK2019: unresolved external symbol nghttp2_http2_strerror referenced in function http2_conncheck
  129. libcurl.a(content_encoding.o) : error LNK2019: unresolved external symbol inflateInit_ referenced in function deflate_init_writer
  130. libcurl.a(content_encoding.o) : error LNK2019: unresolved external symbol inflateEnd referenced in function deflate_unencode_write
  131. libcurl.a(content_encoding.o) : error LNK2019: unresolved external symbol inflate referenced in function deflate_close_writer
  132. libcurl.a(content_encoding.o) : error LNK2019: unresolved external symbol inflateInit2_ referenced in function deflate_close_writer
  133. libcurl.a(content_encoding.o) : error LNK2019: unresolved external symbol BrotliDecoderCreateInstance referenced in function brotli_init_writer
  134. libcurl.a(content_encoding.o) : error LNK2019: unresolved external symbol BrotliDecoderDecompressStream referenced in function brotli_unencode_write
  135. libcurl.a(content_encoding.o) : error LNK2019: unresolved external symbol BrotliDecoderDestroyInstance referenced in function brotli_unencode_write
  136. libcurl.a(content_encoding.o) : error LNK2019: unresolved external symbol BrotliDecoderGetErrorCode referenced in function brotli_unencode_write
  137. libcurl.a(mprintf.o) : error LNK2019: unresolved external symbol sprintf referenced in function dprintf_formatf
  138. libcurl.a(md5.o) : error LNK2019: unresolved external symbol MD5_Init referenced in function Curl_md5it
  139. libcurl.a(md5.o) : error LNK2019: unresolved external symbol MD5_Update referenced in function Curl_md5it
  140. libcurl.a(md5.o) : error LNK2019: unresolved external symbol MD5_Final referenced in function Curl_md5it
  141. libcurl.a(openssl.o) : error LNK2019: unresolved external symbol OPENSSL_load_builtin_modules referenced in function Curl_ossl_init
  142. libcurl.a(openssl.o) : error LNK2019: unresolved external symbol ENGINE_load_builtin_engines referenced in function Curl_ossl_init
  143. libcurl.a(openssl.o) : error LNK2019: unresolved external symbol CONF_modules_load_file referenced in function Curl_ossl_init
  144. libcurl.a(openssl.o) : error LNK2019: unresolved external symbol CRYPTO_get_ex_new_index referenced in function Curl_ossl_init
  145. libcurl.a(openssl.o) : error LNK2019: unresolved external symbol OpenSSL_version_num referenced in function Curl_ossl_version
  146. libcurl.a(openssl.o) : error LNK2019: unresolved external symbol SSL_shutdown referenced in function Curl_ossl_shutdown
  147. libcurl.a(openssl.o) : error LNK2019: unresolved external symbol ERR_clear_error referenced in function Curl_ossl_shutdown
  148. libcurl.a(openssl.o) : error LNK2019: unresolved external symbol SSL_read referenced in function Curl_ossl_shutdown
  149. libcurl.a(openssl.o) : error LNK2019: unresolved external symbol SSL_get_error referenced in function Curl_ossl_shutdown
  150. libcurl.a(openssl.o) : error LNK2019: unresolved external symbol ERR_get_error referenced in function Curl_ossl_shutdown
  151. libcurl.a(openssl.o) : error LNK2019: unresolved external symbol ERR_error_string_n referenced in function Curl_ossl_shutdown
  152. libcurl.a(openssl.o) : error LNK2019: unresolved external symbol SSL_free referenced in function Curl_ossl_shutdown
  153. libcurl.a(openssl.o) : error LNK2019: unresolved external symbol SSL_pending referenced in function Curl_ossl_data_pending
  154. libcurl.a(openssl.o) : error LNK2019: unresolved external symbol RAND_status referenced in function Curl_ossl_random
  155. libcurl.a(openssl.o) : error LNK2019: unresolved external symbol RAND_bytes referenced in function Curl_ossl_random
  156. libcurl.a(openssl.o) : error LNK2019: unresolved external symbol SSL_set_connect_state referenced in function Curl_ossl_close
  157. libcurl.a(openssl.o) : error LNK2019: unresolved external symbol SSL_CTX_free referenced in function Curl_ossl_close
  158. libcurl.a(openssl.o) : error LNK2019: unresolved external symbol ENGINE_finish referenced in function Curl_ossl_close_all
  159. libcurl.a(openssl.o) : error LNK2019: unresolved external symbol ENGINE_free referenced in function Curl_ossl_close_all
  160. libcurl.a(openssl.o) : error LNK2019: unresolved external symbol SSL_SESSION_free referenced in function Curl_ossl_session_free
  161. libcurl.a(openssl.o) : error LNK2019: unresolved external symbol ENGINE_by_id referenced in function Curl_ossl_set_engine
  162. libcurl.a(openssl.o) : error LNK2019: unresolved external symbol ENGINE_init referenced in function Curl_ossl_set_engine
  163. libcurl.a(openssl.o) : error LNK2019: unresolved external symbol ENGINE_set_default referenced in function Curl_ossl_set_engine_default
  164. libcurl.a(openssl.o) : error LNK2019: unresolved external symbol ENGINE_get_id referenced in function Curl_ossl_set_engine_default
  165. libcurl.a(openssl.o) : error LNK2019: unresolved external symbol ENGINE_get_first referenced in function Curl_ossl_engines_list
  166. libcurl.a(openssl.o) : error LNK2019: unresolved external symbol ENGINE_get_next referenced in function Curl_ossl_engines_list
  167. libcurl.a(openssl.o) : error LNK2019: unresolved external symbol EVP_MD_CTX_new referenced in function Curl_ossl_md5sum
  168. libcurl.a(openssl.o) : error LNK2019: unresolved external symbol EVP_md5 referenced in function Curl_ossl_md5sum
  169. libcurl.a(openssl.o) : error LNK2019: unresolved external symbol EVP_DigestInit_ex referenced in function Curl_ossl_md5sum
  170. libcurl.a(openssl.o) : error LNK2019: unresolved external symbol EVP_DigestUpdate referenced in function Curl_ossl_md5sum
  171. libcurl.a(openssl.o) : error LNK2019: unresolved external symbol EVP_DigestFinal_ex referenced in function Curl_ossl_md5sum
  172. libcurl.a(openssl.o) : error LNK2019: unresolved external symbol EVP_MD_CTX_free referenced in function Curl_ossl_md5sum
  173. libcurl.a(openssl.o) : error LNK2019: unresolved external symbol EVP_sha256 referenced in function Curl_ossl_sha256sum
  174. libcurl.a(openssl.o) : error LNK2019: unresolved external symbol RAND_load_file referenced in function Curl_ossl_sha256sum
  175. libcurl.a(openssl.o) : error LNK2019: unresolved external symbol RAND_add referenced in function Curl_ossl_sha256sum
  176. libcurl.a(openssl.o) : error LNK2019: unresolved external symbol RAND_file_name referenced in function Curl_ossl_sha256sum
  177. libcurl.a(openssl.o) : error LNK2019: unresolved external symbol SSL_connect referenced in function Curl_ossl_sha256sum
  178. libcurl.a(openssl.o) : error LNK2019: unresolved external symbol SSL_version referenced in function Curl_ossl_sha256sum
  179. libcurl.a(openssl.o) : error LNK2019: unresolved external symbol SSL_get_current_cipher referenced in function Curl_ossl_sha256sum
  180. libcurl.a(openssl.o) : error LNK2019: unresolved external symbol SSL_CIPHER_get_name referenced in function Curl_ossl_sha256sum
  181. libcurl.a(openssl.o) : error LNK2019: unresolved external symbol SSL_get0_alpn_selected referenced in function Curl_ossl_sha256sum
  182. libcurl.a(openssl.o) : error LNK2019: unresolved external symbol SSL_get_verify_result referenced in function Curl_ossl_sha256sum
  183. libcurl.a(openssl.o) : error LNK2019: unresolved external symbol X509_verify_cert_error_string referenced in function Curl_ossl_sha256sum
  184. libcurl.a(openssl.o) : error LNK2019: unresolved external symbol TLS_client_method referenced in function Curl_ossl_sha256sum
  185. libcurl.a(openssl.o) : error LNK2019: unresolved external symbol SSL_CTX_new referenced in function Curl_ossl_sha256sum
  186. libcurl.a(openssl.o) : error LNK2019: unresolved external symbol SSL_CTX_ctrl referenced in function Curl_ossl_sha256sum
  187. libcurl.a(openssl.o) : error LNK2019: unresolved external symbol SSL_CTX_set_msg_callback referenced in function Curl_ossl_sha256sum
  188. libcurl.a(openssl.o) : error LNK2019: unresolved external symbol ERR_peek_error referenced in function Curl_ossl_sha256sum
  189. libcurl.a(openssl.o) : error LNK2019: unresolved external symbol BIO_s_mem referenced in function Curl_ossl_sha256sum
  190. libcurl.a(openssl.o) : error LNK2019: unresolved external symbol BIO_new referenced in function Curl_ossl_sha256sum
  191. libcurl.a(openssl.o) : error LNK2019: unresolved external symbol SSL_get_peer_cert_chain referenced in function Curl_ossl_sha256sum
  192. libcurl.a(openssl.o) : error LNK2019: unresolved external symbol OPENSSL_sk_num referenced in function Curl_ossl_sha256sum
  193. libcurl.a(openssl.o) : error LNK2019: unresolved external symbol OPENSSL_sk_value referenced in function Curl_ossl_sha256sum
  194. libcurl.a(openssl.o) : error LNK2019: unresolved external symbol X509_get_subject_name referenced in function Curl_ossl_sha256sum
  195. libcurl.a(openssl.o) : error LNK2019: unresolved external symbol X509_NAME_print_ex referenced in function Curl_ossl_sha256sum
  196. libcurl.a(openssl.o) : error LNK2019: unresolved external symbol BIO_ctrl referenced in function Curl_ossl_sha256sum
  197. libcurl.a(openssl.o) : error LNK2019: unresolved external symbol X509_get_issuer_name referenced in function Curl_ossl_sha256sum
  198. libcurl.a(openssl.o) : error LNK2019: unresolved external symbol X509_get_version referenced in function Curl_ossl_sha256sum
  199. libcurl.a(openssl.o) : error LNK2019: unresolved external symbol BIO_printf referenced in function Curl_ossl_sha256sum
  200. libcurl.a(openssl.o) : error LNK2019: unresolved external symbol X509_get_serialNumber referenced in function Curl_ossl_sha256sum
  201. libcurl.a(openssl.o) : error LNK2019: unresolved external symbol BIO_puts referenced in function Curl_ossl_sha256sum
  202. libcurl.a(openssl.o) : error LNK2019: unresolved external symbol ASN1_STRING_new referenced in function Curl_ossl_sha256sum
  203. libcurl.a(openssl.o) : error LNK2019: unresolved external symbol X509_get0_signature referenced in function Curl_ossl_sha256sum
  204. libcurl.a(openssl.o) : error LNK2019: unresolved external symbol X509_signature_print referenced in function Curl_ossl_sha256sum
  205. libcurl.a(openssl.o) : error LNK2019: unresolved external symbol ASN1_STRING_free referenced in function Curl_ossl_sha256sum
  206. libcurl.a(openssl.o) : error LNK2019: unresolved external symbol i2a_ASN1_OBJECT referenced in function Curl_ossl_sha256sum
  207. libcurl.a(openssl.o) : error LNK2019: unresolved external symbol X509_get0_extensions referenced in function Curl_ossl_sha256sum
  208. libcurl.a(openssl.o) : error LNK2019: unresolved external symbol X509_EXTENSION_get_object referenced in function Curl_ossl_sha256sum
  209. libcurl.a(openssl.o) : error LNK2019: unresolved external symbol i2t_ASN1_OBJECT referenced in function Curl_ossl_sha256sum
  210. libcurl.a(openssl.o) : error LNK2019: unresolved external symbol X509V3_EXT_print referenced in function Curl_ossl_sha256sum
  211. libcurl.a(openssl.o) : error LNK2019: unresolved external symbol X509_EXTENSION_get_data referenced in function Curl_ossl_sha256sum
  212. libcurl.a(openssl.o) : error LNK2019: unresolved external symbol ASN1_STRING_print referenced in function Curl_ossl_sha256sum
  213. libcurl.a(openssl.o) : error LNK2019: unresolved external symbol BIO_free referenced in function Curl_ossl_sha256sum
  214. libcurl.a(openssl.o) : error LNK2019: unresolved external symbol X509_get0_notBefore referenced in function Curl_ossl_sha256sum
  215. libcurl.a(openssl.o) : error LNK2019: unresolved external symbol ASN1_TIME_print referenced in function Curl_ossl_sha256sum
  216. libcurl.a(openssl.o) : error LNK2019: unresolved external symbol X509_get0_notAfter referenced in function Curl_ossl_sha256sum
  217. libcurl.a(openssl.o) : error LNK2019: unresolved external symbol X509_get_pubkey referenced in function Curl_ossl_sha256sum
  218. libcurl.a(openssl.o) : error LNK2019: unresolved external symbol EVP_PKEY_id referenced in function Curl_ossl_sha256sum
  219. libcurl.a(openssl.o) : error LNK2019: unresolved external symbol EVP_PKEY_get0_RSA referenced in function Curl_ossl_sha256sum
  220. libcurl.a(openssl.o) : error LNK2019: unresolved external symbol RSA_get0_key referenced in function Curl_ossl_sha256sum
  221. libcurl.a(openssl.o) : error LNK2019: unresolved external symbol BN_print referenced in function Curl_ossl_sha256sum
  222. libcurl.a(openssl.o) : error LNK2019: unresolved external symbol EVP_PKEY_get0_DSA referenced in function Curl_ossl_sha256sum
  223. libcurl.a(openssl.o) : error LNK2019: unresolved external symbol DSA_get0_pqg referenced in function Curl_ossl_sha256sum
  224. libcurl.a(openssl.o) : error LNK2019: unresolved external symbol DSA_get0_key referenced in function Curl_ossl_sha256sum
  225. libcurl.a(openssl.o) : error LNK2019: unresolved external symbol EVP_PKEY_get0_DH referenced in function Curl_ossl_sha256sum
  226. libcurl.a(openssl.o) : error LNK2019: unresolved external symbol DH_get0_pqg referenced in function Curl_ossl_sha256sum
  227. libcurl.a(openssl.o) : error LNK2019: unresolved external symbol DH_get0_key referenced in function Curl_ossl_sha256sum
  228. libcurl.a(openssl.o) : error LNK2019: unresolved external symbol EVP_PKEY_free referenced in function Curl_ossl_sha256sum
  229. libcurl.a(openssl.o) : error LNK2019: unresolved external symbol PEM_write_bio_X509 referenced in function Curl_ossl_sha256sum
  230. libcurl.a(openssl.o) : error LNK2019: unresolved external symbol SSL_get_peer_certificate referenced in function Curl_ossl_sha256sum
  231. libcurl.a(openssl.o) : error LNK2019: unresolved external symbol X509_get_ext_d2i referenced in function Curl_ossl_sha256sum
  232. libcurl.a(openssl.o) : error LNK2019: unresolved external symbol ASN1_STRING_get0_data referenced in function Curl_ossl_sha256sum
  233. libcurl.a(openssl.o) : error LNK2019: unresolved external symbol ASN1_STRING_length referenced in function Curl_ossl_sha256sum
  234. libcurl.a(openssl.o) : error LNK2019: unresolved external symbol SSL_CTX_set_options referenced in function Curl_ossl_sha256sum
  235. libcurl.a(openssl.o) : error LNK2019: unresolved external symbol SSL_CTX_set_next_proto_select_cb referenced in function Curl_ossl_sha256sum
  236. libcurl.a(openssl.o) : error LNK2019: unresolved external symbol SSL_CTX_set_alpn_protos referenced in function Curl_ossl_sha256sum
  237. libcurl.a(openssl.o) : error LNK2019: unresolved external symbol SSL_CTX_set_default_passwd_cb_userdata referenced in function Curl_ossl_sha256sum
  238. libcurl.a(openssl.o) : error LNK2019: unresolved external symbol SSL_CTX_set_default_passwd_cb referenced in function Curl_ossl_sha256sum
  239. libcurl.a(openssl.o) : error LNK2019: unresolved external symbol SSL_CTX_use_certificate_file referenced in function Curl_ossl_sha256sum
  240. libcurl.a(openssl.o) : error LNK2019: unresolved external symbol BIO_s_file referenced in function Curl_ossl_sha256sum
  241. libcurl.a(openssl.o) : error LNK2019: unresolved external symbol d2i_PKCS12_bio referenced in function Curl_ossl_sha256sum
  242. libcurl.a(openssl.o) : error LNK2019: unresolved external symbol PKCS12_PBE_add referenced in function Curl_ossl_sha256sum
  243. libcurl.a(openssl.o) : error LNK2019: unresolved external symbol PKCS12_parse referenced in function Curl_ossl_sha256sum
  244.      
  245. trading.exe : fatal error LNK1120: 376 unresolved externals
  246. clang++: error: linker command failed with exit code 1120 (use -v to see invocation)
  247. The terminal process terminated with exit code: 1
  248.      
  249. -std=c++17 -Xclang -flto-visibility-public-std
RAW Paste Data
We use cookies for various purposes including analytics. By continuing to use Pastebin, you agree to our use of cookies as described in the Cookies Policy. OK, I Understand
 
Top