analca3

Error xsensors

Apr 11th, 2014
137
0
Never
Not a member of Pastebin yet? Sign Up, it unlocks many cool features!
text 6.32 KB | None | 0 0
  1. [antonio@Antonio-Arch xsensors-0.70]$ ./configure
  2. checking for a BSD-compatible install... /usr/bin/install -c
  3. checking whether build environment is sane... yes
  4. checking for a thread-safe mkdir -p... /usr/bin/mkdir -p
  5. checking for gawk... gawk
  6. checking whether make sets $(MAKE)... yes
  7. checking whether to enable maintainer-specific portions of Makefiles... no
  8. checking for gcc... gcc
  9. checking for C compiler default output file name... a.out
  10. checking whether the C compiler works... yes
  11. checking whether we are cross compiling... no
  12. checking for suffix of executables...
  13. checking for suffix of object files... o
  14. checking whether we are using the GNU C compiler... yes
  15. checking whether gcc accepts -g... yes
  16. checking for gcc option to accept ISO C89... none needed
  17. checking for style of include used by make... GNU
  18. checking dependency style of gcc... gcc3
  19. checking for library containing strerror... none required
  20. checking how to run the C preprocessor... gcc -E
  21. checking for grep that handles long lines and -e... /usr/bin/grep
  22. checking for egrep... /usr/bin/grep -E
  23. checking for ANSI C header files... yes
  24. checking for sensors_init in -lsensors... yes
  25. checking for sys/types.h... yes
  26. checking for sys/stat.h... yes
  27. checking for stdlib.h... yes
  28. checking for string.h... yes
  29. checking for memory.h... yes
  30. checking for strings.h... yes
  31. checking for inttypes.h... yes
  32. checking for stdint.h... yes
  33. checking for unistd.h... yes
  34. checking sensors/sensors.h usability... yes
  35. checking sensors/sensors.h presence... yes
  36. checking for sensors/sensors.h... yes
  37. checking sensors/error.h usability... yes
  38. checking sensors/error.h presence... yes
  39. checking for sensors/error.h... yes
  40. checking for pkg-config... /usr/bin/pkg-config
  41. checking pkg-config is at least version 0.16... yes
  42. checking for GLIB - version >= 2.0.0... yes (version 2.38.2)
  43. checking for pkg-config... /usr/bin/pkg-config
  44. checking for GTK+ - version >= 2.0.0... yes (version 2.24.22)
  45. configure: creating ./config.status
  46. config.status: creating Makefile
  47. config.status: creating pixmaps/Makefile
  48. config.status: creating src/Makefile
  49. config.status: creating config.h
  50. config.status: config.h is unchanged
  51. config.status: executing depfiles commands
  52. [antonio@Antonio-Arch xsensors-0.70]$ make
  53. make all-recursive
  54. make[1]: Entering directory '/home/antonio/xsensors/xsensors-0.70'
  55. Making all in src
  56. make[2]: Entering directory '/home/antonio/xsensors/xsensors-0.70/src'
  57. gcc -DHAVE_CONFIG_H -I. -I.. -I.. -pthread -I/usr/include/gtk-2.0 -I/usr/lib/gtk-2.0/include -I/usr/include/pango-1.0 -I/usr/include/atk-1.0 -I/usr/include/cairo -I/usr/include/pixman-1 -I/usr/include/libdrm -I/usr/include/gdk-pixbuf-2.0 -I/usr/include/libpng16 -I/usr/include/pango-1.0 -I/usr/include/glib-2.0 -I/usr/lib/glib-2.0/include -I/usr/include/freetype2 -I/usr/include/libpng16 -I/usr/include/harfbuzz -I/usr/include/freetype2 -I/usr/include/libpng16 -I/usr/include/harfbuzz -Werror -DG_LOG_DOMAIN=\"GnomeCPUInfoApplet\" -DGNOMELOCALEDIR=\""/usr/local//locale"\" -DDATADIR=\""/usr/local/share/pixmaps/xsensors"\" -DG_DISABLE_DEPRECATED -DGTK_DISABLE_DEPRECATED -DGDK_DISABLE_DEPRECATED -DGNOME_DISABLE_DEPRECATED -ansi -Wall -Wmissing-prototypes -Wmissing-declarations -Werror -g -O2 -MT gui.o -MD -MP -MF .deps/gui.Tpo -c -o gui.o gui.c
  58. gui.c: En la función ‘draw_digits’:
  59. gui.c:86:9: error: declaración implícita de la función ‘gdk_draw_drawable’ [-Werror=implicit-function-declaration]
  60. gdk_draw_drawable( widget->window,
  61. ^
  62. gui.c:88:28: error: declaración implícita de la función ‘GTK_WIDGET_STATE’ [-Werror=implicit-function-declaration]
  63. (widget) ], theme, x, y + highLow,
  64. ^
  65. gui.c: En la función ‘start_timer’:
  66. gui.c:264:31: error: ‘GtkFunction’ no se declaró aquí (primer uso en esta función)
  67. (GtkFunction) update_sensor_data,
  68. ^
  69. gui.c:264:31: nota: cada identificador sin declarar se reporta sólo una vez para cada función en el que aparece
  70. gui.c:264:44: error: expected ‘)’ before ‘update_sensor_data’
  71. (GtkFunction) update_sensor_data,
  72. ^
  73. gui.c:265:9: error: faltan argumentos para la función ‘g_timeout_add’
  74. (gpointer) data );
  75. ^
  76. In file included from /usr/include/glib-2.0/glib/giochannel.h:35:0,
  77. from /usr/include/glib-2.0/glib.h:56,
  78. from main.h:28,
  79. from gui.c:21:
  80. /usr/include/glib-2.0/glib/gmain.h:560:10: nota: se declara aquí
  81. guint g_timeout_add (guint interval,
  82. ^
  83. gui.c:260:10: error: se define la variable ‘timer’ pero no se usa [-Werror=unused-but-set-variable]
  84. gint timer;
  85. ^
  86. gui.c: En la función ‘add_sensor_tab’:
  87. gui.c:290:31: error: se define la variable ‘prev’ pero no se usa [-Werror=unused-but-set-variable]
  88. updates *current = NULL, *prev = NULL;
  89. ^
  90. gui.c: En la función ‘start_gui’:
  91. gui.c:489:17: error: declaración implícita de la función ‘gdk_pixmap_colormap_create_from_xpm’ [-Werror=implicit-function-declaration]
  92. theme = gdk_pixmap_colormap_create_from_xpm( NULL, cmap,
  93. ^
  94. gui.c:489:23: error: la asignación crea un puntero desde un entero sin una conversión [-Werror]
  95. theme = gdk_pixmap_colormap_create_from_xpm( NULL, cmap,
  96. ^
  97. gui.c:493:19: error: la asignación crea un puntero desde un entero sin una conversión [-Werror]
  98. theme = gdk_pixmap_colormap_create_from_xpm( NULL, cmap,
  99. ^
  100. gui.c:503:19: error: la asignación crea un puntero desde un entero sin una conversión [-Werror]
  101. theme = gdk_pixmap_colormap_create_from_xpm( NULL, cmap,
  102. ^
  103. cc1: todos los avisos se tratan como errores
  104. Makefile:246: recipe for target 'gui.o' failed
  105. make[2]: *** [gui.o] Error 1
  106. make[2]: Leaving directory '/home/antonio/xsensors/xsensors-0.70/src'
  107. Makefile:239: recipe for target 'all-recursive' failed
  108. make[1]: *** [all-recursive] Error 1
  109. make[1]: Leaving directory '/home/antonio/xsensors/xsensors-0.70'
  110. Makefile:178: recipe for target 'all' failed
  111. make: *** [all] Error 2
  112. [antonio@Antonio-Arch xsensors-0.70]$
Add Comment
Please, Sign In to add comment