TechieAndroid

Blender split kernel error

Nov 20th, 2020
1,513
Never
Not a member of Pastebin yet? Sign Up, it unlocks many cool features!
  1. Read prefs: /home/recompiler/.config/blender/2.92/config/userpref.blend
  2. [ALSOFT] (EE) Failed to set real-time priority for thread: Operation not permitted (1)
  3. [ALSOFT] (EE) Failed to set real-time priority for thread: Operation not permitted (1)
  4. LLVM triggered Diagnostic Handler: Illegal instruction detected: VOP* instruction violates constant bus restriction
  5. renamable $vgpr4 = V_CNDMASK_B32_e32 32768, killed $vgpr5, implicit killed $vcc, implicit $exec
  6. LLVM failed to compile shader
  7. radeonsi: can't compile a main shader part
  8. LLVM triggered Diagnostic Handler: Illegal instruction detected: VOP* instruction violates constant bus restriction
  9. renamable $vgpr4 = V_CNDMASK_B32_e32 32768, killed $vgpr4, implicit killed $vcc, implicit $exec
  10. LLVM failed to compile shader
  11. radeonsi: can't compile a main shader part
  12. Read blend: /home/recompiler/blender/donut-tut.blend
  13. Writing userprefs: '/home/recompiler/.config/blender/2.92/config/userpref.blend' ok
  14. Cycles: compiling OpenCL program base...
  15. Cycles: compiling OpenCL program background...
  16. [ALSOFT] (EE) Failed to set real-time priority for thread: Operation not permitted (1)
  17. [ALSOFT] (EE) Failed to set real-time priority for thread: Operation not permitted (1)
  18. [ALSOFT] (EE) Failed to set real-time priority for thread: Operation not permitted (1)
  19. [ALSOFT] (EE) Failed to set real-time priority for thread: Operation not permitted (1)
  20. Cycles: compiling OpenCL program background...
  21. Kernel compilation of base finished in 2.66s.
  22. OpenCL build failed with error CL_BUILD_PROGRAM_FAILURE, errors in console.
  23. OpenCL program background build output: source/kernel/kernels/opencl/kernel_opencl_image.h:284:47: error: use of undeclared identifier 'acc'
  24.     return svm_image_texture_read_3d(kg, id, &acc, ix, iy, iz);
  25.                                               ^
  26. source/kernel/kernels/opencl/kernel_opencl_image.h:295:44: error: use of undeclared identifier 'acc'
  27.         svm_image_texture_read_3d(kg, id, &acc, ix, iy, iz);
  28.                                            ^
  29. source/kernel/kernels/opencl/kernel_opencl_image.h:296:78: error: use of undeclared identifier 'acc'
  30.     r += (1.0f - tz) * (1.0f - ty) * tx * svm_image_texture_read_3d(kg, id, &acc, ix + 1, iy, iz);
  31.                                                                              ^
  32. source/kernel/kernels/opencl/kernel_opencl_image.h:297:78: error: use of undeclared identifier 'acc'
  33.     r += (1.0f - tz) * ty * (1.0f - tx) * svm_image_texture_read_3d(kg, id, &acc, ix, iy + 1, iz);
  34.                                                                              ^
  35. source/kernel/kernels/opencl/kernel_opencl_image.h:298:69: error: use of undeclared identifier 'acc'
  36.     r += (1.0f - tz) * ty * tx * svm_image_texture_read_3d(kg, id, &acc, ix + 1, iy + 1, iz);
  37.                                                                     ^
  38. source/kernel/kernels/opencl/kernel_opencl_image.h:300:78: error: use of undeclared identifier 'acc'
  39.     r += tz * (1.0f - ty) * (1.0f - tx) * svm_image_texture_read_3d(kg, id, &acc, ix, iy, iz + 1);
  40.                                                                              ^
  41. source/kernel/kernels/opencl/kernel_opencl_image.h:301:69: error: use of undeclared identifier 'acc'
  42.     r += tz * (1.0f - ty) * tx * svm_image_texture_read_3d(kg, id, &acc, ix + 1, iy, iz + 1);
  43.                                                                     ^
  44. source/kernel/kernels/opencl/kernel_opencl_image.h:302:69: error: use of undeclared identifier 'acc'
  45.     r += tz * ty * (1.0f - tx) * svm_image_texture_read_3d(kg, id, &acc, ix, iy + 1, iz + 1);
  46.                                                                     ^
  47. source/kernel/kernels/opencl/kernel_opencl_image.h:303:60: error: use of undeclared identifier 'acc'
  48.     r += tz * ty * tx * svm_image_texture_read_3d(kg, id, &acc, ix + 1, iy + 1, iz + 1);
  49.                                                            ^
  50. source/kernel/kernels/opencl/kernel_opencl_image.h:325:51: error: use of undeclared identifier 'acc'
  51.                svm_image_texture_read_3d(kg, id, &acc, ix + x - 1, iy + y - 1, iz + z - 1);
  52.                                                   ^
  53. 10 errors generated.
  54.  
  55. error: Clang front-end compilation failed!
  56. Frontend phase failed compilation.
  57. Error: Compiling CL to IR
  58.  
  59. Cycles: compiling OpenCL program split_subsurface_scatter...
  60. Cycles: compiling OpenCL program split_direct_lighting...
  61. Cycles: compiling OpenCL program split_indirect_background...
  62. Cycles: compiling OpenCL program split_shader_eval...
  63. Cycles: compiling OpenCL program split_lamp_emission...
  64. Cycles: compiling OpenCL program split_holdout_emission_blurring_pathtermination_ao...
  65. Cycles: compiling OpenCL program split_shadow_blocked_dl...
  66. [ALSOFT] (EE) Failed to set real-time priority for thread: Operation not permitted (1)
  67. [ALSOFT] (EE) Failed to set real-time priority for thread: Operation not permitted (1)
  68. [ALSOFT] (EE) Failed to set real-time priority for thread: Operation not permitted (1)
  69. [ALSOFT] (EE) Failed to set real-time priority for thread: Operation not permitted (1)
  70. [ALSOFT] (EE) Failed to set real-time priority for thread: Operation not permitted (1)
  71. [ALSOFT] (EE) Failed to set real-time priority for thread: Operation not permitted (1)
  72. [ALSOFT] (EE) Failed to set real-time priority for thread: Operation not permitted (1)
  73. [ALSOFT] (EE) Failed to set real-time priority for thread: Operation not permitted (1)
  74. [ALSOFT] (EE) Failed to set real-time priority for thread: Operation not permitted (1)
  75. [ALSOFT] (EE) Failed to set real-time priority for thread: Operation not permitted (1)
  76. [ALSOFT] (EE) Failed to set real-time priority for thread: Operation not permitted (1)
  77. [ALSOFT] (EE) Failed to set real-time priority for thread: Operation not permitted (1)
  78. [ALSOFT] (EE) Failed to set real-time priority for thread: Operation not permitted (1)
  79. [ALSOFT] (EE) Failed to set real-time priority for thread: Operation not permitted (1)
  80. Cycles: compiling OpenCL program split_bundle...
  81. Cycles: compiling OpenCL program split_subsurface_scatter...
  82. Cycles: compiling OpenCL program split_direct_lighting...
  83. Cycles: compiling OpenCL program split_indirect_background...
  84. OpenCL build failed with error CL_BUILD_PROGRAM_FAILURE, errors in console.
  85. OpenCL program split_subsurface_scatter build output: source/kernel/kernels/opencl/kernel_opencl_image.h:284:47: error: use of undeclared identifier 'acc'
  86.     return svm_image_texture_read_3d(kg, id, &acc, ix, iy, iz);
  87.                                               ^
  88. source/kernel/kernels/opencl/kernel_opencl_image.h:295:44: error: use of undeclared identifier 'acc'
  89.         svm_image_texture_read_3d(kg, id, &acc, ix, iy, iz);
  90.                                            ^
  91. source/kernel/kernels/opencl/kernel_opencl_image.h:296:78: error: use of undeclared identifier 'acc'
  92.     r += (1.0f - tz) * (1.0f - ty) * tx * svm_image_texture_read_3d(kg, id, &acc, ix + 1, iy, iz);
  93.                                                                              ^
  94. source/kernel/kernels/opencl/kernel_opencl_image.h:297:78: error: use of undeclared identifier 'acc'
  95.     r += (1.0f - tz) * ty * (1.0f - tx) * svm_image_texture_read_3d(kg, id, &acc, ix, iy + 1, iz);
  96.                                                                              ^
  97. source/kernel/kernels/opencl/kernel_opencl_image.h:298:69: error: use of undeclared identifier 'acc'
  98.     r += (1.0f - tz) * ty * tx * svm_image_texture_read_3d(kg, id, &acc, ix + 1, iy + 1, iz);
  99.                                                                     ^
  100. source/kernel/kernels/opencl/kernel_opencl_image.h:300:78: error: use of undeclared identifier 'acc'
  101.     r += tz * (1.0f - ty) * (1.0f - tx) * svm_image_texture_read_3d(kg, id, &acc, ix, iy, iz + 1);
  102.                                                                              ^
  103. source/kernel/kernels/opencl/kernel_opencl_image.h:301:69: error: use of undeclared identifier 'acc'
  104.     r += tz * (1.0f - ty) * tx * svm_image_texture_read_3d(kg, id, &acc, ix + 1, iy, iz + 1);
  105.                                                                     ^
  106. source/kernel/kernels/opencl/kernel_opencl_image.h:302:69: error: use of undeclared identifier 'acc'
  107.     r += tz * ty * (1.0f - tx) * svm_image_texture_read_3d(kg, id, &acc, ix, iy + 1, iz + 1);
  108.                                                                     ^
  109. source/kernel/kernels/opencl/kernel_opencl_image.h:303:60: error: use of undeclared identifier 'acc'
  110.     r += tz * ty * tx * svm_image_texture_read_3d(kg, id, &acc, ix + 1, iy + 1, iz + 1);
  111.                                                            ^
  112. source/kernel/kernels/opencl/kernel_opencl_image.h:325:51: error: use of undeclared identifier 'acc'
  113.                svm_image_texture_read_3d(kg, id, &acc, ix + x - 1, iy + y - 1, iz + z - 1);
  114.                                                   ^
  115. 10 errors generated.
  116.  
  117. error: Clang front-end compilation failed!
  118. Frontend phase failed compilation.
  119. Error: Compiling CL to IR
  120.  
  121. Cycles: compiling OpenCL program split_shadow_blocked_ao...
  122. OpenCL build failed with error CL_BUILD_PROGRAM_FAILURE, errors in console.
  123. OpenCL program split_indirect_background build output: source/kernel/kernels/opencl/kernel_opencl_image.h:284:47: error: use of undeclared identifier 'acc'
  124.     return svm_image_texture_read_3d(kg, id, &acc, ix, iy, iz);
  125.                                               ^
  126. source/kernel/kernels/opencl/kernel_opencl_image.h:295:44: error: use of undeclared identifier 'acc'
  127.         svm_image_texture_read_3d(kg, id, &acc, ix, iy, iz);
  128.                                            ^
  129. source/kernel/kernels/opencl/kernel_opencl_image.h:296:78: error: use of undeclared identifier 'acc'
  130.     r += (1.0f - tz) * (1.0f - ty) * tx * svm_image_texture_read_3d(kg, id, &acc, ix + 1, iy, iz);
  131.                                                                              ^
  132. source/kernel/kernels/opencl/kernel_opencl_image.h:297:78: error: use of undeclared identifier 'acc'
  133.     r += (1.0f - tz) * ty * (1.0f - tx) * svm_image_texture_read_3d(kg, id, &acc, ix, iy + 1, iz);
  134.                                                                              ^
  135. source/kernel/kernels/opencl/kernel_opencl_image.h:298:69: error: use of undeclared identifier 'acc'
  136.     r += (1.0f - tz) * ty * tx * svm_image_texture_read_3d(kg, id, &acc, ix + 1, iy + 1, iz);
  137.                                                                     ^
  138. source/kernel/kernels/opencl/kernel_opencl_image.h:300:78: error: use of undeclared identifier 'acc'
  139.     r += tz * (1.0f - ty) * (1.0f - tx) * svm_image_texture_read_3d(kg, id, &acc, ix, iy, iz + 1);
  140.                                                                              ^
  141. source/kernel/kernels/opencl/kernel_opencl_image.h:301:69: error: use of undeclared identifier 'acc'
  142.     r += tz * (1.0f - ty) * tx * svm_image_texture_read_3d(kg, id, &acc, ix + 1, iy, iz + 1);
  143.                                                                     ^
  144. source/kernel/kernels/opencl/kernel_opencl_image.h:302:69: error: use of undeclared identifier 'acc'
  145.     r += tz * ty * (1.0f - tx) * svm_image_texture_read_3d(kg, id, &acc, ix, iy + 1, iz + 1);
  146.                                                                     ^
  147. source/kernel/kernels/opencl/kernel_opencl_image.h:303:60: error: use of undeclared identifier 'acc'
  148.     r += tz * ty * tx * svm_image_texture_read_3d(kg, id, &acc, ix + 1, iy + 1, iz + 1);
  149.                                                            ^
  150. source/kernel/kernels/opencl/kernel_opencl_image.h:325:51: error: use of undeclared identifier 'acc'
  151.                svm_image_texture_read_3d(kg, id, &acc, ix + x - 1, iy + y - 1, iz + z - 1);
  152.                                                   ^
  153. 10 errors generated.
  154.  
  155. error: Clang front-end compilation failed!
  156. Frontend phase failed compilation.
  157. Error: Compiling CL to IR
  158.  
  159. Cycles: compiling OpenCL program split_shadow_blocked_dl...
  160. Cycles: compiling OpenCL program split_lamp_emission...
  161. OpenCL build failed with error CL_BUILD_PROGRAM_FAILURE, errors in console.
  162. OpenCL program split_direct_lighting build output: source/kernel/kernels/opencl/kernel_opencl_image.h:284:47: error: use of undeclared identifier 'acc'
  163.     return svm_image_texture_read_3d(kg, id, &acc, ix, iy, iz);
  164.                                               ^
  165. source/kernel/kernels/opencl/kernel_opencl_image.h:295:44: error: use of undeclared identifier 'acc'
  166.         svm_image_texture_read_3d(kg, id, &acc, ix, iy, iz);
  167.                                            ^
  168. source/kernel/kernels/opencl/kernel_opencl_image.h:296:78: error: use of undeclared identifier 'acc'
  169.     r += (1.0f - tz) * (1.0f - ty) * tx * svm_image_texture_read_3d(kg, id, &acc, ix + 1, iy, iz);
  170.                                                                              ^
  171. source/kernel/kernels/opencl/kernel_opencl_image.h:297:78: error: use of undeclared identifier 'acc'
  172.     r += (1.0f - tz) * ty * (1.0f - tx) * svm_image_texture_read_3d(kg, id, &acc, ix, iy + 1, iz);
  173.                                                                              ^
  174. source/kernel/kernels/opencl/kernel_opencl_image.h:298:69: error: use of undeclared identifier 'acc'
  175.     r += (1.0f - tz) * ty * tx * svm_image_texture_read_3d(kg, id, &acc, ix + 1, iy + 1, iz);
  176.                                                                     ^
  177. source/kernel/kernels/opencl/kernel_opencl_image.h:300:78: error: use of undeclared identifier 'acc'
  178.     r += tz * (1.0f - ty) * (1.0f - tx) * svm_image_texture_read_3d(kg, id, &acc, ix, iy, iz + 1);
  179.                                                                              ^
  180. source/kernel/kernels/opencl/kernel_opencl_image.h:301:69: error: use of undeclared identifier 'acc'
  181.     r += tz * (1.0f - ty) * tx * svm_image_texture_read_3d(kg, id, &acc, ix + 1, iy, iz + 1);
  182.                                                                     ^
  183. source/kernel/kernels/opencl/kernel_opencl_image.h:302:69: error: use of undeclared identifier 'acc'
  184.     r += tz * ty * (1.0f - tx) * svm_image_texture_read_3d(kg, id, &acc, ix, iy + 1, iz + 1);
  185.                                                                     ^
  186. source/kernel/kernels/opencl/kernel_opencl_image.h:303:60: error: use of undeclared identifier 'acc'
  187.     r += tz * ty * tx * svm_image_texture_read_3d(kg, id, &acc, ix + 1, iy + 1, iz + 1);
  188.                                                            ^
  189. source/kernel/kernels/opencl/kernel_opencl_image.h:325:51: error: use of undeclared identifier 'acc'
  190.                svm_image_texture_read_3d(kg, id, &acc, ix + x - 1, iy + y - 1, iz + z - 1);
  191.                                                   ^
  192. 10 errors generated.
  193.  
  194. error: Clang front-end compilation failed!
  195. Frontend phase failed compilation.
  196. Error: Compiling CL to IR
  197.  
  198. Cycles: compiling OpenCL program split_holdout_emission_blurring_pathtermination_ao...
  199. Cycles: compiling OpenCL program split_shader_eval...
  200. OpenCL build failed with error CL_BUILD_PROGRAM_FAILURE, errors in console.
  201. OpenCL program split_lamp_emission build output: source/kernel/kernels/opencl/kernel_opencl_image.h:284:47: error: use of undeclared identifier 'acc'
  202.     return svm_image_texture_read_3d(kg, id, &acc, ix, iy, iz);
  203.                                               ^
  204. source/kernel/kernels/opencl/kernel_opencl_image.h:295:44: error: use of undeclared identifier 'acc'
  205.         svm_image_texture_read_3d(kg, id, &acc, ix, iy, iz);
  206.                                            ^
  207. source/kernel/kernels/opencl/kernel_opencl_image.h:296:78: error: use of undeclared identifier 'acc'
  208.     r += (1.0f - tz) * (1.0f - ty) * tx * svm_image_texture_read_3d(kg, id, &acc, ix + 1, iy, iz);
  209.                                                                              ^
  210. source/kernel/kernels/opencl/kernel_opencl_image.h:297:78: error: use of undeclared identifier 'acc'
  211.     r += (1.0f - tz) * ty * (1.0f - tx) * svm_image_texture_read_3d(kg, id, &acc, ix, iy + 1, iz);
  212.                                                                              ^
  213. source/kernel/kernels/opencl/kernel_opencl_image.h:298:69: error: use of undeclared identifier 'acc'
  214.     r += (1.0f - tz) * ty * tx * svm_image_texture_read_3d(kg, id, &acc, ix + 1, iy + 1, iz);
  215.                                                                     ^
  216. source/kernel/kernels/opencl/kernel_opencl_image.h:300:78: error: use of undeclared identifier 'acc'
  217.     r += tz * (1.0f - ty) * (1.0f - tx) * svm_image_texture_read_3d(kg, id, &acc, ix, iy, iz + 1);
  218.                                                                              ^
  219. source/kernel/kernels/opencl/kernel_opencl_image.h:301:69: error: use of undeclared identifier 'acc'
  220.     r += tz * (1.0f - ty) * tx * svm_image_texture_read_3d(kg, id, &acc, ix + 1, iy, iz + 1);
  221.                                                                     ^
  222. source/kernel/kernels/opencl/kernel_opencl_image.h:302:69: error: use of undeclared identifier 'acc'
  223.     r += tz * ty * (1.0f - tx) * svm_image_texture_read_3d(kg, id, &acc, ix, iy + 1, iz + 1);
  224.                                                                     ^
  225. source/kernel/kernels/opencl/kernel_opencl_image.h:303:60: error: use of undeclared identifier 'acc'
  226.     r += tz * ty * tx * svm_image_texture_read_3d(kg, id, &acc, ix + 1, iy + 1, iz + 1);
  227.                                                            ^
  228. source/kernel/kernels/opencl/kernel_opencl_image.h:325:51: error: use of undeclared identifier 'acc'
  229.                svm_image_texture_read_3d(kg, id, &acc, ix + x - 1, iy + y - 1, iz + z - 1);
  230.                                                   ^
  231. 10 errors generated.
  232.  
  233. error: Clang front-end compilation failed!
  234. Frontend phase failed compilation.
  235. Error: Compiling CL to IR
  236.  
  237. OpenCL build failed with error CL_BUILD_PROGRAM_FAILURE, errors in console.
  238. OpenCL program split_shader_eval build output: source/kernel/kernels/opencl/kernel_opencl_image.h:284:47: error: use of undeclared identifier 'acc'
  239.     return svm_image_texture_read_3d(kg, id, &acc, ix, iy, iz);
  240.                                               ^
  241. source/kernel/kernels/opencl/kernel_opencl_image.h:295:44: error: use of undeclared identifier 'acc'
  242.         svm_image_texture_read_3d(kg, id, &acc, ix, iy, iz);
  243.                                            ^
  244. source/kernel/kernels/opencl/kernel_opencl_image.h:296:78: error: use of undeclared identifier 'acc'
  245.     r += (1.0f - tz) * (1.0f - ty) * tx * svm_image_texture_read_3d(kg, id, &acc, ix + 1, iy, iz);
  246.                                                                              ^
  247. source/kernel/kernels/opencl/kernel_opencl_image.h:297:78: error: use of undeclared identifier 'acc'
  248.     r += (1.0f - tz) * ty * (1.0f - tx) * svm_image_texture_read_3d(kg, id, &acc, ix, iy + 1, iz);
  249.                                                                              ^
  250. source/kernel/kernels/opencl/kernel_opencl_image.h:298:69: error: use of undeclared identifier 'acc'
  251.     r += (1.0f - tz) * ty * tx * svm_image_texture_read_3d(kg, id, &acc, ix + 1, iy + 1, iz);
  252.                                                                     ^
  253. source/kernel/kernels/opencl/kernel_opencl_image.h:300:78: error: use of undeclared identifier 'acc'
  254.     r += tz * (1.0f - ty) * (1.0f - tx) * svm_image_texture_read_3d(kg, id, &acc, ix, iy, iz + 1);
  255.                                                                              ^
  256. source/kernel/kernels/opencl/kernel_opencl_image.h:301:69: error: use of undeclared identifier 'acc'
  257.     r += tz * (1.0f - ty) * tx * svm_image_texture_read_3d(kg, id, &acc, ix + 1, iy, iz + 1);
  258.                                                                     ^
  259. source/kernel/kernels/opencl/kernel_opencl_image.h:302:69: error: use of undeclared identifier 'acc'
  260.     r += tz * ty * (1.0f - tx) * svm_image_texture_read_3d(kg, id, &acc, ix, iy + 1, iz + 1);
  261.                                                                     ^
  262. source/kernel/kernels/opencl/kernel_opencl_image.h:303:60: error: use of undeclared identifier 'acc'
  263.     r += tz * ty * tx * svm_image_texture_read_3d(kg, id, &acc, ix + 1, iy + 1, iz + 1);
  264.                                                            ^
  265. source/kernel/kernels/opencl/kernel_opencl_image.h:325:51: error: use of undeclared identifier 'acc'
  266.                svm_image_texture_read_3d(kg, id, &acc, ix + x - 1, iy + y - 1, iz + z - 1);
  267.                                                   ^
  268. 10 errors generated.
  269.  
  270. error: Clang front-end compilation failed!
  271. Frontend phase failed compilation.
  272. Error: Compiling CL to IR
  273.  
  274. [ALSOFT] (EE) Failed to set real-time priority for thread: Operation not permitted (1)
  275. [ALSOFT] (EE) Failed to set real-time priority for thread: Operation not permitted (1)
  276. [ALSOFT] (EE) Failed to set real-time priority for thread: Operation not permitted (1)
  277. [ALSOFT] (EE) Failed to set real-time priority for thread: Operation not permitted (1)
  278. OpenCL build failed with error CL_BUILD_PROGRAM_FAILURE, errors in console.
  279. OpenCL program split_holdout_emission_blurring_pathtermination_ao build output: source/kernel/kernels/opencl/kernel_opencl_image.h:284:47: error: use of undeclared identifier 'acc'
  280.     return svm_image_texture_read_3d(kg, id, &acc, ix, iy, iz);
  281.                                               ^
  282. source/kernel/kernels/opencl/kernel_opencl_image.h:295:44: error: use of undeclared identifier 'acc'
  283.         svm_image_texture_read_3d(kg, id, &acc, ix, iy, iz);
  284.                                            ^
  285. source/kernel/kernels/opencl/kernel_opencl_image.h:296:78: error: use of undeclared identifier 'acc'
  286.     r += (1.0f - tz) * (1.0f - ty) * tx * svm_image_texture_read_3d(kg, id, &acc, ix + 1, iy, iz);
  287.                                                                              ^
  288. source/kernel/kernels/opencl/kernel_opencl_image.h:297:78: error: use of undeclared identifier 'acc'
  289.     r += (1.0f - tz) * ty * (1.0f - tx) * svm_image_texture_read_3d(kg, id, &acc, ix, iy + 1, iz);
  290.                                                                              ^
  291. source/kernel/kernels/opencl/kernel_opencl_image.h:298:69: error: use of undeclared identifier 'acc'
  292.     r += (1.0f - tz) * ty * tx * svm_image_texture_read_3d(kg, id, &acc, ix + 1, iy + 1, iz);
  293.                                                                     ^
  294. source/kernel/kernels/opencl/kernel_opencl_image.h:300:78: error: use of undeclared identifier 'acc'
  295.     r += tz * (1.0f - ty) * (1.0f - tx) * svm_image_texture_read_3d(kg, id, &acc, ix, iy, iz + 1);
  296.                                                                              ^
  297. source/kernel/kernels/opencl/kernel_opencl_image.h:301:69: error: use of undeclared identifier 'acc'
  298.     r += tz * (1.0f - ty) * tx * svm_image_texture_read_3d(kg, id, &acc, ix + 1, iy, iz + 1);
  299.                                                                     ^
  300. source/kernel/kernels/opencl/kernel_opencl_image.h:302:69: error: use of undeclared identifier 'acc'
  301.     r += tz * ty * (1.0f - tx) * svm_image_texture_read_3d(kg, id, &acc, ix, iy + 1, iz + 1);
  302.                                                                     ^
  303. source/kernel/kernels/opencl/kernel_opencl_image.h:303:60: error: use of undeclared identifier 'acc'
  304.     r += tz * ty * tx * svm_image_texture_read_3d(kg, id, &acc, ix + 1, iy + 1, iz + 1);
  305.                                                            ^
  306. source/kernel/kernels/opencl/kernel_opencl_image.h:325:51: error: use of undeclared identifier 'acc'
  307.                svm_image_texture_read_3d(kg, id, &acc, ix + x - 1, iy + y - 1, iz + z - 1);
  308.                                                   ^
  309. 10 errors generated.
  310.  
  311. error: Clang front-end compilation failed!
  312. Frontend phase failed compilation.
  313. Error: Compiling CL to IR
  314.  
  315. OpenCL build failed with error CL_BUILD_PROGRAM_FAILURE, errors in console.
  316. OpenCL program split_shadow_blocked_dl build output: source/kernel/kernels/opencl/kernel_opencl_image.h:284:47: error: use of undeclared identifier 'acc'
  317.     return svm_image_texture_read_3d(kg, id, &acc, ix, iy, iz);
  318.                                               ^
  319. source/kernel/kernels/opencl/kernel_opencl_image.h:295:44: error: use of undeclared identifier 'acc'
  320.         svm_image_texture_read_3d(kg, id, &acc, ix, iy, iz);
  321.                                            ^
  322. source/kernel/kernels/opencl/kernel_opencl_image.h:296:78: error: use of undeclared identifier 'acc'
  323.     r += (1.0f - tz) * (1.0f - ty) * tx * svm_image_texture_read_3d(kg, id, &acc, ix + 1, iy, iz);
  324.                                                                              ^
  325. source/kernel/kernels/opencl/kernel_opencl_image.h:297:78: error: use of undeclared identifier 'acc'
  326.     r += (1.0f - tz) * ty * (1.0f - tx) * svm_image_texture_read_3d(kg, id, &acc, ix, iy + 1, iz);
  327.                                                                              ^
  328. source/kernel/kernels/opencl/kernel_opencl_image.h:298:69: error: use of undeclared identifier 'acc'
  329.     r += (1.0f - tz) * ty * tx * svm_image_texture_read_3d(kg, id, &acc, ix + 1, iy + 1, iz);
  330.                                                                     ^
  331. source/kernel/kernels/opencl/kernel_opencl_image.h:300:78: error: use of undeclared identifier 'acc'
  332.     r += tz * (1.0f - ty) * (1.0f - tx) * svm_image_texture_read_3d(kg, id, &acc, ix, iy, iz + 1);
  333.                                                                              ^
  334. source/kernel/kernels/opencl/kernel_opencl_image.h:301:69: error: use of undeclared identifier 'acc'
  335.     r += tz * (1.0f - ty) * tx * svm_image_texture_read_3d(kg, id, &acc, ix + 1, iy, iz + 1);
  336.                                                                     ^
  337. source/kernel/kernels/opencl/kernel_opencl_image.h:302:69: error: use of undeclared identifier 'acc'
  338.     r += tz * ty * (1.0f - tx) * svm_image_texture_read_3d(kg, id, &acc, ix, iy + 1, iz + 1);
  339.                                                                     ^
  340. source/kernel/kernels/opencl/kernel_opencl_image.h:303:60: error: use of undeclared identifier 'acc'
  341.     r += tz * ty * tx * svm_image_texture_read_3d(kg, id, &acc, ix + 1, iy + 1, iz + 1);
  342.                                                            ^
  343. source/kernel/kernels/opencl/kernel_opencl_image.h:325:51: error: use of undeclared identifier 'acc'
  344.                svm_image_texture_read_3d(kg, id, &acc, ix + x - 1, iy + y - 1, iz + z - 1);
  345.                                                   ^
  346. 10 errors generated.
  347.  
  348. error: Clang front-end compilation failed!
  349. Frontend phase failed compilation.
  350. Error: Compiling CL to IR
  351.  
  352. Cycles: compiling OpenCL program split_bundle...
  353. Cycles: compiling OpenCL program split_shadow_blocked_ao...
  354. OpenCL build failed with error CL_BUILD_PROGRAM_FAILURE, errors in console.
  355. OpenCL program split_bundle build output: source/kernel/kernels/opencl/kernel_opencl_image.h:284:47: error: use of undeclared identifier 'acc'
  356.     return svm_image_texture_read_3d(kg, id, &acc, ix, iy, iz);
  357.                                               ^
  358. source/kernel/kernels/opencl/kernel_opencl_image.h:295:44: error: use of undeclared identifier 'acc'
  359.         svm_image_texture_read_3d(kg, id, &acc, ix, iy, iz);
  360.                                            ^
  361. source/kernel/kernels/opencl/kernel_opencl_image.h:296:78: error: use of undeclared identifier 'acc'
  362.     r += (1.0f - tz) * (1.0f - ty) * tx * svm_image_texture_read_3d(kg, id, &acc, ix + 1, iy, iz);
  363.                                                                              ^
  364. source/kernel/kernels/opencl/kernel_opencl_image.h:297:78: error: use of undeclared identifier 'acc'
  365.     r += (1.0f - tz) * ty * (1.0f - tx) * svm_image_texture_read_3d(kg, id, &acc, ix, iy + 1, iz);
  366.                                                                              ^
  367. source/kernel/kernels/opencl/kernel_opencl_image.h:298:69: error: use of undeclared identifier 'acc'
  368.     r += (1.0f - tz) * ty * tx * svm_image_texture_read_3d(kg, id, &acc, ix + 1, iy + 1, iz);
  369.                                                                     ^
  370. source/kernel/kernels/opencl/kernel_opencl_image.h:300:78: error: use of undeclared identifier 'acc'
  371.     r += tz * (1.0f - ty) * (1.0f - tx) * svm_image_texture_read_3d(kg, id, &acc, ix, iy, iz + 1);
  372.                                                                              ^
  373. source/kernel/kernels/opencl/kernel_opencl_image.h:301:69: error: use of undeclared identifier 'acc'
  374.     r += tz * (1.0f - ty) * tx * svm_image_texture_read_3d(kg, id, &acc, ix + 1, iy, iz + 1);
  375.                                                                     ^
  376. source/kernel/kernels/opencl/kernel_opencl_image.h:302:69: error: use of undeclared identifier 'acc'
  377.     r += tz * ty * (1.0f - tx) * svm_image_texture_read_3d(kg, id, &acc, ix, iy + 1, iz + 1);
  378.                                                                     ^
  379. source/kernel/kernels/opencl/kernel_opencl_image.h:303:60: error: use of undeclared identifier 'acc'
  380.     r += tz * ty * tx * svm_image_texture_read_3d(kg, id, &acc, ix + 1, iy + 1, iz + 1);
  381.                                                            ^
  382. source/kernel/kernels/opencl/kernel_opencl_image.h:325:51: error: use of undeclared identifier 'acc'
  383.                svm_image_texture_read_3d(kg, id, &acc, ix + x - 1, iy + y - 1, iz + z - 1);
  384.                                                   ^
  385. 10 errors generated.
  386.  
  387. error: Clang front-end compilation failed!
  388. Frontend phase failed compilation.
  389. Error: Compiling CL to IR
  390.  
  391. OpenCL build failed with error CL_BUILD_PROGRAM_FAILURE, errors in console.
  392. OpenCL program split_shadow_blocked_ao build output: source/kernel/kernels/opencl/kernel_opencl_image.h:284:47: error: use of undeclared identifier 'acc'
  393.     return svm_image_texture_read_3d(kg, id, &acc, ix, iy, iz);
  394.                                               ^
  395. source/kernel/kernels/opencl/kernel_opencl_image.h:295:44: error: use of undeclared identifier 'acc'
  396.         svm_image_texture_read_3d(kg, id, &acc, ix, iy, iz);
  397.                                            ^
  398. source/kernel/kernels/opencl/kernel_opencl_image.h:296:78: error: use of undeclared identifier 'acc'
  399.     r += (1.0f - tz) * (1.0f - ty) * tx * svm_image_texture_read_3d(kg, id, &acc, ix + 1, iy, iz);
  400.                                                                              ^
  401. source/kernel/kernels/opencl/kernel_opencl_image.h:297:78: error: use of undeclared identifier 'acc'
  402.     r += (1.0f - tz) * ty * (1.0f - tx) * svm_image_texture_read_3d(kg, id, &acc, ix, iy + 1, iz);
  403.                                                                              ^
  404. source/kernel/kernels/opencl/kernel_opencl_image.h:298:69: error: use of undeclared identifier 'acc'
  405.     r += (1.0f - tz) * ty * tx * svm_image_texture_read_3d(kg, id, &acc, ix + 1, iy + 1, iz);
  406.                                                                     ^
  407. source/kernel/kernels/opencl/kernel_opencl_image.h:300:78: error: use of undeclared identifier 'acc'
  408.     r += tz * (1.0f - ty) * (1.0f - tx) * svm_image_texture_read_3d(kg, id, &acc, ix, iy, iz + 1);
  409.                                                                              ^
  410. source/kernel/kernels/opencl/kernel_opencl_image.h:301:69: error: use of undeclared identifier 'acc'
  411.     r += tz * (1.0f - ty) * tx * svm_image_texture_read_3d(kg, id, &acc, ix + 1, iy, iz + 1);
  412.                                                                     ^
  413. source/kernel/kernels/opencl/kernel_opencl_image.h:302:69: error: use of undeclared identifier 'acc'
  414.     r += tz * ty * (1.0f - tx) * svm_image_texture_read_3d(kg, id, &acc, ix, iy + 1, iz + 1);
  415.                                                                     ^
  416. source/kernel/kernels/opencl/kernel_opencl_image.h:303:60: error: use of undeclared identifier 'acc'
  417.     r += tz * ty * tx * svm_image_texture_read_3d(kg, id, &acc, ix + 1, iy + 1, iz + 1);
  418.                                                            ^
  419. source/kernel/kernels/opencl/kernel_opencl_image.h:325:51: error: use of undeclared identifier 'acc'
  420.                svm_image_texture_read_3d(kg, id, &acc, ix + x - 1, iy + y - 1, iz + z - 1);
  421.                                                   ^
  422. 10 errors generated.
  423.  
  424. error: Clang front-end compilation failed!
  425. Frontend phase failed compilation.
  426. Error: Compiling CL to IR
  427.  
  428. Split kernel error: failed to load kernel_path_init
  429. Error: Split kernel error: failed to load kernel_path_init
  430.  
  431. ^CPython: Traceback (most recent call last):
  432.   File "/usr/share/blender/2.92/scripts/startup/bl_ui/space_topbar.py", line 27, in draw
  433.     def draw(self, context):
  434. KeyboardInterrupt
  435.  
  436. location: <unknown location>:-1
  437. ^CPython: Traceback (most recent call last):
  438.   File "/usr/share/blender/2.92/scripts/startup/bl_ui/space_view3d.py", line 46, in draw
  439.     def draw(self, context):
  440. KeyboardInterrupt
  441.  
  442. location: <unknown location>:-1
  443. Saved session recovery to '/tmp/quit.blend'
  444.  
  445. Blender quit
RAW Paste Data