Guest User

Untitled

a guest
Mar 9th, 2019
94
Never
Not a member of Pastebin yet? Sign Up, it unlocks many cool features!
  1. /home/cereal/rockbox/firmware/target/arm/tcc780x/sd-tcc780x.c: In function ‘sd_read_sectors’:
  2. /home/cereal/rockbox/firmware/target/arm/tcc780x/sd-tcc780x.c:405: error: ‘CARD_NUM_SLOT’ undeclared (first use in this function)
  3. /home/cereal/rockbox/firmware/target/arm/tcc780x/sd-tcc780x.c:405: error: (Each undeclared identifier is reported only once
  4. /home/cereal/rockbox/firmware/target/arm/tcc780x/sd-tcc780x.c:405: error: for each function it appears in.)
  5. /home/cereal/rockbox/firmware/target/arm/tcc780x/sd-tcc780x.c:405: warning: implicit declaration of function ‘card_detect_target’
  6. /home/cereal/rockbox/firmware/target/arm/tcc780x/sd-tcc780x.c: In function ‘sd_write_sectors’:
  7. /home/cereal/rockbox/firmware/target/arm/tcc780x/sd-tcc780x.c:516: error: ‘CARD_NUM_SLOT’ undeclared (first use in this function)
  8. /home/cereal/rockbox/tools/root.make:436: recipe for target '/home/cereal/rockbox/D2_SD/firmware/target/arm/tcc780x/sd-tcc780x.o' failed
  9. make: *** [/home/cereal/rockbox/D2_SD/firmware/target/arm/tcc780x/sd-tcc780x.o] Error 1
  10. make: *** Waiting for unfinished jobs....
RAW Paste Data