daily pastebin goal
89%
SHARE
TWEET

handbrake error

timcowchip Jan 22nd, 2019 58 Never
Not a member of Pastebin yet? Sign Up, it unlocks many cool features!
  1.   :  /bin/mkdir -p '/home/timcowchip/timcowchip/handbrake/work/src/HandBrake-1.2.0/build/contrib/lib/pkgconfig'
  2.   :  /usr/bin/install -c -m 644 src/libbluray.pc '/home/timcowchip/timcowchip/handbrake/work/src/HandBrake-1.2.0/build/contrib/lib/pkgconfig'
  3.   :  /bin/mkdir -p '/home/timcowchip/timcowchip/handbrake/work/src/HandBrake-1.2.0/build/contrib/include/libbluray'
  4.   :  /usr/bin/install -c -m 644 src/file/filesystem.h src/libbluray/bluray.h src/libbluray/bluray-version.h src/libbluray/keys.h src/libbluray/player_settings.h src/libbluray/bdnav/clpi_data.h src/libbluray/bdnav/meta_data.h src/libbluray/decoders/overlay.h src/util/log_control.h '/home/timcowchip/timcowchip/handbrake/work/src/HandBrake-1.2.0/build/contrib/include/libbluray'
  5.   : make[2]: Leaving directory '/home/timcowchip/timcowchip/handbrake/work/src/HandBrake-1.2.0/build/contrib/libbluray/libbluray-1.0.2'
  6.   : make[1]: Leaving directory '/home/timcowchip/timcowchip/handbrake/work/src/HandBrake-1.2.0/build/contrib/libbluray/libbluray-1.0.2'
  7.   : touch contrib/libbluray/.stamp.libbluray.install
  8.   : /usr/bin/gcc -std=gnu99 -pipe -fmessage-length=0 -Wall -g0 -O3 -O2 -march=x86-64 -pipe -mfpmath=sse -msse2 -DUSE_FFMPEG_AAC -D__LIBHB__ -DUSE_PTHREAD -DSYS_LINUX -D_LARGEFILE_SOURCE -D_FILE_OFFSET_BITS=64 -DUSE_NVENC -DUSE_X265 -DHAS_STRERROR_R -DARCH_X86_64 -I./libhb/ -I./contrib/include -I/usr/include/libxml2 -c ../libhb/reader.c -o libhb/reader.o
  9.   : In file included from ../libhb/common.h:14:0,
  10.   :                  from ../libhb/hb.h:17,
  11.   :                  from ../libhb/reader.c:9:
  12.   : ../libhb/hb_dict.h:13:10: fatal error: jansson.h: No such file or directory
  13.   :  #include <jansson.h>
  14.   :           ^~~~~~~~~~~
  15.   : compilation terminated.
  16.   : make: *** [../libhb/module.rules:12: libhb/reader.o] Error 1
  17. -------------------------------------------------------------------------------
  18. time end: Tue Jan 22 01:31:20 2019
  19. duration: 23 minutes, 6 seconds (1386.15s)
  20. result: FAILURE (code 2)
RAW Paste Data
We use cookies for various purposes including analytics. By continuing to use Pastebin, you agree to our use of cookies as described in the Cookies Policy. OK, I Understand
 
Top