olemis

Bloodhound Trac test report - 2013/04/03

Apr 3rd, 2013
138
Never
Not a member of Pastebin yet? Sign Up, it unlocks many cool features!
  1.  
  2. $ hg log -r . --template="[{svnrev}] - {desc}\n"
  3. [1463560] - moving comment input to right hand column and correcting width - towards #471
  4.  
  5. $ make unit-test &> /tmp/trac-tests.nopatch.txt
  6.  It looks like you don't have a Makefile.cfg file yet.
  7. You can get started by doing `cp Makefile.cfg.sample Makefile.cfg'
  8.  and then adapt it to your environment.
  9. Python version: Python 2.6.5
  10. figleaf:
  11. coverage:
  12. PYTHONPATH=.:
  13. TRAC_TEST_DB_URI=
  14. server-options= -p 8000  -r -e
  15. python setup.py egg_info
  16. running egg_info
  17. writing requirements to Trac.egg-info/requires.txt
  18. writing Trac.egg-info/PKG-INFO
  19. writing top-level names to Trac.egg-info/top_level.txt
  20. writing dependency_links to Trac.egg-info/dependency_links.txt
  21. writing entry points to Trac.egg-info/entry_points.txt
  22. reading manifest file 'Trac.egg-info/SOURCES.txt'
  23. writing manifest file 'Trac.egg-info/SOURCES.txt'
  24. python ./trac/test.py --skip-functional-tests
  25. .............EEE................................................EE...................................................................................................................................................................................................................................................................................................EEEEEEEEEEEEEEE.....................................................................................................................................................................................................................................................................................................................................................................................................................................................................................................................................................................................................................................................................................................................................................................................................................EEEE....................................................................................................................................................................................................................
  26. ======================================================================
  27. ERROR: test_change_listener_created (trac.tests.attachment.AttachmentResourceChangeListenerTestCase)
  28. ----------------------------------------------------------------------
  29. Traceback (most recent call last):
  30.   File "/path/to/bloodhound/trac/trac/tests/attachment.py", line 242, in test_change_listener_created
  31.     self.assertIsInstance(self.listener.resource, Attachment)
  32. AttributeError: 'AttachmentResourceChangeListenerTestCase' object has no attribute 'assertIsInstance'
  33.  
  34. ======================================================================
  35. ERROR: test_change_listener_deleted (trac.tests.attachment.AttachmentResourceChangeListenerTestCase)
  36. ----------------------------------------------------------------------
  37. Traceback (most recent call last):
  38.   File "/path/to/bloodhound/trac/trac/tests/attachment.py", line 264, in test_change_listener_deleted
  39.     self.assertIsInstance(self.listener.resource, Attachment)
  40. AttributeError: 'AttachmentResourceChangeListenerTestCase' object has no attribute 'assertIsInstance'
  41.  
  42. ======================================================================
  43. ERROR: test_change_listener_reparent (trac.tests.attachment.AttachmentResourceChangeListenerTestCase)
  44. ----------------------------------------------------------------------
  45. Traceback (most recent call last):
  46.   File "/path/to/bloodhound/trac/trac/tests/attachment.py", line 252, in test_change_listener_reparent
  47.     self.assertIsInstance(self.listener.resource, Attachment)
  48. AttributeError: 'AttachmentResourceChangeListenerTestCase' object has no attribute 'assertIsInstance'
  49.  
  50. ======================================================================
  51. ERROR: Testing env.get_known_users
  52. ----------------------------------------------------------------------
  53. Traceback (most recent call last):
  54.   File "/path/to/bloodhound/trac/trac/tests/env.py", line 16, in setUp
  55.     self.addCleanup(self.cleanupEnvPath, env_path)
  56. AttributeError: 'EnvironmentTestCase' object has no attribute 'addCleanup'
  57.  
  58. ======================================================================
  59. ERROR: Testing env.get_version
  60. ----------------------------------------------------------------------
  61. Traceback (most recent call last):
  62.   File "/path/to/bloodhound/trac/trac/tests/env.py", line 16, in setUp
  63.     self.addCleanup(self.cleanupEnvPath, env_path)
  64. AttributeError: 'EnvironmentTestCase' object has no attribute 'addCleanup'
  65.  
  66. ======================================================================
  67. ERROR: test_change_listener_changed (trac.ticket.tests.model.ComponentResourceChangeListenerTestCase)
  68. ----------------------------------------------------------------------
  69. Traceback (most recent call last):
  70.   File "/path/to/bloodhound/trac/trac/ticket/tests/model.py", line 1105, in test_change_listener_changed
  71.     self.assertIsInstance(self.listener.resource, self.resource_type)
  72. AttributeError: 'ComponentResourceChangeListenerTestCase' object has no attribute 'assertIsInstance'
  73.  
  74. ======================================================================
  75. ERROR: test_change_listener_created (trac.ticket.tests.model.ComponentResourceChangeListenerTestCase)
  76. ----------------------------------------------------------------------
  77. Traceback (most recent call last):
  78.   File "/path/to/bloodhound/trac/trac/ticket/tests/model.py", line 1096, in test_change_listener_created
  79.     self.assertIsInstance(self.listener.resource, self.resource_type)
  80. AttributeError: 'ComponentResourceChangeListenerTestCase' object has no attribute 'assertIsInstance'
  81.  
  82. ======================================================================
  83. ERROR: test_change_listener_deleted (trac.ticket.tests.model.ComponentResourceChangeListenerTestCase)
  84. ----------------------------------------------------------------------
  85. Traceback (most recent call last):
  86.   File "/path/to/bloodhound/trac/trac/ticket/tests/model.py", line 1115, in test_change_listener_deleted
  87.     self.assertIsInstance(self.listener.resource, self.resource_type)
  88. AttributeError: 'ComponentResourceChangeListenerTestCase' object has no attribute 'assertIsInstance'
  89.  
  90. ======================================================================
  91. ERROR: test_change_listener_changed (trac.ticket.tests.model.VersionResourceChangeListenerTestCase)
  92. ----------------------------------------------------------------------
  93. Traceback (most recent call last):
  94.   File "/path/to/bloodhound/trac/trac/ticket/tests/model.py", line 1105, in test_change_listener_changed
  95.     self.assertIsInstance(self.listener.resource, self.resource_type)
  96. AttributeError: 'VersionResourceChangeListenerTestCase' object has no attribute 'assertIsInstance'
  97.  
  98. ======================================================================
  99. ERROR: test_change_listener_created (trac.ticket.tests.model.VersionResourceChangeListenerTestCase)
  100. ----------------------------------------------------------------------
  101. Traceback (most recent call last):
  102.   File "/path/to/bloodhound/trac/trac/ticket/tests/model.py", line 1096, in test_change_listener_created
  103.     self.assertIsInstance(self.listener.resource, self.resource_type)
  104. AttributeError: 'VersionResourceChangeListenerTestCase' object has no attribute 'assertIsInstance'
  105.  
  106. ======================================================================
  107. ERROR: test_change_listener_deleted (trac.ticket.tests.model.VersionResourceChangeListenerTestCase)
  108. ----------------------------------------------------------------------
  109. Traceback (most recent call last):
  110.   File "/path/to/bloodhound/trac/trac/ticket/tests/model.py", line 1115, in test_change_listener_deleted
  111.     self.assertIsInstance(self.listener.resource, self.resource_type)
  112. AttributeError: 'VersionResourceChangeListenerTestCase' object has no attribute 'assertIsInstance'
  113.  
  114. ======================================================================
  115. ERROR: test_change_listener_changed (trac.ticket.tests.model.PriorityResourceChangeListenerTestCase)
  116. ----------------------------------------------------------------------
  117. Traceback (most recent call last):
  118.   File "/path/to/bloodhound/trac/trac/ticket/tests/model.py", line 1105, in test_change_listener_changed
  119.     self.assertIsInstance(self.listener.resource, self.resource_type)
  120. AttributeError: 'PriorityResourceChangeListenerTestCase' object has no attribute 'assertIsInstance'
  121.  
  122. ======================================================================
  123. ERROR: test_change_listener_created (trac.ticket.tests.model.PriorityResourceChangeListenerTestCase)
  124. ----------------------------------------------------------------------
  125. Traceback (most recent call last):
  126.   File "/path/to/bloodhound/trac/trac/ticket/tests/model.py", line 1096, in test_change_listener_created
  127.     self.assertIsInstance(self.listener.resource, self.resource_type)
  128. AttributeError: 'PriorityResourceChangeListenerTestCase' object has no attribute 'assertIsInstance'
  129.  
  130. ======================================================================
  131. ERROR: test_change_listener_deleted (trac.ticket.tests.model.PriorityResourceChangeListenerTestCase)
  132. ----------------------------------------------------------------------
  133. Traceback (most recent call last):
  134.   File "/path/to/bloodhound/trac/trac/ticket/tests/model.py", line 1115, in test_change_listener_deleted
  135.     self.assertIsInstance(self.listener.resource, self.resource_type)
  136. AttributeError: 'PriorityResourceChangeListenerTestCase' object has no attribute 'assertIsInstance'
  137.  
  138. ======================================================================
  139. ERROR: test_change_listener_changed (trac.ticket.tests.model.MilestoneResourceChangeListenerTestCase)
  140. ----------------------------------------------------------------------
  141. Traceback (most recent call last):
  142.   File "/path/to/bloodhound/trac/trac/ticket/tests/model.py", line 1105, in test_change_listener_changed
  143.     self.assertIsInstance(self.listener.resource, self.resource_type)
  144. AttributeError: 'MilestoneResourceChangeListenerTestCase' object has no attribute 'assertIsInstance'
  145.  
  146. ======================================================================
  147. ERROR: test_change_listener_created (trac.ticket.tests.model.MilestoneResourceChangeListenerTestCase)
  148. ----------------------------------------------------------------------
  149. Traceback (most recent call last):
  150.   File "/path/to/bloodhound/trac/trac/ticket/tests/model.py", line 1096, in test_change_listener_created
  151.     self.assertIsInstance(self.listener.resource, self.resource_type)
  152. AttributeError: 'MilestoneResourceChangeListenerTestCase' object has no attribute 'assertIsInstance'
  153.  
  154. ======================================================================
  155. ERROR: test_change_listener_deleted (trac.ticket.tests.model.MilestoneResourceChangeListenerTestCase)
  156. ----------------------------------------------------------------------
  157. Traceback (most recent call last):
  158.   File "/path/to/bloodhound/trac/trac/ticket/tests/model.py", line 1115, in test_change_listener_deleted
  159.     self.assertIsInstance(self.listener.resource, self.resource_type)
  160. AttributeError: 'MilestoneResourceChangeListenerTestCase' object has no attribute 'assertIsInstance'
  161.  
  162. ======================================================================
  163. ERROR: test_change_listener_changed (trac.ticket.tests.model.TicketResourceChangeListenerTestCase)
  164. ----------------------------------------------------------------------
  165. Traceback (most recent call last):
  166.   File "/path/to/bloodhound/trac/trac/ticket/tests/model.py", line 1161, in test_change_listener_changed
  167.     self).test_change_listener_changed()
  168.   File "/path/to/bloodhound/trac/trac/ticket/tests/model.py", line 1105, in test_change_listener_changed
  169.     self.assertIsInstance(self.listener.resource, self.resource_type)
  170. AttributeError: 'TicketResourceChangeListenerTestCase' object has no attribute 'assertIsInstance'
  171.  
  172. ======================================================================
  173. ERROR: test_change_listener_created (trac.ticket.tests.model.TicketResourceChangeListenerTestCase)
  174. ----------------------------------------------------------------------
  175. Traceback (most recent call last):
  176.   File "/path/to/bloodhound/trac/trac/ticket/tests/model.py", line 1096, in test_change_listener_created
  177.     self.assertIsInstance(self.listener.resource, self.resource_type)
  178. AttributeError: 'TicketResourceChangeListenerTestCase' object has no attribute 'assertIsInstance'
  179.  
  180. ======================================================================
  181. ERROR: test_change_listener_deleted (trac.ticket.tests.model.TicketResourceChangeListenerTestCase)
  182. ----------------------------------------------------------------------
  183. Traceback (most recent call last):
  184.   File "/path/to/bloodhound/trac/trac/ticket/tests/model.py", line 1115, in test_change_listener_deleted
  185.     self.assertIsInstance(self.listener.resource, self.resource_type)
  186. AttributeError: 'TicketResourceChangeListenerTestCase' object has no attribute 'assertIsInstance'
  187.  
  188. ======================================================================
  189. ERROR: test_change_listener_created (trac.wiki.tests.model.WikiResourceChangeListenerTestCase)
  190. ----------------------------------------------------------------------
  191. Traceback (most recent call last):
  192.   File "/path/to/bloodhound/trac/trac/wiki/tests/model.py", line 289, in test_change_listener_created
  193.     self.assertIsInstance(self.listener.resource, WikiPage)
  194. AttributeError: 'WikiResourceChangeListenerTestCase' object has no attribute 'assertIsInstance'
  195.  
  196. ======================================================================
  197. ERROR: test_change_listener_deleted (trac.wiki.tests.model.WikiResourceChangeListenerTestCase)
  198. ----------------------------------------------------------------------
  199. Traceback (most recent call last):
  200.   File "/path/to/bloodhound/trac/trac/wiki/tests/model.py", line 318, in test_change_listener_deleted
  201.     self.assertIsInstance(self.listener.resource, WikiPage)
  202. AttributeError: 'WikiResourceChangeListenerTestCase' object has no attribute 'assertIsInstance'
  203.  
  204. ======================================================================
  205. ERROR: test_change_listener_renamed (trac.wiki.tests.model.WikiResourceChangeListenerTestCase)
  206. ----------------------------------------------------------------------
  207. Traceback (most recent call last):
  208.   File "/path/to/bloodhound/trac/trac/wiki/tests/model.py", line 309, in test_change_listener_renamed
  209.     self.assertIsInstance(self.listener.resource, WikiPage)
  210. AttributeError: 'WikiResourceChangeListenerTestCase' object has no attribute 'assertIsInstance'
  211.  
  212. ======================================================================
  213. ERROR: test_change_listener_text_changed (trac.wiki.tests.model.WikiResourceChangeListenerTestCase)
  214. ----------------------------------------------------------------------
  215. Traceback (most recent call last):
  216.   File "/path/to/bloodhound/trac/trac/wiki/tests/model.py", line 299, in test_change_listener_text_changed
  217.     self.assertIsInstance(self.listener.resource, WikiPage)
  218. AttributeError: 'WikiResourceChangeListenerTestCase' object has no attribute 'assertIsInstance'
  219.  
  220. ----------------------------------------------------------------------
  221. Ran 1377 tests in 138.859s
  222.  
  223. FAILED (errors=24)
  224. make: *** [unit-test] Error 1
RAW Paste Data