daily pastebin goal
28%
SHARE
TWEET

Untitled

a guest Dec 5th, 2017 217 Never
Not a member of Pastebin yet? Sign Up, it unlocks many cool features!
  1. Executing tasks: [:app:assembleDebug]
  2.  
  3. The client will now receive all logging from the daemon (pid: 12860). The daemon log file: C:\Users\23060884\.gradle\daemon\4.1\daemon-12860.out.log
  4. Starting 12th build in daemon [uptime: 52 mins 38.804 secs, performance: 100%]
  5. Closing daemon's stdin at end of input.
  6. The daemon will no longer process any standard input.
  7. Using 8 worker leases.
  8. Creating new cache for fileHashes, path D:\GitHub\sony\rat-test-app\.gradle\4.1\fileHashes\fileHashes.bin, access org.gradle.cache.internal.DefaultCacheAccess@763171f8
  9. Creating new cache for plugin-use-metadata, path C:\Users\23060884\.gradle\caches\4.1\plugin-resolution\plugin-use-metadata.bin, access org.gradle.cache.internal.DefaultCacheAccess@69f59697
  10. Creating new cache for client-status, path C:\Users\23060884\.gradle\caches\4.1\plugin-resolution\client-status.bin, access org.gradle.cache.internal.DefaultCacheAccess@69f59697
  11. Starting Build
  12. Settings evaluated using settings file 'D:\GitHub\sony\rat-test-app\settings.gradle'.
  13. Projects loaded. Root project using build file 'D:\GitHub\sony\rat-test-app\build.gradle'.
  14. Included projects: [root project 'rat-test-app', project ':app']
  15. Parallel execution with configuration on demand is an incubating feature.
  16. Evaluating root project 'rat-test-app' using build file 'D:\GitHub\sony\rat-test-app\build.gradle'.
  17. Creating new cache for metadata-1.1/results, path C:\Users\23060884\.gradle\caches\transforms-1\metadata-1.1\results.bin, access org.gradle.cache.internal.DefaultCacheAccess@1832b5e2
  18. Evaluating project ':app' using build file 'D:\GitHub\sony\rat-test-app\app\build.gradle'.
  19. Creating configuration androidTestUtil
  20. Creating configuration compile
  21. Creating configuration apk
  22. Creating configuration provided
  23. Creating configuration api
  24. Creating configuration implementation
  25. Creating configuration runtimeOnly
  26. Creating configuration compileOnly
  27. Creating configuration wearApp
  28. Creating configuration annotationProcessor
  29. Creating configuration androidTestCompile
  30. Creating configuration androidTestApk
  31. Creating configuration androidTestProvided
  32. Creating configuration androidTestApi
  33. Creating configuration androidTestImplementation
  34. Creating configuration androidTestRuntimeOnly
  35. Creating configuration androidTestCompileOnly
  36. Creating configuration androidTestWearApp
  37. Creating configuration androidTestAnnotationProcessor
  38. Creating configuration testCompile
  39. Creating configuration testApk
  40. Creating configuration testProvided
  41. Creating configuration testApi
  42. Creating configuration testImplementation
  43. Creating configuration testRuntimeOnly
  44. Creating configuration testCompileOnly
  45. Creating configuration testWearApp
  46. Creating configuration testAnnotationProcessor
  47. Creating configuration debugCompile
  48. Creating configuration debugApk
  49. Creating configuration debugProvided
  50. Creating configuration debugApi
  51. Creating configuration debugImplementation
  52. Creating configuration debugRuntimeOnly
  53. Creating configuration debugCompileOnly
  54. Creating configuration debugWearApp
  55. Creating configuration debugAnnotationProcessor
  56. Creating configuration androidTestDebugCompile
  57. Creating configuration androidTestDebugApk
  58. Creating configuration androidTestDebugProvided
  59. Creating configuration androidTestDebugApi
  60. Creating configuration androidTestDebugImplementation
  61. Creating configuration androidTestDebugRuntimeOnly
  62. Creating configuration androidTestDebugCompileOnly
  63. Creating configuration androidTestDebugWearApp
  64. Creating configuration androidTestDebugAnnotationProcessor
  65. Creating configuration testDebugCompile
  66. Creating configuration testDebugApk
  67. Creating configuration testDebugProvided
  68. Creating configuration testDebugApi
  69. Creating configuration testDebugImplementation
  70. Creating configuration testDebugRuntimeOnly
  71. Creating configuration testDebugCompileOnly
  72. Creating configuration testDebugWearApp
  73. Creating configuration testDebugAnnotationProcessor
  74. Creating configuration releaseCompile
  75. Creating configuration releaseApk
  76. Creating configuration releaseProvided
  77. Creating configuration releaseApi
  78. Creating configuration releaseImplementation
  79. Creating configuration releaseRuntimeOnly
  80. Creating configuration releaseCompileOnly
  81. Creating configuration releaseWearApp
  82. Creating configuration releaseAnnotationProcessor
  83. Creating configuration testReleaseCompile
  84. Creating configuration testReleaseApk
  85. Creating configuration testReleaseProvided
  86. Creating configuration testReleaseApi
  87. Creating configuration testReleaseImplementation
  88. Creating configuration testReleaseRuntimeOnly
  89. Creating configuration testReleaseCompileOnly
  90. Creating configuration testReleaseWearApp
  91. Creating configuration testReleaseAnnotationProcessor
  92. Configuration 'compile' in project ':app' is deprecated. Use 'implementation' instead.
  93. Configuration 'testCompile' in project ':app' is deprecated. Use 'testImplementation' instead.
  94. Parsing the SDK, no caching allowed
  95. SDK initialized in 3821 ms
  96. Incremental flag set to true in DSL
  97. Using incremental javac compilation for :app debug.
  98. Incremental flag set to true in DSL
  99. Using incremental javac compilation for :app debugUnitTest.
  100. Incremental flag set to true in DSL
  101. Using incremental javac compilation for :app release.
  102. Incremental flag set to true in DSL
  103. Using incremental javac compilation for :app releaseUnitTest.
  104. Incremental flag set to true in DSL
  105. Using incremental javac compilation for :app debugAndroidTest.
  106. Selected primary task ':app:assembleDebug' from project :app
  107. Creating new cache for annotation-processors, path D:\GitHub\sony\rat-test-app\.gradle\4.1\fileContent\annotation-processors.bin, access org.gradle.cache.internal.DefaultCacheAccess@6562d4f2
  108. All projects evaluated.
  109. Tasks to be executed: [task ':app:preBuild', task ':app:preDebugBuild', task ':app:compileDebugAidl', task ':app:compileDebugRenderscript', task ':app:checkDebugManifest', task ':app:generateDebugBuildConfig', task ':app:prepareLintJar', task ':app:generateDebugResValues', task ':app:generateDebugResources', task ':app:mergeDebugResources', task ':app:createDebugCompatibleScreenManifests', task ':app:processDebugManifest', task ':app:splitsDiscoveryTaskDebug', task ':app:processDebugResources', task ':app:generateDebugSources', task ':app:javaPreCompileDebug', task ':app:compileDebugJavaWithJavac', task ':app:compileDebugNdk', task ':app:compileDebugSources', task ':app:mergeDebugShaders', task ':app:compileDebugShaders', task ':app:generateDebugAssets', task ':app:mergeDebugAssets', task ':app:transformClassesWithStackFramesFixerForDebug', task ':app:transformClassesWithDesugarForDebug', task ':app:transformClassesWithDexBuilderForDebug', task ':app:transformDexArchiveWithExternalLibsDexMergerForDebug', task ':app:transformDexArchiveWithDexMergerForDebug', task ':app:mergeDebugJniLibFolders', task ':app:transformNativeLibsWithMergeJniLibsForDebug', task ':app:processDebugJavaRes', task ':app:transformResourcesWithMergeJavaResForDebug', task ':app:validateSigningDebug', task ':app:packageDebug', task ':app:assembleDebug']
  110. Creating new cache for resourceHashesCache, path D:\GitHub\sony\rat-test-app\.gradle\4.1\fileHashes\resourceHashesCache.bin, access org.gradle.cache.internal.DefaultCacheAccess@763171f8
  111. Creating new cache for fileSnapshots, path D:\GitHub\sony\rat-test-app\.gradle\4.1\taskHistory\fileSnapshots.bin, access org.gradle.cache.internal.DefaultCacheAccess@69dfcb1b
  112. Creating new cache for taskHistory, path D:\GitHub\sony\rat-test-app\.gradle\4.1\taskHistory\taskHistory.bin, access org.gradle.cache.internal.DefaultCacheAccess@69dfcb1b
  113. :app:preBuild (Thread[Task worker for ':',5,main]) started.
  114. :app:preBuild
  115. Skipping task ':app:preBuild' as it has no actions.
  116. :app:preBuild UP-TO-DATE
  117. :app:preBuild (Thread[Task worker for ':',5,main]) completed. Took 0.001 secs.
  118. :app:preDebugBuild (Thread[Task worker for ':',5,main]) started.
  119. :app:preDebugBuild
  120. Putting task artifact state for task ':app:preDebugBuild' into context took 0.0 secs.
  121. Creating new cache for metadata-2.23/module-metadata, path C:\Users\23060884\.gradle\caches\modules-2\metadata-2.23\module-metadata.bin, access org.gradle.cache.internal.DefaultCacheAccess@62d82cb4
  122. Creating new cache for metadata-2.23/module-artifacts, path C:\Users\23060884\.gradle\caches\modules-2\metadata-2.23\module-artifacts.bin, access org.gradle.cache.internal.DefaultCacheAccess@62d82cb4
  123. Creating new cache for metadata-2.23/artifact-at-repository, path C:\Users\23060884\.gradle\caches\modules-2\metadata-2.23\artifact-at-repository.bin, access org.gradle.cache.internal.DefaultCacheAccess@62d82cb4
  124. Skipping task ':app:preDebugBuild' as it is up-to-date (took 0.478 secs).
  125. :app:preDebugBuild UP-TO-DATE
  126. :app:preDebugBuild (Thread[Task worker for ':',5,main]) completed. Took 0.48 secs.
  127. :app:compileDebugAidl (Thread[Task worker for ':',5,main]) started.
  128. :app:compileDebugAidl
  129. Putting task artifact state for task ':app:compileDebugAidl' into context took 0.0 secs.
  130. Skipping task ':app:compileDebugAidl' as it is up-to-date (took 0.023 secs).
  131. :app:compileDebugAidl UP-TO-DATE
  132. :app:compileDebugAidl (Thread[Task worker for ':',5,main]) completed. Took 0.025 secs.
  133. :app:compileDebugRenderscript (Thread[Task worker for ':',5,main]) started.
  134. :app:compileDebugRenderscript
  135. Putting task artifact state for task ':app:compileDebugRenderscript' into context took 0.001 secs.
  136. Skipping task ':app:compileDebugRenderscript' as it is up-to-date (took 0.01 secs).
  137. :app:compileDebugRenderscript UP-TO-DATE
  138. :app:compileDebugRenderscript (Thread[Task worker for ':',5,main]) completed. Took 0.012 secs.
  139. :app:checkDebugManifest (Thread[Task worker for ':',5,main]) started.
  140. :app:checkDebugManifest
  141. Putting task artifact state for task ':app:checkDebugManifest' into context took 0.0 secs.
  142. Skipping task ':app:checkDebugManifest' as it is up-to-date (took 0.001 secs).
  143. :app:checkDebugManifest UP-TO-DATE
  144. :app:checkDebugManifest (Thread[Task worker for ':',5,main]) completed. Took 0.003 secs.
  145. :app:generateDebugBuildConfig (Thread[Task worker for ':',5,main]) started.
  146. :app:generateDebugBuildConfig
  147. Putting task artifact state for task ':app:generateDebugBuildConfig' into context took 0.0 secs.
  148. Skipping task ':app:generateDebugBuildConfig' as it is up-to-date (took 0.003 secs).
  149. :app:generateDebugBuildConfig UP-TO-DATE
  150. :app:generateDebugBuildConfig (Thread[Task worker for ':',5,main]) completed. Took 0.004 secs.
  151. :app:prepareLintJar (Thread[Task worker for ':',5,main]) started.
  152. :app:prepareLintJar
  153. Putting task artifact state for task ':app:prepareLintJar' into context took 0.0 secs.
  154. Skipping task ':app:prepareLintJar' as it is up-to-date (took 0.001 secs).
  155. :app:prepareLintJar UP-TO-DATE
  156. :app:prepareLintJar (Thread[Task worker for ':',5,main]) completed. Took 0.003 secs.
  157. :app:generateDebugResValues (Thread[Task worker for ':',5,main]) started.
  158. :app:generateDebugResValues
  159. Putting task artifact state for task ':app:generateDebugResValues' into context took 0.0 secs.
  160. Skipping task ':app:generateDebugResValues' as it is up-to-date (took 0.001 secs).
  161. :app:generateDebugResValues UP-TO-DATE
  162. :app:generateDebugResValues (Thread[Task worker for ':',5,main]) completed. Took 0.001 secs.
  163. :app:generateDebugResources (Thread[Task worker for ':',5,main]) started.
  164. :app:generateDebugResources
  165. Skipping task ':app:generateDebugResources' as it has no actions.
  166. :app:generateDebugResources UP-TO-DATE
  167. :app:generateDebugResources (Thread[Task worker for ':',5,main]) completed. Took 0.001 secs.
  168. :app:mergeDebugResources (Thread[Task worker for ':',5,main]) started.
  169. :app:mergeDebugResources
  170. Putting task artifact state for task ':app:mergeDebugResources' into context took 0.001 secs.
  171. Skipping task ':app:mergeDebugResources' as it is up-to-date (took 0.241 secs).
  172. :app:mergeDebugResources UP-TO-DATE
  173. :app:mergeDebugResources (Thread[Task worker for ':',5,main]) completed. Took 0.242 secs.
  174. :app:createDebugCompatibleScreenManifests (Thread[Task worker for ':',5,main]) started.
  175. :app:createDebugCompatibleScreenManifests
  176. Putting task artifact state for task ':app:createDebugCompatibleScreenManifests' into context took 0.001 secs.
  177. Skipping task ':app:createDebugCompatibleScreenManifests' as it is up-to-date (took 0.001 secs).
  178. :app:createDebugCompatibleScreenManifests UP-TO-DATE
  179. :app:createDebugCompatibleScreenManifests (Thread[Task worker for ':',5,main]) completed. Took 0.002 secs.
  180. :app:processDebugManifest (Thread[Task worker for ':',5,main]) started.
  181. :app:processDebugManifest
  182. Putting task artifact state for task ':app:processDebugManifest' into context took 0.0 secs.
  183. Skipping task ':app:processDebugManifest' as it is up-to-date (took 0.009 secs).
  184. :app:processDebugManifest UP-TO-DATE
  185. :app:processDebugManifest (Thread[Task worker for ':',5,main]) completed. Took 0.011 secs.
  186. :app:splitsDiscoveryTaskDebug (Thread[Task worker for ':',5,main]) started.
  187. :app:splitsDiscoveryTaskDebug
  188. Putting task artifact state for task ':app:splitsDiscoveryTaskDebug' into context took 0.0 secs.
  189. Skipping task ':app:splitsDiscoveryTaskDebug' as it is up-to-date (took 0.001 secs).
  190. :app:splitsDiscoveryTaskDebug UP-TO-DATE
  191. :app:splitsDiscoveryTaskDebug (Thread[Task worker for ':',5,main]) completed. Took 0.002 secs.
  192. :app:processDebugResources (Thread[Task worker for ':',5,main]) started.
  193. :app:processDebugResources
  194. Putting task artifact state for task ':app:processDebugResources' into context took 0.0 secs.
  195. Skipping task ':app:processDebugResources' as it is up-to-date (took 0.047 secs).
  196. :app:processDebugResources UP-TO-DATE
  197. :app:processDebugResources (Thread[Task worker for ':',5,main]) completed. Took 0.049 secs.
  198. :app:generateDebugSources (Thread[Task worker for ':',5,main]) started.
  199. :app:generateDebugSources
  200. Skipping task ':app:generateDebugSources' as it has no actions.
  201. :app:generateDebugSources UP-TO-DATE
  202. :app:generateDebugSources (Thread[Task worker for ':',5,main]) completed. Took 0.001 secs.
  203. :app:javaPreCompileDebug (Thread[Task worker for ':',5,main]) started.
  204. :app:javaPreCompileDebug
  205. Putting task artifact state for task ':app:javaPreCompileDebug' into context took 0.0 secs.
  206. Skipping task ':app:javaPreCompileDebug' as it is up-to-date (took 0.018 secs).
  207. :app:javaPreCompileDebug UP-TO-DATE
  208. :app:javaPreCompileDebug (Thread[Task worker for ':',5,main]) completed. Took 0.018 secs.
  209. :app:compileDebugJavaWithJavac (Thread[Task worker for ':',5,main]) started.
  210. :app:compileDebugJavaWithJavac
  211. Putting task artifact state for task ':app:compileDebugJavaWithJavac' into context took 0.0 secs.
  212. file or directory 'D:\GitHub\sony\rat-test-app\app\src\debug\java', not found
  213. file or directory 'D:\GitHub\sony\rat-test-app\app\build\generated\source\rs\debug', not found
  214. Skipping task ':app:compileDebugJavaWithJavac' as it is up-to-date (took 0.056 secs).
  215. :app:compileDebugJavaWithJavac UP-TO-DATE
  216. :app:compileDebugJavaWithJavac (Thread[Task worker for ':',5,main]) completed. Took 0.063 secs.
  217. :app:compileDebugNdk (Thread[Task worker for ':',5,main]) started.
  218. :app:compileDebugNdk
  219. Putting task artifact state for task ':app:compileDebugNdk' into context took 0.0 secs.
  220. Skipping task ':app:compileDebugNdk' as it has no source files and no previous output files.
  221. :app:compileDebugNdk NO-SOURCE
  222. :app:compileDebugNdk (Thread[Task worker for ':',5,main]) completed. Took 0.002 secs.
  223. :app:compileDebugSources (Thread[Task worker for ':',5,main]) started.
  224. :app:compileDebugSources
  225. Skipping task ':app:compileDebugSources' as it has no actions.
  226. :app:compileDebugSources UP-TO-DATE
  227. :app:compileDebugSources (Thread[Task worker for ':',5,main]) completed. Took 0.0 secs.
  228. :app:mergeDebugShaders (Thread[Task worker for ':',5,main]) started.
  229. :app:mergeDebugShaders
  230. Putting task artifact state for task ':app:mergeDebugShaders' into context took 0.0 secs.
  231. Skipping task ':app:mergeDebugShaders' as it is up-to-date (took 0.002 secs).
  232. :app:mergeDebugShaders UP-TO-DATE
  233. :app:mergeDebugShaders (Thread[Task worker for ':',5,main]) completed. Took 0.004 secs.
  234. :app:compileDebugShaders (Thread[Task worker for ':',5,main]) started.
  235. :app:compileDebugShaders
  236. Putting task artifact state for task ':app:compileDebugShaders' into context took 0.0 secs.
  237. Skipping task ':app:compileDebugShaders' as it is up-to-date (took 0.002 secs).
  238. :app:compileDebugShaders UP-TO-DATE
  239. :app:compileDebugShaders (Thread[Task worker for ':',5,main]) completed. Took 0.002 secs.
  240. :app:generateDebugAssets (Thread[Task worker for ':',5,main]) started.
  241. :app:generateDebugAssets
  242. Skipping task ':app:generateDebugAssets' as it has no actions.
  243. :app:generateDebugAssets UP-TO-DATE
  244. :app:generateDebugAssets (Thread[Task worker for ':',5,main]) completed. Took 0.001 secs.
  245. :app:mergeDebugAssets (Thread[Task worker for ':',5,main]) started.
  246. :app:mergeDebugAssets
  247. Putting task artifact state for task ':app:mergeDebugAssets' into context took 0.0 secs.
  248. Skipping task ':app:mergeDebugAssets' as it is up-to-date (took 0.01 secs).
  249. :app:mergeDebugAssets UP-TO-DATE
  250. :app:mergeDebugAssets (Thread[Task worker for ':',5,main]) completed. Took 0.012 secs.
  251. :app:transformClassesWithStackFramesFixerForDebug (Thread[Task worker for ':',5,main]) started.
  252. :app:transformClassesWithStackFramesFixerForDebug
  253. Putting task artifact state for task ':app:transformClassesWithStackFramesFixerForDebug' into context took 0.0 secs.
  254. Skipping task ':app:transformClassesWithStackFramesFixerForDebug' as it is up-to-date (took 0.077 secs).
  255. :app:transformClassesWithStackFramesFixerForDebug UP-TO-DATE
  256. :app:transformClassesWithStackFramesFixerForDebug (Thread[Task worker for ':',5,main]) completed. Took 0.077 secs.
  257. :app:transformClassesWithDesugarForDebug (Thread[Task worker for ':',5,main]) started.
  258. :app:transformClassesWithDesugarForDebug
  259. Putting task artifact state for task ':app:transformClassesWithDesugarForDebug' into context took 0.0 secs.
  260. Executing task ':app:transformClassesWithDesugarForDebug' (up-to-date check took 0.125 secs) due to:
  261.   Task has failed previously.
  262. All input files are considered out-of-date for incremental task ':app:transformClassesWithDesugarForDebug'.
  263. Executing java process:
  264. Executing java process:
  265. Executing java process:
  266. Executing java process:
  267. Executing java process:
  268. Executing java process:
  269. Executing java process:
  270. Executing java process:
  271. Starting process 'command 'C:\Program Files\Android\Android Studio\jre\bin\java.exe''. Working directory: D:\GitHub\sony\rat-test-app\app Command: C:\Program Files\Android\Android Studio\jre\bin\java.exe -Djava.awt.headless=true -Xmx64M -Dfile.encoding=windows-1252 -Duser.country=US -Duser.language=en -Duser.variant -cp C:\Users\23060884\AppData\Local\Temp\desugar_deploy.jar3440688514464625138 com.google.devtools.build.android.desugar.Desugar --verbose --input D:\GitHub\sony\rat-test-app\app\build\intermediates\transforms\stackFramesFixer\debug\11.jar --output D:\GitHub\sony\rat-test-app\app\build\intermediates\transforms\desugar\debug\12.jar --input D:\GitHub\sony\rat-test-app\app\build\intermediates\transforms\stackFramesFixer\debug\1.jar --output D:\GitHub\sony\rat-test-app\app\build\intermediates\transforms\desugar\debug\2.jar --input D:\GitHub\sony\rat-test-app\app\build\intermediates\transforms\stackFramesFixer\debug\16.jar --output D:\GitHub\sony\rat-test-app\app\build\intermediates\transforms\desugar\debug\17.jar --classpath_entry D:\GitHub\sony\rat-test-app\app\build\intermediates\classes\debug --classpath_entry D:\GitHub\sony\rat-test-app\app\build\intermediates\transforms\stackFramesFixer\debug\0.jar --classpath_entry D:\GitHub\sony\rat-test-app\app\build\intermediates\transforms\stackFramesFixer\debug\1.jar --classpath_entry D:\GitHub\sony\rat-test-app\app\build\intermediates\transforms\stackFramesFixer\debug\2.jar --classpath_entry D:\GitHub\sony\rat-test-app\app\build\intermediates\transforms\stackFramesFixer\debug\3.jar --classpath_entry D:\GitHub\sony\rat-test-app\app\build\intermediates\transforms\stackFramesFixer\debug\4.jar --classpath_entry D:\GitHub\sony\rat-test-app\app\build\intermediates\transforms\stackFramesFixer\debug\5.jar --classpath_entry D:\GitHub\sony\rat-test-app\app\build\intermediates\transforms\stackFramesFixer\debug\6.jar --classpath_entry D:\GitHub\sony\rat-test-app\app\build\intermediates\transforms\stackFramesFixer\debug\7.jar --classpath_entry D:\GitHub\sony\rat-test-app\app\build\intermediates\transforms\stackFramesFixer\debug\8.jar --classpath_entry D:\GitHub\sony\rat-test-app\app\build\intermediates\transforms\stackFramesFixer\debug\9.jar --classpath_entry D:\GitHub\sony\rat-test-app\app\build\intermediates\transforms\stackFramesFixer\debug\10.jar --classpath_entry D:\GitHub\sony\rat-test-app\app\build\intermediates\transforms\stackFramesFixer\debug\11.jar --classpath_entry D:\GitHub\sony\rat-test-app\app\build\intermediates\transforms\stackFramesFixer\debug\12.jar --classpath_entry D:\GitHub\sony\rat-test-app\app\build\intermediates\transforms\stackFramesFixer\debug\13.jar --classpath_entry D:\GitHub\sony\rat-test-app\app\build\intermediates\transforms\stackFramesFixer\debug\14.jar --classpath_entry D:\GitHub\sony\rat-test-app\app\build\intermediates\transforms\stackFramesFixer\debug\15.jar --classpath_entry D:\GitHub\sony\rat-test-app\app\build\intermediates\transforms\stackFramesFixer\debug\16.jar --classpath_entry D:\GitHub\sony\rat-test-app\app\build\intermediates\transforms\stackFramesFixer\debug\17.jar --classpath_entry D:\GitHub\sony\rat-test-app\app\build\intermediates\transforms\stackFramesFixer\debug\18.jar --classpath_entry D:\GitHub\sony\rat-test-app\app\build\intermediates\transforms\stackFramesFixer\debug\19.jar --bootclasspath_entry C:\Users\23060884\AppData\Local\Android\Sdk\platforms\android-27\android.jar --bootclasspath_entry C:\Users\23060884\AppData\Local\Android\Sdk\platforms\android-27\optional\org.apache.http.legacy.jar --bootclasspath_entry C:\Program Files\Android\Android Studio\jre\jre\lib\resources.jar --bootclasspath_entry C:\Program Files\Android\Android Studio\jre\jre\lib\rt.jar --bootclasspath_entry C:\Program Files\Android\Android Studio\jre\jre\lib\jsse.jar --bootclasspath_entry C:\Program Files\Android\Android Studio\jre\jre\lib\jce.jar --bootclasspath_entry C:\Program Files\Android\Android Studio\jre\jre\lib\charsets.jar --min_sdk_version 24 --nodesugar_try_with_resources_if_needed --desugar_try_with_resources_omit_runtime_classes
  272. Starting process 'command 'C:\Program Files\Android\Android Studio\jre\bin\java.exe''. Working directory: D:\GitHub\sony\rat-test-app\app Command: C:\Program Files\Android\Android Studio\jre\bin\java.exe -Djava.awt.headless=true -Xmx64M -Dfile.encoding=windows-1252 -Duser.country=US -Duser.language=en -Duser.variant -cp C:\Users\23060884\AppData\Local\Temp\desugar_deploy.jar3440688514464625138 com.google.devtools.build.android.desugar.Desugar --verbose --input D:\GitHub\sony\rat-test-app\app\build\intermediates\classes\debug --output D:\GitHub\sony\rat-test-app\app\build\intermediates\transforms\desugar\debug\0 --input D:\GitHub\sony\rat-test-app\app\build\intermediates\transforms\stackFramesFixer\debug\13.jar --output D:\GitHub\sony\rat-test-app\app\build\intermediates\transforms\desugar\debug\14.jar --input D:\GitHub\sony\rat-test-app\app\build\intermediates\transforms\stackFramesFixer\debug\12.jar --output D:\GitHub\sony\rat-test-app\app\build\intermediates\transforms\desugar\debug\13.jar --classpath_entry D:\GitHub\sony\rat-test-app\app\build\intermediates\classes\debug --classpath_entry D:\GitHub\sony\rat-test-app\app\build\intermediates\transforms\stackFramesFixer\debug\0.jar --classpath_entry D:\GitHub\sony\rat-test-app\app\build\intermediates\transforms\stackFramesFixer\debug\1.jar --classpath_entry D:\GitHub\sony\rat-test-app\app\build\intermediates\transforms\stackFramesFixer\debug\2.jar --classpath_entry D:\GitHub\sony\rat-test-app\app\build\intermediates\transforms\stackFramesFixer\debug\3.jar --classpath_entry D:\GitHub\sony\rat-test-app\app\build\intermediates\transforms\stackFramesFixer\debug\4.jar --classpath_entry D:\GitHub\sony\rat-test-app\app\build\intermediates\transforms\stackFramesFixer\debug\5.jar --classpath_entry D:\GitHub\sony\rat-test-app\app\build\intermediates\transforms\stackFramesFixer\debug\6.jar --classpath_entry D:\GitHub\sony\rat-test-app\app\build\intermediates\transforms\stackFramesFixer\debug\7.jar --classpath_entry D:\GitHub\sony\rat-test-app\app\build\intermediates\transforms\stackFramesFixer\debug\8.jar --classpath_entry D:\GitHub\sony\rat-test-app\app\build\intermediates\transforms\stackFramesFixer\debug\9.jar --classpath_entry D:\GitHub\sony\rat-test-app\app\build\intermediates\transforms\stackFramesFixer\debug\10.jar --classpath_entry D:\GitHub\sony\rat-test-app\app\build\intermediates\transforms\stackFramesFixer\debug\11.jar --classpath_entry D:\GitHub\sony\rat-test-app\app\build\intermediates\transforms\stackFramesFixer\debug\12.jar --classpath_entry D:\GitHub\sony\rat-test-app\app\build\intermediates\transforms\stackFramesFixer\debug\13.jar --classpath_entry D:\GitHub\sony\rat-test-app\app\build\intermediates\transforms\stackFramesFixer\debug\14.jar --classpath_entry D:\GitHub\sony\rat-test-app\app\build\intermediates\transforms\stackFramesFixer\debug\15.jar --classpath_entry D:\GitHub\sony\rat-test-app\app\build\intermediates\transforms\stackFramesFixer\debug\16.jar --classpath_entry D:\GitHub\sony\rat-test-app\app\build\intermediates\transforms\stackFramesFixer\debug\17.jar --classpath_entry D:\GitHub\sony\rat-test-app\app\build\intermediates\transforms\stackFramesFixer\debug\18.jar --classpath_entry D:\GitHub\sony\rat-test-app\app\build\intermediates\transforms\stackFramesFixer\debug\19.jar --bootclasspath_entry C:\Users\23060884\AppData\Local\Android\Sdk\platforms\android-27\android.jar --bootclasspath_entry C:\Users\23060884\AppData\Local\Android\Sdk\platforms\android-27\optional\org.apache.http.legacy.jar --bootclasspath_entry C:\Program Files\Android\Android Studio\jre\jre\lib\resources.jar --bootclasspath_entry C:\Program Files\Android\Android Studio\jre\jre\lib\rt.jar --bootclasspath_entry C:\Program Files\Android\Android Studio\jre\jre\lib\jsse.jar --bootclasspath_entry C:\Program Files\Android\Android Studio\jre\jre\lib\jce.jar --bootclasspath_entry C:\Program Files\Android\Android Studio\jre\jre\lib\charsets.jar --min_sdk_version 24 --nodesugar_try_with_resources_if_needed --desugar_try_with_resources_omit_runtime_classes
  273. Starting process 'command 'C:\Program Files\Android\Android Studio\jre\bin\java.exe''. Working directory: D:\GitHub\sony\rat-test-app\app Command: C:\Program Files\Android\Android Studio\jre\bin\java.exe -Djava.awt.headless=true -Xmx64M -Dfile.encoding=windows-1252 -Duser.country=US -Duser.language=en -Duser.variant -cp C:\Users\23060884\AppData\Local\Temp\desugar_deploy.jar3440688514464625138 com.google.devtools.build.android.desugar.Desugar --verbose --input D:\GitHub\sony\rat-test-app\app\build\intermediates\transforms\stackFramesFixer\debug\9.jar --output D:\GitHub\sony\rat-test-app\app\build\intermediates\transforms\desugar\debug\10.jar --input D:\GitHub\sony\rat-test-app\app\build\intermediates\transforms\stackFramesFixer\debug\18.jar --output D:\GitHub\sony\rat-test-app\app\build\intermediates\transforms\desugar\debug\19.jar --input D:\GitHub\sony\rat-test-app\app\build\intermediates\transforms\stackFramesFixer\debug\8.jar --output D:\GitHub\sony\rat-test-app\app\build\intermediates\transforms\desugar\debug\9.jar --classpath_entry D:\GitHub\sony\rat-test-app\app\build\intermediates\classes\debug --classpath_entry D:\GitHub\sony\rat-test-app\app\build\intermediates\transforms\stackFramesFixer\debug\0.jar --classpath_entry D:\GitHub\sony\rat-test-app\app\build\intermediates\transforms\stackFramesFixer\debug\1.jar --classpath_entry D:\GitHub\sony\rat-test-app\app\build\intermediates\transforms\stackFramesFixer\debug\2.jar --classpath_entry D:\GitHub\sony\rat-test-app\app\build\intermediates\transforms\stackFramesFixer\debug\3.jar --classpath_entry D:\GitHub\sony\rat-test-app\app\build\intermediates\transforms\stackFramesFixer\debug\4.jar --classpath_entry D:\GitHub\sony\rat-test-app\app\build\intermediates\transforms\stackFramesFixer\debug\5.jar --classpath_entry D:\GitHub\sony\rat-test-app\app\build\intermediates\transforms\stackFramesFixer\debug\6.jar --classpath_entry D:\GitHub\sony\rat-test-app\app\build\intermediates\transforms\stackFramesFixer\debug\7.jar --classpath_entry D:\GitHub\sony\rat-test-app\app\build\intermediates\transforms\stackFramesFixer\debug\8.jar --classpath_entry D:\GitHub\sony\rat-test-app\app\build\intermediates\transforms\stackFramesFixer\debug\9.jar --classpath_entry D:\GitHub\sony\rat-test-app\app\build\intermediates\transforms\stackFramesFixer\debug\10.jar --classpath_entry D:\GitHub\sony\rat-test-app\app\build\intermediates\transforms\stackFramesFixer\debug\11.jar --classpath_entry D:\GitHub\sony\rat-test-app\app\build\intermediates\transforms\stackFramesFixer\debug\12.jar --classpath_entry D:\GitHub\sony\rat-test-app\app\build\intermediates\transforms\stackFramesFixer\debug\13.jar --classpath_entry D:\GitHub\sony\rat-test-app\app\build\intermediates\transforms\stackFramesFixer\debug\14.jar --classpath_entry D:\GitHub\sony\rat-test-app\app\build\intermediates\transforms\stackFramesFixer\debug\15.jar --classpath_entry D:\GitHub\sony\rat-test-app\app\build\intermediates\transforms\stackFramesFixer\debug\16.jar --classpath_entry D:\GitHub\sony\rat-test-app\app\build\intermediates\transforms\stackFramesFixer\debug\17.jar --classpath_entry D:\GitHub\sony\rat-test-app\app\build\intermediates\transforms\stackFramesFixer\debug\18.jar --classpath_entry D:\GitHub\sony\rat-test-app\app\build\intermediates\transforms\stackFramesFixer\debug\19.jar --bootclasspath_entry C:\Users\23060884\AppData\Local\Android\Sdk\platforms\android-27\android.jar --bootclasspath_entry C:\Users\23060884\AppData\Local\Android\Sdk\platforms\android-27\optional\org.apache.http.legacy.jar --bootclasspath_entry C:\Program Files\Android\Android Studio\jre\jre\lib\resources.jar --bootclasspath_entry C:\Program Files\Android\Android Studio\jre\jre\lib\rt.jar --bootclasspath_entry C:\Program Files\Android\Android Studio\jre\jre\lib\jsse.jar --bootclasspath_entry C:\Program Files\Android\Android Studio\jre\jre\lib\jce.jar --bootclasspath_entry C:\Program Files\Android\Android Studio\jre\jre\lib\charsets.jar --min_sdk_version 24 --nodesugar_try_with_resources_if_needed --desugar_try_with_resources_omit_runtime_classes
  274. Starting process 'command 'C:\Program Files\Android\Android Studio\jre\bin\java.exe''. Working directory: D:\GitHub\sony\rat-test-app\app Command: C:\Program Files\Android\Android Studio\jre\bin\java.exe -Djava.awt.headless=true -Xmx64M -Dfile.encoding=windows-1252 -Duser.country=US -Duser.language=en -Duser.variant -cp C:\Users\23060884\AppData\Local\Temp\desugar_deploy.jar3440688514464625138 com.google.devtools.build.android.desugar.Desugar --verbose --input D:\GitHub\sony\rat-test-app\app\build\intermediates\transforms\stackFramesFixer\debug\19.jar --output D:\GitHub\sony\rat-test-app\app\build\intermediates\transforms\desugar\debug\20.jar --input D:\GitHub\sony\rat-test-app\app\build\intermediates\transforms\stackFramesFixer\debug\14.jar --output D:\GitHub\sony\rat-test-app\app\build\intermediates\transforms\desugar\debug\15.jar --classpath_entry D:\GitHub\sony\rat-test-app\app\build\intermediates\classes\debug --classpath_entry D:\GitHub\sony\rat-test-app\app\build\intermediates\transforms\stackFramesFixer\debug\0.jar --classpath_entry D:\GitHub\sony\rat-test-app\app\build\intermediates\transforms\stackFramesFixer\debug\1.jar --classpath_entry D:\GitHub\sony\rat-test-app\app\build\intermediates\transforms\stackFramesFixer\debug\2.jar --classpath_entry D:\GitHub\sony\rat-test-app\app\build\intermediates\transforms\stackFramesFixer\debug\3.jar --classpath_entry D:\GitHub\sony\rat-test-app\app\build\intermediates\transforms\stackFramesFixer\debug\4.jar --classpath_entry D:\GitHub\sony\rat-test-app\app\build\intermediates\transforms\stackFramesFixer\debug\5.jar --classpath_entry D:\GitHub\sony\rat-test-app\app\build\intermediates\transforms\stackFramesFixer\debug\6.jar --classpath_entry D:\GitHub\sony\rat-test-app\app\build\intermediates\transforms\stackFramesFixer\debug\7.jar --classpath_entry D:\GitHub\sony\rat-test-app\app\build\intermediates\transforms\stackFramesFixer\debug\8.jar --classpath_entry D:\GitHub\sony\rat-test-app\app\build\intermediates\transforms\stackFramesFixer\debug\9.jar --classpath_entry D:\GitHub\sony\rat-test-app\app\build\intermediates\transforms\stackFramesFixer\debug\10.jar --classpath_entry D:\GitHub\sony\rat-test-app\app\build\intermediates\transforms\stackFramesFixer\debug\11.jar --classpath_entry D:\GitHub\sony\rat-test-app\app\build\intermediates\transforms\stackFramesFixer\debug\12.jar --classpath_entry D:\GitHub\sony\rat-test-app\app\build\intermediates\transforms\stackFramesFixer\debug\13.jar --classpath_entry D:\GitHub\sony\rat-test-app\app\build\intermediates\transforms\stackFramesFixer\debug\14.jar --classpath_entry D:\GitHub\sony\rat-test-app\app\build\intermediates\transforms\stackFramesFixer\debug\15.jar --classpath_entry D:\GitHub\sony\rat-test-app\app\build\intermediates\transforms\stackFramesFixer\debug\16.jar --classpath_entry D:\GitHub\sony\rat-test-app\app\build\intermediates\transforms\stackFramesFixer\debug\17.jar --classpath_entry D:\GitHub\sony\rat-test-app\app\build\intermediates\transforms\stackFramesFixer\debug\18.jar --classpath_entry D:\GitHub\sony\rat-test-app\app\build\intermediates\transforms\stackFramesFixer\debug\19.jar --bootclasspath_entry C:\Users\23060884\AppData\Local\Android\Sdk\platforms\android-27\android.jar --bootclasspath_entry C:\Users\23060884\AppData\Local\Android\Sdk\platforms\android-27\optional\org.apache.http.legacy.jar --bootclasspath_entry C:\Program Files\Android\Android Studio\jre\jre\lib\resources.jar --bootclasspath_entry C:\Program Files\Android\Android Studio\jre\jre\lib\rt.jar --bootclasspath_entry C:\Program Files\Android\Android Studio\jre\jre\lib\jsse.jar --bootclasspath_entry C:\Program Files\Android\Android Studio\jre\jre\lib\jce.jar --bootclasspath_entry C:\Program Files\Android\Android Studio\jre\jre\lib\charsets.jar --min_sdk_version 24 --nodesugar_try_with_resources_if_needed --desugar_try_with_resources_omit_runtime_classes
  275. Starting process 'command 'C:\Program Files\Android\Android Studio\jre\bin\java.exe''. Working directory: D:\GitHub\sony\rat-test-app\app Command: C:\Program Files\Android\Android Studio\jre\bin\java.exe -Djava.awt.headless=true -Xmx64M -Dfile.encoding=windows-1252 -Duser.country=US -Duser.language=en -Duser.variant -cp C:\Users\23060884\AppData\Local\Temp\desugar_deploy.jar3440688514464625138 com.google.devtools.build.android.desugar.Desugar --verbose --input D:\GitHub\sony\rat-test-app\app\build\intermediates\transforms\stackFramesFixer\debug\7.jar --output D:\GitHub\sony\rat-test-app\app\build\intermediates\transforms\desugar\debug\8.jar --input D:\GitHub\sony\rat-test-app\app\build\intermediates\transforms\stackFramesFixer\debug\6.jar --output D:\GitHub\sony\rat-test-app\app\build\intermediates\transforms\desugar\debug\7.jar --input D:\GitHub\sony\rat-test-app\app\build\intermediates\transforms\stackFramesFixer\debug\10.jar --output D:\GitHub\sony\rat-test-app\app\build\intermediates\transforms\desugar\debug\11.jar --classpath_entry D:\GitHub\sony\rat-test-app\app\build\intermediates\classes\debug --classpath_entry D:\GitHub\sony\rat-test-app\app\build\intermediates\transforms\stackFramesFixer\debug\0.jar --classpath_entry D:\GitHub\sony\rat-test-app\app\build\intermediates\transforms\stackFramesFixer\debug\1.jar --classpath_entry D:\GitHub\sony\rat-test-app\app\build\intermediates\transforms\stackFramesFixer\debug\2.jar --classpath_entry D:\GitHub\sony\rat-test-app\app\build\intermediates\transforms\stackFramesFixer\debug\3.jar --classpath_entry D:\GitHub\sony\rat-test-app\app\build\intermediates\transforms\stackFramesFixer\debug\4.jar --classpath_entry D:\GitHub\sony\rat-test-app\app\build\intermediates\transforms\stackFramesFixer\debug\5.jar --classpath_entry D:\GitHub\sony\rat-test-app\app\build\intermediates\transforms\stackFramesFixer\debug\6.jar --classpath_entry D:\GitHub\sony\rat-test-app\app\build\intermediates\transforms\stackFramesFixer\debug\7.jar --classpath_entry D:\GitHub\sony\rat-test-app\app\build\intermediates\transforms\stackFramesFixer\debug\8.jar --classpath_entry D:\GitHub\sony\rat-test-app\app\build\intermediates\transforms\stackFramesFixer\debug\9.jar --classpath_entry D:\GitHub\sony\rat-test-app\app\build\intermediates\transforms\stackFramesFixer\debug\10.jar --classpath_entry D:\GitHub\sony\rat-test-app\app\build\intermediates\transforms\stackFramesFixer\debug\11.jar --classpath_entry D:\GitHub\sony\rat-test-app\app\build\intermediates\transforms\stackFramesFixer\debug\12.jar --classpath_entry D:\GitHub\sony\rat-test-app\app\build\intermediates\transforms\stackFramesFixer\debug\13.jar --classpath_entry D:\GitHub\sony\rat-test-app\app\build\intermediates\transforms\stackFramesFixer\debug\14.jar --classpath_entry D:\GitHub\sony\rat-test-app\app\build\intermediates\transforms\stackFramesFixer\debug\15.jar --classpath_entry D:\GitHub\sony\rat-test-app\app\build\intermediates\transforms\stackFramesFixer\debug\16.jar --classpath_entry D:\GitHub\sony\rat-test-app\app\build\intermediates\transforms\stackFramesFixer\debug\17.jar --classpath_entry D:\GitHub\sony\rat-test-app\app\build\intermediates\transforms\stackFramesFixer\debug\18.jar --classpath_entry D:\GitHub\sony\rat-test-app\app\build\intermediates\transforms\stackFramesFixer\debug\19.jar --bootclasspath_entry C:\Users\23060884\AppData\Local\Android\Sdk\platforms\android-27\android.jar --bootclasspath_entry C:\Users\23060884\AppData\Local\Android\Sdk\platforms\android-27\optional\org.apache.http.legacy.jar --bootclasspath_entry C:\Program Files\Android\Android Studio\jre\jre\lib\resources.jar --bootclasspath_entry C:\Program Files\Android\Android Studio\jre\jre\lib\rt.jar --bootclasspath_entry C:\Program Files\Android\Android Studio\jre\jre\lib\jsse.jar --bootclasspath_entry C:\Program Files\Android\Android Studio\jre\jre\lib\jce.jar --bootclasspath_entry C:\Program Files\Android\Android Studio\jre\jre\lib\charsets.jar --min_sdk_version 24 --nodesugar_try_with_resources_if_needed --desugar_try_with_resources_omit_runtime_classes
  276. Starting process 'command 'C:\Program Files\Android\Android Studio\jre\bin\java.exe''. Working directory: D:\GitHub\sony\rat-test-app\app Command: C:\Program Files\Android\Android Studio\jre\bin\java.exe -Djava.awt.headless=true -Xmx64M -Dfile.encoding=windows-1252 -Duser.country=US -Duser.language=en -Duser.variant -cp C:\Users\23060884\AppData\Local\Temp\desugar_deploy.jar3440688514464625138 com.google.devtools.build.android.desugar.Desugar --verbose --input D:\GitHub\sony\rat-test-app\app\build\intermediates\transforms\stackFramesFixer\debug\17.jar --output D:\GitHub\sony\rat-test-app\app\build\intermediates\transforms\desugar\debug\18.jar --input D:\GitHub\sony\rat-test-app\app\build\intermediates\transforms\stackFramesFixer\debug\15.jar --output D:\GitHub\sony\rat-test-app\app\build\intermediates\transforms\desugar\debug\16.jar --classpath_entry D:\GitHub\sony\rat-test-app\app\build\intermediates\classes\debug --classpath_entry D:\GitHub\sony\rat-test-app\app\build\intermediates\transforms\stackFramesFixer\debug\0.jar --classpath_entry D:\GitHub\sony\rat-test-app\app\build\intermediates\transforms\stackFramesFixer\debug\1.jar --classpath_entry D:\GitHub\sony\rat-test-app\app\build\intermediates\transforms\stackFramesFixer\debug\2.jar --classpath_entry D:\GitHub\sony\rat-test-app\app\build\intermediates\transforms\stackFramesFixer\debug\3.jar --classpath_entry D:\GitHub\sony\rat-test-app\app\build\intermediates\transforms\stackFramesFixer\debug\4.jar --classpath_entry D:\GitHub\sony\rat-test-app\app\build\intermediates\transforms\stackFramesFixer\debug\5.jar --classpath_entry D:\GitHub\sony\rat-test-app\app\build\intermediates\transforms\stackFramesFixer\debug\6.jar --classpath_entry D:\GitHub\sony\rat-test-app\app\build\intermediates\transforms\stackFramesFixer\debug\7.jar --classpath_entry D:\GitHub\sony\rat-test-app\app\build\intermediates\transforms\stackFramesFixer\debug\8.jar --classpath_entry D:\GitHub\sony\rat-test-app\app\build\intermediates\transforms\stackFramesFixer\debug\9.jar --classpath_entry D:\GitHub\sony\rat-test-app\app\build\intermediates\transforms\stackFramesFixer\debug\10.jar --classpath_entry D:\GitHub\sony\rat-test-app\app\build\intermediates\transforms\stackFramesFixer\debug\11.jar --classpath_entry D:\GitHub\sony\rat-test-app\app\build\intermediates\transforms\stackFramesFixer\debug\12.jar --classpath_entry D:\GitHub\sony\rat-test-app\app\build\intermediates\transforms\stackFramesFixer\debug\13.jar --classpath_entry D:\GitHub\sony\rat-test-app\app\build\intermediates\transforms\stackFramesFixer\debug\14.jar --classpath_entry D:\GitHub\sony\rat-test-app\app\build\intermediates\transforms\stackFramesFixer\debug\15.jar --classpath_entry D:\GitHub\sony\rat-test-app\app\build\intermediates\transforms\stackFramesFixer\debug\16.jar --classpath_entry D:\GitHub\sony\rat-test-app\app\build\intermediates\transforms\stackFramesFixer\debug\17.jar --classpath_entry D:\GitHub\sony\rat-test-app\app\build\intermediates\transforms\stackFramesFixer\debug\18.jar --classpath_entry D:\GitHub\sony\rat-test-app\app\build\intermediates\transforms\stackFramesFixer\debug\19.jar --bootclasspath_entry C:\Users\23060884\AppData\Local\Android\Sdk\platforms\android-27\android.jar --bootclasspath_entry C:\Users\23060884\AppData\Local\Android\Sdk\platforms\android-27\optional\org.apache.http.legacy.jar --bootclasspath_entry C:\Program Files\Android\Android Studio\jre\jre\lib\resources.jar --bootclasspath_entry C:\Program Files\Android\Android Studio\jre\jre\lib\rt.jar --bootclasspath_entry C:\Program Files\Android\Android Studio\jre\jre\lib\jsse.jar --bootclasspath_entry C:\Program Files\Android\Android Studio\jre\jre\lib\jce.jar --bootclasspath_entry C:\Program Files\Android\Android Studio\jre\jre\lib\charsets.jar --min_sdk_version 24 --nodesugar_try_with_resources_if_needed --desugar_try_with_resources_omit_runtime_classes
  277. Starting process 'command 'C:\Program Files\Android\Android Studio\jre\bin\java.exe''. Working directory: D:\GitHub\sony\rat-test-app\app Command: C:\Program Files\Android\Android Studio\jre\bin\java.exe -Djava.awt.headless=true -Xmx64M -Dfile.encoding=windows-1252 -Duser.country=US -Duser.language=en -Duser.variant -cp C:\Users\23060884\AppData\Local\Temp\desugar_deploy.jar3440688514464625138 com.google.devtools.build.android.desugar.Desugar --verbose --input D:\GitHub\sony\rat-test-app\app\build\intermediates\transforms\stackFramesFixer\debug\4.jar --output D:\GitHub\sony\rat-test-app\app\build\intermediates\transforms\desugar\debug\5.jar --input D:\GitHub\sony\rat-test-app\app\build\intermediates\transforms\stackFramesFixer\debug\5.jar --output D:\GitHub\sony\rat-test-app\app\build\intermediates\transforms\desugar\debug\6.jar --input D:\GitHub\sony\rat-test-app\app\build\intermediates\transforms\stackFramesFixer\debug\0.jar --output D:\GitHub\sony\rat-test-app\app\build\intermediates\transforms\desugar\debug\1.jar --classpath_entry D:\GitHub\sony\rat-test-app\app\build\intermediates\classes\debug --classpath_entry D:\GitHub\sony\rat-test-app\app\build\intermediates\transforms\stackFramesFixer\debug\0.jar --classpath_entry D:\GitHub\sony\rat-test-app\app\build\intermediates\transforms\stackFramesFixer\debug\1.jar --classpath_entry D:\GitHub\sony\rat-test-app\app\build\intermediates\transforms\stackFramesFixer\debug\2.jar --classpath_entry D:\GitHub\sony\rat-test-app\app\build\intermediates\transforms\stackFramesFixer\debug\3.jar --classpath_entry D:\GitHub\sony\rat-test-app\app\build\intermediates\transforms\stackFramesFixer\debug\4.jar --classpath_entry D:\GitHub\sony\rat-test-app\app\build\intermediates\transforms\stackFramesFixer\debug\5.jar --classpath_entry D:\GitHub\sony\rat-test-app\app\build\intermediates\transforms\stackFramesFixer\debug\6.jar --classpath_entry D:\GitHub\sony\rat-test-app\app\build\intermediates\transforms\stackFramesFixer\debug\7.jar --classpath_entry D:\GitHub\sony\rat-test-app\app\build\intermediates\transforms\stackFramesFixer\debug\8.jar --classpath_entry D:\GitHub\sony\rat-test-app\app\build\intermediates\transforms\stackFramesFixer\debug\9.jar --classpath_entry D:\GitHub\sony\rat-test-app\app\build\intermediates\transforms\stackFramesFixer\debug\10.jar --classpath_entry D:\GitHub\sony\rat-test-app\app\build\intermediates\transforms\stackFramesFixer\debug\11.jar --classpath_entry D:\GitHub\sony\rat-test-app\app\build\intermediates\transforms\stackFramesFixer\debug\12.jar --classpath_entry D:\GitHub\sony\rat-test-app\app\build\intermediates\transforms\stackFramesFixer\debug\13.jar --classpath_entry D:\GitHub\sony\rat-test-app\app\build\intermediates\transforms\stackFramesFixer\debug\14.jar --classpath_entry D:\GitHub\sony\rat-test-app\app\build\intermediates\transforms\stackFramesFixer\debug\15.jar --classpath_entry D:\GitHub\sony\rat-test-app\app\build\intermediates\transforms\stackFramesFixer\debug\16.jar --classpath_entry D:\GitHub\sony\rat-test-app\app\build\intermediates\transforms\stackFramesFixer\debug\17.jar --classpath_entry D:\GitHub\sony\rat-test-app\app\build\intermediates\transforms\stackFramesFixer\debug\18.jar --classpath_entry D:\GitHub\sony\rat-test-app\app\build\intermediates\transforms\stackFramesFixer\debug\19.jar --bootclasspath_entry C:\Users\23060884\AppData\Local\Android\Sdk\platforms\android-27\android.jar --bootclasspath_entry C:\Users\23060884\AppData\Local\Android\Sdk\platforms\android-27\optional\org.apache.http.legacy.jar --bootclasspath_entry C:\Program Files\Android\Android Studio\jre\jre\lib\resources.jar --bootclasspath_entry C:\Program Files\Android\Android Studio\jre\jre\lib\rt.jar --bootclasspath_entry C:\Program Files\Android\Android Studio\jre\jre\lib\jsse.jar --bootclasspath_entry C:\Program Files\Android\Android Studio\jre\jre\lib\jce.jar --bootclasspath_entry C:\Program Files\Android\Android Studio\jre\jre\lib\charsets.jar --min_sdk_version 24 --nodesugar_try_with_resources_if_needed --desugar_try_with_resources_omit_runtime_classes
  278. Starting process 'command 'C:\Program Files\Android\Android Studio\jre\bin\java.exe''. Working directory: D:\GitHub\sony\rat-test-app\app Command: C:\Program Files\Android\Android Studio\jre\bin\java.exe -Djava.awt.headless=true -Xmx64M -Dfile.encoding=windows-1252 -Duser.country=US -Duser.language=en -Duser.variant -cp C:\Users\23060884\AppData\Local\Temp\desugar_deploy.jar3440688514464625138 com.google.devtools.build.android.desugar.Desugar --verbose --input D:\GitHub\sony\rat-test-app\app\build\intermediates\transforms\stackFramesFixer\debug\3.jar --output D:\GitHub\sony\rat-test-app\app\build\intermediates\transforms\desugar\debug\4.jar --input D:\GitHub\sony\rat-test-app\app\build\intermediates\transforms\stackFramesFixer\debug\2.jar --output D:\GitHub\sony\rat-test-app\app\build\intermediates\transforms\desugar\debug\3.jar --classpath_entry D:\GitHub\sony\rat-test-app\app\build\intermediates\classes\debug --classpath_entry D:\GitHub\sony\rat-test-app\app\build\intermediates\transforms\stackFramesFixer\debug\0.jar --classpath_entry D:\GitHub\sony\rat-test-app\app\build\intermediates\transforms\stackFramesFixer\debug\1.jar --classpath_entry D:\GitHub\sony\rat-test-app\app\build\intermediates\transforms\stackFramesFixer\debug\2.jar --classpath_entry D:\GitHub\sony\rat-test-app\app\build\intermediates\transforms\stackFramesFixer\debug\3.jar --classpath_entry D:\GitHub\sony\rat-test-app\app\build\intermediates\transforms\stackFramesFixer\debug\4.jar --classpath_entry D:\GitHub\sony\rat-test-app\app\build\intermediates\transforms\stackFramesFixer\debug\5.jar --classpath_entry D:\GitHub\sony\rat-test-app\app\build\intermediates\transforms\stackFramesFixer\debug\6.jar --classpath_entry D:\GitHub\sony\rat-test-app\app\build\intermediates\transforms\stackFramesFixer\debug\7.jar --classpath_entry D:\GitHub\sony\rat-test-app\app\build\intermediates\transforms\stackFramesFixer\debug\8.jar --classpath_entry D:\GitHub\sony\rat-test-app\app\build\intermediates\transforms\stackFramesFixer\debug\9.jar --classpath_entry D:\GitHub\sony\rat-test-app\app\build\intermediates\transforms\stackFramesFixer\debug\10.jar --classpath_entry D:\GitHub\sony\rat-test-app\app\build\intermediates\transforms\stackFramesFixer\debug\11.jar --classpath_entry D:\GitHub\sony\rat-test-app\app\build\intermediates\transforms\stackFramesFixer\debug\12.jar --classpath_entry D:\GitHub\sony\rat-test-app\app\build\intermediates\transforms\stackFramesFixer\debug\13.jar --classpath_entry D:\GitHub\sony\rat-test-app\app\build\intermediates\transforms\stackFramesFixer\debug\14.jar --classpath_entry D:\GitHub\sony\rat-test-app\app\build\intermediates\transforms\stackFramesFixer\debug\15.jar --classpath_entry D:\GitHub\sony\rat-test-app\app\build\intermediates\transforms\stackFramesFixer\debug\16.jar --classpath_entry D:\GitHub\sony\rat-test-app\app\build\intermediates\transforms\stackFramesFixer\debug\17.jar --classpath_entry D:\GitHub\sony\rat-test-app\app\build\intermediates\transforms\stackFramesFixer\debug\18.jar --classpath_entry D:\GitHub\sony\rat-test-app\app\build\intermediates\transforms\stackFramesFixer\debug\19.jar --bootclasspath_entry C:\Users\23060884\AppData\Local\Android\Sdk\platforms\android-27\android.jar --bootclasspath_entry C:\Users\23060884\AppData\Local\Android\Sdk\platforms\android-27\optional\org.apache.http.legacy.jar --bootclasspath_entry C:\Program Files\Android\Android Studio\jre\jre\lib\resources.jar --bootclasspath_entry C:\Program Files\Android\Android Studio\jre\jre\lib\rt.jar --bootclasspath_entry C:\Program Files\Android\Android Studio\jre\jre\lib\jsse.jar --bootclasspath_entry C:\Program Files\Android\Android Studio\jre\jre\lib\jce.jar --bootclasspath_entry C:\Program Files\Android\Android Studio\jre\jre\lib\charsets.jar --min_sdk_version 24 --nodesugar_try_with_resources_if_needed --desugar_try_with_resources_omit_runtime_classes
  279. Successfully started process 'command 'C:\Program Files\Android\Android Studio\jre\bin\java.exe''
  280. Successfully started process 'command 'C:\Program Files\Android\Android Studio\jre\bin\java.exe''
  281. Successfully started process 'command 'C:\Program Files\Android\Android Studio\jre\bin\java.exe''
  282. Successfully started process 'command 'C:\Program Files\Android\Android Studio\jre\bin\java.exe''
  283. Successfully started process 'command 'C:\Program Files\Android\Android Studio\jre\bin\java.exe''
  284. Successfully started process 'command 'C:\Program Files\Android\Android Studio\jre\bin\java.exe''
  285. Successfully started process 'command 'C:\Program Files\Android\Android Studio\jre\bin\java.exe''
  286. Successfully started process 'command 'C:\Program Files\Android\Android Studio\jre\bin\java.exe''
  287. Lambda classes will be written under C:\Users\23060884\AppData\Local\Temp\lambdas4858511094224565399
  288.  
  289. Lambda classes will be written under C:\Users\23060884\AppData\Local\Temp\lambdas4889517821186293308
  290.  
  291. Lambda classes will be written under C:\Users\23060884\AppData\Local\Temp\lambdas3422290548426301831
  292.  
  293. Lambda classes will be written under C:\Users\23060884\AppData\Local\Temp\lambdas8910065705088654806
  294.  
  295. Lambda classes will be written under C:\Users\23060884\AppData\Local\Temp\lambdas8918956328749462160
  296.  
  297. Lambda classes will be written under C:\Users\23060884\AppData\Local\Temp\lambdas1027847346755117878
  298.  
  299. Lambda classes will be written under C:\Users\23060884\AppData\Local\Temp\lambdas7646130647783886788
  300.  
  301.  
  302. Exception in thread "main" java.lang.IllegalStateException: Couldn't desugar invokedynamic for android/view/accessibility/AccessibilityManager.run using java/lang/invoke/LambdaMetafactory.metafactory(Ljava/lang/invoke/MethodHandles$Lookup;Ljava/lang/String;Ljava/lang/invoke/MethodType;Ljava/lang/invoke/MethodType;Ljava/lang/invoke/MethodHandle;Ljava/lang/invoke/MethodType;)Ljava/lang/invoke/CallSite; (6) with arguments [()V, android/view/accessibility/AccessibilityManager.lambda$notifyAccessibilityStateChanged$0(Landroid/view/accessibility/AccessibilityManager$AccessibilityStateChangeListener;Z)V (6), ()V]
  303.     at com.google.devtools.build.android.desugar.LambdaDesugaring$InvokedynamicRewriter.visitInvokeDynamicInsn(LambdaDesugaring.java:467)
  304.     at org.objectweb.asm.ClassReader.a(Unknown Source)
  305.     at org.objectweb.asm.ClassReader.b(Unknown Source)
  306.     at org.objectweb.asm.ClassReader.accept(Unknown Source)
  307.     at org.objectweb.asm.ClassReader.accept(Unknown Source)
  308.     at com.google.devtools.build.android.desugar.Desugar.desugarClassesInInput(Desugar.java:401)
  309.     at com.google.devtools.build.android.desugar.Desugar.desugarOneInput(Desugar.java:326)
  310.     at com.google.devtools.build.android.desugar.Desugar.desugar(Desugar.java:280)
  311.     at com.google.devtools.build.android.desugar.Desugar.main(Desugar.java:584)
  312. Caused by: java.lang.NoSuchMethodException: no such method: android.view.accessibility.AccessibilityManager.lambda$notifyAccessibilityStateChanged$0(AccessibilityStateChangeListener,boolean)void/invokeStatic
  313.     at java.lang.invoke.MemberName.makeAccessException(MemberName.java:871)
  314.     at java.lang.invoke.MemberName$Factory.resolveOrFail(MemberName.java:1003)
  315.     at java.lang.invoke.MethodHandles$Lookup.resolveOrFail(MethodHandles.java:1386)
  316.     at java.lang.invoke.MethodHandles$Lookup.findStatic(MethodHandles.java:780)
  317.     at com.google.devtools.build.android.desugar.LambdaDesugaring$InvokedynamicRewriter.toMethodHandle(LambdaDesugaring.java:604)
  318.     at com.google.devtools.build.android.desugar.LambdaDesugaring$InvokedynamicRewriter.toJvmMetatype(LambdaDesugaring.java:586)
  319.     at com.google.devtools.build.android.desugar.LambdaDesugaring$InvokedynamicRewriter.visitInvokeDynamicInsn(LambdaDesugaring.java:401)
  320.     ... 8 more
  321. Caused by: java.lang.NoSuchFieldError: method resolution failed
  322.     at java.lang.invoke.MethodHandleNatives.resolve(Native Method)
  323.     at java.lang.invoke.MemberName$Factory.resolve(MemberName.java:975)
  324.     at java.lang.invoke.MemberName$Factory.resolveOrFail(MemberName.java:1000)
  325.     ... 13 more
  326.  
  327.  
  328. Lambda classes will be written under C:\Users\23060884\AppData\Local\Temp\lambdas7647442432822263233
  329.  
  330. :app:transformClassesWithDesugarForDebug FAILED
  331. :app:transformClassesWithDesugarForDebug (Thread[Task worker for ':',5,main]) completed. Took 24.244 secs.
  332.  
  333. FAILURE: Build failed with an exception.
  334.  
  335. * What went wrong:
  336. Execution failed for task ':app:transformClassesWithDesugarForDebug'.
  337. > com.android.build.api.transform.TransformException: java.lang.RuntimeException: java.lang.RuntimeException: com.android.ide.common.process.ProcessException: Error while executing java process with main class com.google.devtools.build.android.desugar.Desugar with arguments {--verbose --input D:\GitHub\sony\rat-test-app\app\build\intermediates\transforms\stackFramesFixer\debug\4.jar --output D:\GitHub\sony\rat-test-app\app\build\intermediates\transforms\desugar\debug\5.jar --input D:\GitHub\sony\rat-test-app\app\build\intermediates\transforms\stackFramesFixer\debug\5.jar --output D:\GitHub\sony\rat-test-app\app\build\intermediates\transforms\desugar\debug\6.jar --input D:\GitHub\sony\rat-test-app\app\build\intermediates\transforms\stackFramesFixer\debug\0.jar --output D:\GitHub\sony\rat-test-app\app\build\intermediates\transforms\desugar\debug\1.jar --classpath_entry D:\GitHub\sony\rat-test-app\app\build\intermediates\classes\debug --classpath_entry D:\GitHub\sony\rat-test-app\app\build\intermediates\transforms\stackFramesFixer\debug\0.jar --classpath_entry D:\GitHub\sony\rat-test-app\app\build\intermediates\transforms\stackFramesFixer\debug\1.jar --classpath_entry D:\GitHub\sony\rat-test-app\app\build\intermediates\transforms\stackFramesFixer\debug\2.jar --classpath_entry D:\GitHub\sony\rat-test-app\app\build\intermediates\transforms\stackFramesFixer\debug\3.jar --classpath_entry D:\GitHub\sony\rat-test-app\app\build\intermediates\transforms\stackFramesFixer\debug\4.jar --classpath_entry D:\GitHub\sony\rat-test-app\app\build\intermediates\transforms\stackFramesFixer\debug\5.jar --classpath_entry D:\GitHub\sony\rat-test-app\app\build\intermediates\transforms\stackFramesFixer\debug\6.jar --classpath_entry D:\GitHub\sony\rat-test-app\app\build\intermediates\transforms\stackFramesFixer\debug\7.jar --classpath_entry D:\GitHub\sony\rat-test-app\app\build\intermediates\transforms\stackFramesFixer\debug\8.jar --classpath_entry D:\GitHub\sony\rat-test-app\app\build\intermediates\transforms\stackFramesFixer\debug\9.jar --classpath_entry D:\GitHub\sony\rat-test-app\app\build\intermediates\transforms\stackFramesFixer\debug\10.jar --classpath_entry D:\GitHub\sony\rat-test-app\app\build\intermediates\transforms\stackFramesFixer\debug\11.jar --classpath_entry D:\GitHub\sony\rat-test-app\app\build\intermediates\transforms\stackFramesFixer\debug\12.jar --classpath_entry D:\GitHub\sony\rat-test-app\app\build\intermediates\transforms\stackFramesFixer\debug\13.jar --classpath_entry D:\GitHub\sony\rat-test-app\app\build\intermediates\transforms\stackFramesFixer\debug\14.jar --classpath_entry D:\GitHub\sony\rat-test-app\app\build\intermediates\transforms\stackFramesFixer\debug\15.jar --classpath_entry D:\GitHub\sony\rat-test-app\app\build\intermediates\transforms\stackFramesFixer\debug\16.jar --classpath_entry D:\GitHub\sony\rat-test-app\app\build\intermediates\transforms\stackFramesFixer\debug\17.jar --classpath_entry D:\GitHub\sony\rat-test-app\app\build\intermediates\transforms\stackFramesFixer\debug\18.jar --classpath_entry D:\GitHub\sony\rat-test-app\app\build\intermediates\transforms\stackFramesFixer\debug\19.jar --bootclasspath_entry C:\Users\23060884\AppData\Local\Android\Sdk\platforms\android-27\android.jar --bootclasspath_entry C:\Users\23060884\AppData\Local\Android\Sdk\platforms\android-27\optional\org.apache.http.legacy.jar --bootclasspath_entry C:\Program Files\Android\Android Studio\jre\jre\lib\resources.jar --bootclasspath_entry C:\Program Files\Android\Android Studio\jre\jre\lib\rt.jar --bootclasspath_entry C:\Program Files\Android\Android Studio\jre\jre\lib\jsse.jar --bootclasspath_entry C:\Program Files\Android\Android Studio\jre\jre\lib\jce.jar --bootclasspath_entry C:\Program Files\Android\Android Studio\jre\jre\lib\charsets.jar --min_sdk_version 24 --nodesugar_try_with_resources_if_needed --desugar_try_with_resources_omit_runtime_classes}
  338.  
  339. * Try:
  340. Run with --stacktrace option to get the stack trace. Run with --debug option to get more log output.
  341.  
  342. * Get more help at https://help.gradle.org
  343.  
  344. BUILD FAILED in 30s
  345.  
  346. 19 actionable tasks: 1 executed, 18 up-to-date
RAW Paste Data
We use cookies for various purposes including analytics. By continuing to use Pastebin, you agree to our use of cookies as described in the Cookies Policy. OK, I Understand
 
Top