daily pastebin goal
6%
SHARE
TWEET

Untitled

a guest Feb 16th, 2019 63 Never
Not a member of Pastebin yet? Sign Up, it unlocks many cool features!
  1. C:\Users\wedro\Desktop\new_program\auctiopossum>gradlew clean cleanCache setupDevWorkspace --refresh-dependencies --stacktrace
  2. Downloading https://services.gradle.org/distributions/gradle-2.0-bin.zip
  3. ..............................................................................................................................................................................
  4. ..............................................................................................................................................................................
  5. ..............................................................................................................................................................................
  6. ..............................................................................................................................................................................
  7. ..............................................................................................................................................................................
  8. ..............................................................................................................................................................................
  9. ..............................................................................................................................................................................
  10. ..............................................................................................................................................................................
  11. ..............................................................................................................................................................................
  12. ..............................................................................................................................................................................
  13. ..............................................................................................................................................................................
  14. ...............................................................................................................................................................
  15. Unzipping C:\Users\wedro\.gradle\wrapper\dists\gradle-2.0-bin\5h57m9vra0mjv9qs45oqtsb5c0\gradle-2.0-bin.zip to C:\Users\wedro\.gradle\wrapper\dists\gradle-2.0-bin\5h57m9vra0m
  16. jv9qs45oqtsb5c0
  17. Download http://repo1.maven.org/maven2/org/eclipse/equinox/preferences/3.5.200-v20140224-1527/preferences-3.5.200-v20140224-1527.pom
  18. Download http://repo1.maven.org/maven2/org/eclipse/osgi/3.10.0-v20140606-1445/osgi-3.10.0-v20140606-1445.pom
  19. Download http://repo1.maven.org/maven2/org/eclipse/core/jobs/3.6.0-v20140424-0053/jobs-3.6.0-v20140424-0053.pom
  20. Download http://repo1.maven.org/maven2/org/eclipse/core/contenttype/3.4.200-v20140207-1251/contenttype-3.4.200-v20140207-1251.pom
  21. Download http://repo1.maven.org/maven2/org/eclipse/core/runtime/3.10.0-v20140318-2214/runtime-3.10.0-v20140318-2214.pom
  22. Download http://repo1.maven.org/maven2/org/eclipse/equinox/preferences/3.5.200-v20140224-1527/preferences-3.5.200-v20140224-1527.jar
  23. Download http://repo1.maven.org/maven2/org/eclipse/osgi/3.10.0-v20140606-1445/osgi-3.10.0-v20140606-1445.jar
  24. Download http://repo1.maven.org/maven2/org/eclipse/core/jobs/3.6.0-v20140424-0053/jobs-3.6.0-v20140424-0053.jar
  25. Download http://repo1.maven.org/maven2/org/eclipse/core/contenttype/3.4.200-v20140207-1251/contenttype-3.4.200-v20140207-1251.jar
  26. Download http://repo1.maven.org/maven2/org/eclipse/core/runtime/3.10.0-v20140318-2214/runtime-3.10.0-v20140318-2214.jar
  27. fatal: not a git repository (or any of the parent directories): .git    
  28.  
  29. FAILURE: Build failed with an exception.  
  30.                            
  31. * Where:                    
  32. Build file 'C:\Users\wedro\Desktop\new_program\auctiopossum\build.gradle' line: 46
  33.                            
  34. * What went wrong:          
  35. A problem occurred evaluating root project 'forge'.
  36. > Process 'command 'git'' finished with non-zero exit value 128
  37.                            
  38. * Try:                      
  39. Run with --info or --debug option to get more log output.
  40.                            
  41. * Exception is:            
  42. org.gradle.api.GradleScriptException: A problem occurred evaluating root project 'forge'.
  43.         at org.gradle.groovy.scripts.internal.DefaultScriptRunnerFactory$ScriptRunnerImpl.run(DefaultScriptRunnerFactory.java:54)
  44.         at org.gradle.configuration.DefaultScriptPluginFactory$ScriptPluginImpl.apply(DefaultScriptPluginFactory.java:187)
  45.         at org.gradle.configuration.project.BuildScriptProcessor.execute(BuildScriptProcessor.java:39)
  46.         at org.gradle.configuration.project.BuildScriptProcessor.execute(BuildScriptProcessor.java:26)
  47.         at org.gradle.configuration.project.ConfigureActionsProjectEvaluator.evaluate(ConfigureActionsProjectEvaluator.java:34)
  48.         at org.gradle.configuration.project.LifecycleProjectEvaluator.evaluate(LifecycleProjectEvaluator.java:55)
  49.         at org.gradle.api.internal.project.AbstractProject.evaluate(AbstractProject.java:470)
  50.         at org.gradle.api.internal.project.AbstractProject.evaluate(AbstractProject.java:79)
  51.         at org.gradle.configuration.DefaultBuildConfigurer.configure(DefaultBuildConfigurer.java:31)
  52.         at org.gradle.initialization.DefaultGradleLauncher.doBuildStages(DefaultGradleLauncher.java:128)
  53.         at org.gradle.initialization.DefaultGradleLauncher.doBuild(DefaultGradleLauncher.java:105)
  54.         at org.gradle.initialization.DefaultGradleLauncher.run(DefaultGradleLauncher.java:85)
  55.         at org.gradle.launcher.exec.InProcessBuildActionExecuter$DefaultBuildController.run(InProcessBuildActionExecuter.java:81)
  56.         at org.gradle.launcher.cli.ExecuteBuildAction.run(ExecuteBuildAction.java:33)
  57.         at org.gradle.launcher.cli.ExecuteBuildAction.run(ExecuteBuildAction.java:24)
  58.         at org.gradle.launcher.exec.InProcessBuildActionExecuter.execute(InProcessBuildActionExecuter.java:39)
  59.         at org.gradle.launcher.exec.InProcessBuildActionExecuter.execute(InProcessBuildActionExecuter.java:29)
  60.         at org.gradle.launcher.cli.RunBuildAction.run(RunBuildAction.java:50)
  61.         at org.gradle.internal.Actions$RunnableActionAdapter.execute(Actions.java:171)
  62.         at org.gradle.launcher.cli.CommandLineActionFactory$ParseAndBuildAction.execute(CommandLineActionFactory.java:237)
  63.         at org.gradle.launcher.cli.CommandLineActionFactory$ParseAndBuildAction.execute(CommandLineActionFactory.java:210)
  64.         at org.gradle.launcher.cli.JavaRuntimeValidationAction.execute(JavaRuntimeValidationAction.java:35)
  65.         at org.gradle.launcher.cli.JavaRuntimeValidationAction.execute(JavaRuntimeValidationAction.java:24)
  66.         at org.gradle.launcher.cli.CommandLineActionFactory$WithLogging.execute(CommandLineActionFactory.java:206)
  67.         at org.gradle.launcher.cli.CommandLineActionFactory$WithLogging.execute(CommandLineActionFactory.java:169)
  68.         at org.gradle.launcher.cli.ExceptionReportingAction.execute(ExceptionReportingAction.java:33)
  69.         at org.gradle.launcher.cli.ExceptionReportingAction.execute(ExceptionReportingAction.java:22)
  70.         at org.gradle.launcher.Main.doAction(Main.java:33)
  71.         at org.gradle.launcher.bootstrap.EntryPoint.run(EntryPoint.java:45)
  72.         at org.gradle.launcher.bootstrap.ProcessBootstrap.runNoExit(ProcessBootstrap.java:54)
  73.         at org.gradle.launcher.bootstrap.ProcessBootstrap.run(ProcessBootstrap.java:35)
  74.         at org.gradle.launcher.GradleMain.main(GradleMain.java:23)
  75.         at org.gradle.wrapper.BootstrapMainStarter.start(BootstrapMainStarter.java:30)
  76.         at org.gradle.wrapper.WrapperExecutor.execute(WrapperExecutor.java:127)
  77.         at org.gradle.wrapper.GradleWrapperMain.main(GradleWrapperMain.java:56)
  78. Caused by: org.gradle.process.internal.ExecException: Process 'command 'git'' finished with non-zero exit value 128
  79.         at org.gradle.process.internal.DefaultExecHandle$ExecResultImpl.assertNormalExitValue(DefaultExecHandle.java:365)
  80.         at org.gradle.process.internal.DefaultExecAction.execute(DefaultExecAction.java:31)
  81.         at org.gradle.api.internal.file.DefaultFileOperations.exec(DefaultFileOperations.java:164)
  82.         at org.gradle.api.internal.project.AbstractProject.exec(AbstractProject.java:753)
  83.         at net.minecraftforge.gradle.dev.DevBasePlugin.runGit(DevBasePlugin.java:420)
  84.         at net.minecraftforge.gradle.dev.ForgeDevPlugin.getVersionFromJava(ForgeDevPlugin.java:720)
  85.         at net.minecraftforge.gradle.dev.ForgeDevPlugin$getVersionFromJava.callStatic(Unknown Source)
  86.         at build_1u4e5ne16asdg7v2u9cf15j4k9.run(C:\Users\wedro\Desktop\new_program\auctiopossum\build.gradle:46)
  87.         at org.gradle.groovy.scripts.internal.DefaultScriptRunnerFactory$ScriptRunnerImpl.run(DefaultScriptRunnerFactory.java:52)
  88.         ... 34 more        
  89.                            
  90.                            
  91. BUILD FAILED                
  92.                            
  93. Total time: 51.024 secs
RAW Paste Data
We use cookies for various purposes including analytics. By continuing to use Pastebin, you agree to our use of cookies as described in the Cookies Policy. OK, I Understand
 
Top