Guest User

2.7.17

a guest
Dec 11th, 2019
187
Never
Not a member of Pastebin yet? Sign Up, it unlocks many cool features!
  1. == CPython 2.7.17 (default, Dec 11 2019, 05:36:43) [GCC 4.2.1 Compatible Apple LLVM 11.0.0 (clang-1100.0.33.16)]
  2. == Darwin-19.2.0-x86_64-i386-64bit little-endian
  3. == /private/var/folders/_v/9r245bv51z77v4_khb_j55y40000gn/T/test_python_73441
  4. == CPU count: 4
  5. Run tests sequentially
  6. 0:00:00 load avg: 2.33 [ 1/404] test_grammar
  7. 0:00:00 load avg: 2.33 [ 2/404] test_opcodes
  8. 0:00:00 load avg: 2.33 [ 3/404] test_dict
  9. 0:00:00 load avg: 2.33 [ 4/404] test_builtin
  10. 0:00:00 load avg: 2.33 [ 5/404] test_exceptions
  11. 0:00:00 load avg: 2.33 [ 6/404] test_types
  12. 0:00:00 load avg: 2.33 [ 7/404] test_unittest
  13. 0:00:00 load avg: 2.33 [ 8/404] test_doctest
  14. 0:00:00 load avg: 2.33 [ 9/404] test_doctest2
  15. 0:00:00 load avg: 2.33 [ 10/404] test_MimeWriter
  16. 0:00:00 load avg: 2.33 [ 11/404] test_SimpleHTTPServer
  17. 0:00:00 load avg: 2.33 [ 12/404] test_StringIO
  18. 0:00:00 load avg: 2.33 [ 13/404] test___all__
  19. 0:00:01 load avg: 2.33 [ 14/404] test___future__
  20. 0:00:02 load avg: 2.33 [ 15/404] test__locale
  21. 0:00:02 load avg: 2.33 [ 16/404] test__osx_support
  22. 0:00:02 load avg: 2.33 [ 17/404] test_abc
  23. 0:00:02 load avg: 2.33 [ 18/404] test_abstract_numbers
  24. 0:00:02 load avg: 2.33 [ 19/404] test_aepack
  25. 0:00:03 load avg: 2.33 [ 20/404] test_aifc
  26. 0:00:03 load avg: 2.33 [ 21/404] test_al
  27. test_al skipped -- No module named al
  28. 0:00:03 load avg: 2.33 [ 22/404] test_anydbm -- test_al skipped
  29. 0:00:04 load avg: 2.47 [ 23/404] test_applesingle
  30. 0:00:04 load avg: 2.47 [ 24/404] test_argparse
  31. 0:00:06 load avg: 2.47 [ 25/404] test_array
  32. 0:00:06 load avg: 2.47 [ 26/404] test_ascii_formatd
  33. 0:00:06 load avg: 2.47 [ 27/404] test_ast
  34. 0:00:06 load avg: 2.47 [ 28/404] test_asynchat
  35. 0:00:08 load avg: 2.47 [ 29/404] test_asyncore
  36. 0:00:09 load avg: 2.51 [ 30/404] test_atexit
  37. 0:00:09 load avg: 2.51 [ 31/404] test_audioop
  38. 0:00:09 load avg: 2.51 [ 32/404] test_augassign
  39. 0:00:09 load avg: 2.51 [ 33/404] test_base64
  40. 0:00:09 load avg: 2.51 [ 34/404] test_bastion
  41. 0:00:09 load avg: 2.51 [ 35/404] test_bdb
  42. 0:00:09 load avg: 2.51 [ 36/404] test_bigaddrspace
  43. 0:00:09 load avg: 2.51 [ 37/404] test_bigmem
  44. 0:00:09 load avg: 2.51 [ 38/404] test_binascii
  45. 0:00:09 load avg: 2.51 [ 39/404] test_binhex
  46. 0:00:10 load avg: 2.51 [ 40/404] test_binop
  47. 0:00:10 load avg: 2.51 [ 41/404] test_bisect
  48. 0:00:10 load avg: 2.51 [ 42/404] test_bool
  49. 0:00:10 load avg: 2.51 [ 43/404] test_bsddb
  50. test_bsddb skipped -- No module named _bsddb
  51. 0:00:10 load avg: 2.51 [ 44/404] test_bsddb185 -- test_bsddb skipped
  52. 0:00:10 load avg: 2.51 [ 45/404] test_bsddb3
  53. test_bsddb3 skipped -- No module named _bsddb
  54. 0:00:10 load avg: 2.51 [ 46/404] test_buffer -- test_bsddb3 skipped
  55. 0:00:10 load avg: 2.51 [ 47/404] test_bufio
  56. 0:00:13 load avg: 2.51 [ 48/404] test_bytes
  57. 0:00:14 load avg: 2.63 [ 49/404] test_bz2
  58. 0:00:15 load avg: 2.63 [ 50/404] test_calendar
  59. 0:00:17 load avg: 2.63 [ 51/404] test_call
  60. 0:00:17 load avg: 2.63 [ 52/404] test_capi
  61. 0:00:20 load avg: 2.66 [ 53/404] test_cd
  62. test_cd skipped -- No module named cd
  63. 0:00:20 load avg: 2.66 [ 54/404] test_cfgparser -- test_cd skipped
  64. 0:00:20 load avg: 2.66 [ 55/404] test_cgi
  65. 0:00:21 load avg: 2.66 [ 56/404] test_charmapcodec
  66. 0:00:21 load avg: 2.66 [ 57/404] test_cl
  67. test_cl skipped -- No module named cl
  68. 0:00:21 load avg: 2.66 [ 58/404] test_class -- test_cl skipped
  69. 0:00:21 load avg: 2.66 [ 59/404] test_cmath
  70. 0:00:21 load avg: 2.66 [ 60/404] test_cmd
  71. 0:00:21 load avg: 2.66 [ 61/404] test_cmd_line
  72. 0:00:22 load avg: 2.66 [ 62/404] test_cmd_line_script
  73. 0:00:23 load avg: 2.66 [ 63/404] test_code
  74. 0:00:23 load avg: 2.66 [ 64/404] test_codeccallbacks
  75. 0:00:23 load avg: 2.66 [ 65/404] test_codecencodings_cn
  76. 0:00:24 load avg: 2.68 [ 66/404] test_codecencodings_hk
  77. 0:00:24 load avg: 2.68 [ 67/404] test_codecencodings_iso2022
  78. 0:00:25 load avg: 2.68 [ 68/404] test_codecencodings_jp
  79. 0:00:26 load avg: 2.68 [ 69/404] test_codecencodings_kr
  80. 0:00:26 load avg: 2.68 [ 70/404] test_codecencodings_tw
  81. 0:00:26 load avg: 2.68 [ 71/404] test_codecmaps_cn
  82. test_codecmaps_cn skipped -- Use of the `urlfetch' resource not enabled
  83. 0:00:26 load avg: 2.68 [ 72/404] test_codecmaps_hk -- test_codecmaps_cn skipped (resource denied)
  84. test_codecmaps_hk skipped -- Use of the `urlfetch' resource not enabled
  85. 0:00:26 load avg: 2.68 [ 73/404] test_codecmaps_jp -- test_codecmaps_hk skipped (resource denied)
  86. test_codecmaps_jp skipped -- Use of the `urlfetch' resource not enabled
  87. 0:00:26 load avg: 2.68 [ 74/404] test_codecmaps_kr -- test_codecmaps_jp skipped (resource denied)
  88. test_codecmaps_kr skipped -- Use of the `urlfetch' resource not enabled
  89. 0:00:26 load avg: 2.68 [ 75/404] test_codecmaps_tw -- test_codecmaps_kr skipped (resource denied)
  90. test_codecmaps_tw skipped -- Use of the `urlfetch' resource not enabled
  91. 0:00:26 load avg: 2.68 [ 76/404] test_codecs -- test_codecmaps_tw skipped (resource denied)
  92. 0:00:28 load avg: 2.68 [ 77/404] test_codeop
  93. 0:00:28 load avg: 2.68 [ 78/404] test_coercion
  94. 0:00:28 load avg: 2.68 [ 79/404] test_collections
  95. 0:00:29 load avg: 3.43 [ 80/404] test_colorsys
  96. 0:00:29 load avg: 3.43 [ 81/404] test_commands
  97. 0:00:29 load avg: 3.43 [ 82/404] test_compare
  98. 0:00:29 load avg: 3.43 [ 83/404] test_compile
  99. 0:00:29 load avg: 3.43 [ 84/404] test_compileall
  100. 0:00:29 load avg: 3.43 [ 85/404] test_compiler
  101. 0:00:30 load avg: 3.43 [ 86/404] test_complex
  102. 0:00:30 load avg: 3.43 [ 87/404] test_complex_args
  103. 0:00:30 load avg: 3.43 [ 88/404] test_contains
  104. 0:00:30 load avg: 3.43 [ 89/404] test_contextlib
  105. 0:00:31 load avg: 3.43 [ 90/404] test_cookie
  106. 0:00:31 load avg: 3.43 [ 91/404] test_cookielib
  107. 0:00:31 load avg: 3.43 [ 92/404] test_copy
  108. 0:00:31 load avg: 3.43 [ 93/404] test_copy_reg
  109. 0:00:31 load avg: 3.43 [ 94/404] test_cpickle
  110. 0:00:36 load avg: 3.88 [ 95/404] test_cprofile
  111. 0:00:36 load avg: 3.88 [ 96/404] test_crypt
  112. 0:00:37 load avg: 3.88 [ 97/404] test_csv
  113. 0:00:37 load avg: 3.88 [ 98/404] test_ctypes
  114. 0:00:38 load avg: 3.88 [ 99/404] test_curses
  115. test_curses skipped -- Use of the `curses' resource not enabled
  116. 0:00:38 load avg: 3.88 [100/404] test_datetime -- test_curses skipped (resource denied)
  117. 0:00:39 load avg: 8.05 [101/404] test_dbm
  118. 0:00:39 load avg: 8.05 [102/404] test_decimal
  119. 0:00:41 load avg: 8.05 [103/404] test_decorators
  120. 0:00:42 load avg: 8.05 [104/404] test_defaultdict
  121. 0:00:42 load avg: 8.05 [105/404] test_deque
  122. 0:00:45 load avg: 8.13 [106/404] test_descr
  123. 0:00:48 load avg: 8.13 [107/404] test_descrtut
  124. 0:00:48 load avg: 8.13 [108/404] test_dictcomps
  125. 0:00:48 load avg: 8.13 [109/404] test_dictviews
  126. 0:00:49 load avg: 8.13 [110/404] test_difflib
  127. 0:00:50 load avg: 8.12 [111/404] test_dircache
  128. 0:00:51 load avg: 8.12 [112/404] test_dis
  129. 0:00:52 load avg: 8.12 [113/404] test_distutils
  130. 0:00:54 load avg: 8.11 [114/404] test_dl
  131. test_dl skipped -- No module named dl
  132. 0:00:55 load avg: 8.11 [115/404] test_docxmlrpc -- test_dl skipped
  133. 0:00:58 load avg: 8.11 [116/404] test_dumbdbm
  134. 0:00:59 load avg: 8.11 [117/404] test_dummy_thread
  135. 0:00:59 load avg: 8.11 [118/404] test_dummy_threading
  136. 0:00:59 load avg: 8.18 [119/404] test_email
  137. 0:01:03 load avg: 8.18 [120/404] test_email_codecs
  138. 0:01:03 load avg: 8.18 [121/404] test_email_renamed
  139. 0:01:04 load avg: 8.18 [122/404] test_ensurepip
  140. 0:01:04 load avg: 8.18 [123/404] test_enumerate
  141. 0:01:04 load avg: 9.36 [124/404] test_eof
  142. 0:01:04 load avg: 9.36 [125/404] test_epoll
  143. test_epoll skipped -- test works only on Linux 2.6
  144. 0:01:04 load avg: 9.36 [126/404] test_errno -- test_epoll skipped
  145. 0:01:04 load avg: 9.36 [127/404] test_exception_variations
  146. 0:01:04 load avg: 9.36 [128/404] test_extcall
  147. 0:01:05 load avg: 9.36 [129/404] test_fcntl
  148. 0:01:05 load avg: 9.36 [130/404] test_file
  149. 0:01:05 load avg: 9.36 [131/404] test_file2k
  150. 0:01:14 load avg: 9.49 [132/404] test_file_eintr
  151. 0:01:15 load avg: 9.45 [133/404] test_filecmp
  152. 0:01:15 load avg: 9.45 [134/404] test_fileinput
  153. 0:01:15 load avg: 9.45 [135/404] test_fileio
  154. 0:01:15 load avg: 9.45 [136/404] test_float
  155. 0:01:15 load avg: 9.45 [137/404] test_fnmatch
  156. 0:01:15 load avg: 9.45 [138/404] test_fork1
  157. 0:01:21 load avg: 8.70 [139/404] test_format
  158. 0:01:21 load avg: 8.70 [140/404] test_fpformat
  159. 0:01:22 load avg: 8.70 [141/404] test_fractions
  160. 0:01:22 load avg: 8.70 [142/404] test_frozen
  161. 0:01:22 load avg: 8.70 [143/404] test_ftplib
  162. 0:01:23 load avg: 8.70 [144/404] test_funcattrs
  163. 0:01:23 load avg: 8.70 [145/404] test_functools
  164. 0:01:23 load avg: 8.70 [146/404] test_future
  165. 0:01:23 load avg: 8.70 [147/404] test_future3
  166. 0:01:23 load avg: 8.70 [148/404] test_future4
  167. 0:01:23 load avg: 8.70 [149/404] test_future5
  168. 0:01:23 load avg: 8.70 [150/404] test_future_builtins
  169. 0:01:24 load avg: 8.70 [151/404] test_gc
  170. 0:01:27 load avg: 8.16 [152/404] test_gdb
  171. test_gdb skipped -- Couldn't find gdb on the path
  172. 0:01:27 load avg: 8.16 [153/404] test_gdbm -- test_gdb skipped
  173. test_gdbm skipped -- No module named gdbm
  174. 0:01:27 load avg: 8.16 [154/404] test_generators -- test_gdbm skipped
  175. 0:01:27 load avg: 8.16 [155/404] test_genericpath
  176. 0:01:27 load avg: 8.16 [156/404] test_genexps
  177. 0:01:27 load avg: 8.16 [157/404] test_getargs
  178. 0:01:27 load avg: 8.16 [158/404] test_getargs2
  179. 0:01:27 load avg: 8.16 [159/404] test_getopt
  180. 0:01:27 load avg: 8.16 [160/404] test_gettext
  181. 0:01:27 load avg: 8.16 [161/404] test_gl
  182. test_gl skipped -- No module named gl
  183. 0:01:27 load avg: 8.16 [162/404] test_glob -- test_gl skipped
  184. 0:01:27 load avg: 8.16 [163/404] test_global
  185. 0:01:27 load avg: 8.16 [164/404] test_grp
  186. 0:01:28 load avg: 8.16 [165/404] test_gzip
  187. 0:01:28 load avg: 8.16 [166/404] test_hash
  188. 0:01:28 load avg: 8.16 [167/404] test_hashlib
  189. 0:01:29 load avg: 8.16 [168/404] test_heapq
  190. 0:01:29 load avg: 7.75 [169/404] test_hmac
  191. 0:01:29 load avg: 7.75 [170/404] test_hotshot
  192. 0:01:29 load avg: 7.75 [171/404] test_htmllib
  193. 0:01:29 load avg: 7.75 [172/404] test_htmlparser
  194. 0:01:29 load avg: 7.75 [173/404] test_httplib
  195. 0:01:30 load avg: 7.75 [174/404] test_httpservers
  196. 0:01:35 load avg: 7.29 [175/404] test_idle
  197. test_idle skipped -- No module named _tkinter
  198. 0:01:35 load avg: 7.29 [176/404] test_imageop -- test_idle skipped
  199. test_imageop skipped -- No module named imageop
  200. 0:01:35 load avg: 7.29 [177/404] test_imaplib -- test_imageop skipped
  201. 0:01:35 load avg: 7.29 [178/404] test_imgfile
  202. test_imgfile skipped -- No module named imgfile
  203. 0:01:35 load avg: 7.29 [179/404] test_imghdr -- test_imgfile skipped
  204. 0:01:35 load avg: 7.29 [180/404] test_imp
  205. 0:01:35 load avg: 7.29 [181/404] test_import
  206. 0:01:36 load avg: 7.29 [182/404] test_import_magic
  207. 0:01:36 load avg: 7.29 [183/404] test_importhooks
  208. 0:01:36 load avg: 7.29 [184/404] test_importlib
  209. 0:01:36 load avg: 7.29 [185/404] test_index
  210. 0:01:36 load avg: 7.29 [186/404] test_inspect
  211. 0:01:36 load avg: 7.29 [187/404] test_int
  212. 0:01:37 load avg: 7.29 [188/404] test_int_literal
  213. 0:01:37 load avg: 7.29 [189/404] test_io
  214. python(73441,0x1116fedc0) malloc: can't allocate region
  215. *** mach_vm_map(size=9223372036854775808) failed (error code=3)
  216. python(73441,0x1116fedc0) malloc: *** set a breakpoint in malloc_error_break to debug
  217. python(73441,0x1116fedc0) malloc: can't allocate region
  218. *** mach_vm_map(size=9223372036854775808) failed (error code=3)
  219. python(73441,0x1116fedc0) malloc: *** set a breakpoint in malloc_error_break to debug
  220. python(73441,0x1116fedc0) malloc: can't allocate region
  221. *** mach_vm_map(size=9223372036854775808) failed (error code=3)
  222. python(73441,0x1116fedc0) malloc: *** set a breakpoint in malloc_error_break to debug
  223. 0:02:07 load avg: 5.46 [190/404] test_ioctl -- test_io passed in 30 sec 649 ms
  224. 0:02:07 load avg: 5.46 [191/404] test_isinstance
  225. 0:02:08 load avg: 5.46 [192/404] test_iter
  226. 0:02:08 load avg: 5.46 [193/404] test_iterlen
  227. 0:02:08 load avg: 5.46 [194/404] test_itertools
  228. 0:02:12 load avg: 5.34 [195/404] test_json
  229. 0:02:14 load avg: 5.34 [196/404] test_kqueue
  230. 0:02:14 load avg: 5.34 [197/404] test_largefile
  231. test_largefile skipped -- test requires 2500000000 bytes and a long time to run
  232. 0:02:14 load avg: 5.32 [198/404] test_lib2to3 -- test_largefile skipped (resource denied)
  233. 0:02:28 load avg: 4.87 [199/404] test_linecache
  234. 0:02:29 load avg: 4.87 [200/404] test_linuxaudiodev
  235. test_linuxaudiodev skipped -- Use of the `audio' resource not enabled
  236. 0:02:29 load avg: 4.87 [201/404] test_list -- test_linuxaudiodev skipped (resource denied)
  237. 0:02:29 load avg: 4.87 [202/404] test_locale
  238. 0:02:29 load avg: 4.87 [203/404] test_logging
  239. 0:02:40 load avg: 4.68 [204/404] test_long
  240. 0:02:42 load avg: 4.68 [205/404] test_long_future
  241. 0:02:43 load avg: 4.68 [206/404] test_longexp
  242. 0:02:44 load avg: 4.68 [207/404] test_macos
  243. 0:02:44 load avg: 4.68 [208/404] test_macostools
  244. 0:02:44 load avg: 4.68 [209/404] test_macpath
  245. 0:02:44 load avg: 4.68 [210/404] test_macurl2path
  246. 0:02:44 load avg: 4.68 [211/404] test_mailbox
  247. 0:02:46 load avg: 4.78 [212/404] test_marshal
  248. 0:02:46 load avg: 4.78 [213/404] test_math
  249. 0:02:47 load avg: 4.78 [214/404] test_md5
  250. 0:02:47 load avg: 4.78 [215/404] test_memoryio
  251. 0:02:47 load avg: 4.78 [216/404] test_memoryview
  252. 0:02:48 load avg: 4.78 [217/404] test_mhlib
  253. 0:02:48 load avg: 4.78 [218/404] test_mimetools
  254. 0:02:48 load avg: 4.78 [219/404] test_mimetypes
  255. 0:02:48 load avg: 4.78 [220/404] test_minidom
  256. 0:02:49 load avg: 4.78 [221/404] test_mmap
  257. 0:02:49 load avg: 4.78 [222/404] test_module
  258. 0:02:49 load avg: 4.78 [223/404] test_modulefinder
  259. 0:02:50 load avg: 4.88 [224/404] test_msilib
  260. test_msilib skipped -- No module named msilib
  261. 0:02:50 load avg: 4.88 [225/404] test_multibytecodec -- test_msilib skipped
  262. 0:02:52 load avg: 4.88 [226/404] test_multifile
  263. 0:02:52 load avg: 4.88 [227/404] test_multiprocessing
  264. 0:03:14 load avg: 6.53 [228/404] test_mutants
  265. 0:03:14 load avg: 6.53 [229/404] test_mutex
  266. 0:03:14 load avg: 6.53 [230/404] test_netrc
  267. 0:03:15 load avg: 6.53 [231/404] test_new
  268. 0:03:15 load avg: 7.13 [232/404] test_nis
  269. 0:03:15 load avg: 7.13 [233/404] test_nntplib
  270. 0:03:16 load avg: 7.13 [234/404] test_normalization
  271. 0:03:16 load avg: 7.13 [235/404] test_ntpath
  272. 0:03:17 load avg: 7.13 [236/404] test_old_mailbox
  273. 0:03:17 load avg: 7.13 [237/404] test_openpty
  274. 0:03:17 load avg: 7.13 [238/404] test_operator
  275. 0:03:17 load avg: 7.13 [239/404] test_optparse
  276. 0:03:18 load avg: 7.13 [240/404] test_ordered_dict
  277. 0:03:19 load avg: 7.13 [241/404] test_os
  278. 0:03:20 load avg: 7.20 [242/404] test_ossaudiodev
  279. test_ossaudiodev skipped -- Use of the `audio' resource not enabled
  280. 0:03:20 load avg: 7.20 [243/404] test_parser -- test_ossaudiodev skipped (resource denied)
  281. 0:03:21 load avg: 7.20 [244/404] test_pdb
  282. 0:03:21 load avg: 7.20 [245/404] test_peepholer
  283. 0:03:21 load avg: 7.20 [246/404] test_pep247
  284. 0:03:22 load avg: 7.20 [247/404] test_pep277
  285. 0:03:22 load avg: 7.20 [248/404] test_pep352
  286. 0:03:22 load avg: 7.20 [249/404] test_pickle
  287. 0:03:26 load avg: 7.50 [250/404] test_pickletools
  288. 0:03:26 load avg: 7.50 [251/404] test_pipes
  289. 0:03:27 load avg: 7.50 [252/404] test_pkg
  290. 0:03:27 load avg: 7.50 [253/404] test_pkgimport
  291. 0:03:27 load avg: 7.50 [254/404] test_pkgutil
  292. 0:03:27 load avg: 7.50 [255/404] test_platform
  293. 0:03:28 load avg: 7.50 [256/404] test_plistlib
  294. 0:03:28 load avg: 7.50 [257/404] test_poll
  295. 0:03:40 load avg: 7.03 [258/404] test_popen
  296. 0:03:40 load avg: 7.03 [259/404] test_popen2
  297. 0:03:40 load avg: 7.03 [260/404] test_poplib
  298. 0:03:42 load avg: 7.03 [261/404] test_posix
  299. test test_posix failed -- Traceback (most recent call last):
  300. File "/Users/<username>/.pyenv/versions/2.7.17/lib/python2.7/test/test_posix.py", line 564, in test_getcwd_long_pathnames
  301. _create_and_do_getcwd(dirname)
  302. File "/Users/<username>/.pyenv/versions/2.7.17/lib/python2.7/test/test_posix.py", line 546, in _create_and_do_getcwd
  303. _create_and_do_getcwd(dirname, current_path_length + len(dirname) + 1)
  304. File "/Users/<username>/.pyenv/versions/2.7.17/lib/python2.7/test/test_posix.py", line 546, in _create_and_do_getcwd
  305. _create_and_do_getcwd(dirname, current_path_length + len(dirname) + 1)
  306. File "/Users/<username>/.pyenv/versions/2.7.17/lib/python2.7/test/test_posix.py", line 546, in _create_and_do_getcwd
  307. _create_and_do_getcwd(dirname, current_path_length + len(dirname) + 1)
  308. File "/Users/<username>/.pyenv/versions/2.7.17/lib/python2.7/test/test_posix.py", line 546, in _create_and_do_getcwd
  309. _create_and_do_getcwd(dirname, current_path_length + len(dirname) + 1)
  310. File "/Users/<username>/.pyenv/versions/2.7.17/lib/python2.7/test/test_posix.py", line 546, in _create_and_do_getcwd
  311. _create_and_do_getcwd(dirname, current_path_length + len(dirname) + 1)
  312. File "/Users/<username>/.pyenv/versions/2.7.17/lib/python2.7/test/test_posix.py", line 546, in _create_and_do_getcwd
  313. _create_and_do_getcwd(dirname, current_path_length + len(dirname) + 1)
  314. File "/Users/<username>/.pyenv/versions/2.7.17/lib/python2.7/test/test_posix.py", line 546, in _create_and_do_getcwd
  315. _create_and_do_getcwd(dirname, current_path_length + len(dirname) + 1)
  316. File "/Users/<username>/.pyenv/versions/2.7.17/lib/python2.7/test/test_posix.py", line 546, in _create_and_do_getcwd
  317. _create_and_do_getcwd(dirname, current_path_length + len(dirname) + 1)
  318. File "/Users/<username>/.pyenv/versions/2.7.17/lib/python2.7/test/test_posix.py", line 546, in _create_and_do_getcwd
  319. _create_and_do_getcwd(dirname, current_path_length + len(dirname) + 1)
  320. File "/Users/<username>/.pyenv/versions/2.7.17/lib/python2.7/test/test_posix.py", line 546, in _create_and_do_getcwd
  321. _create_and_do_getcwd(dirname, current_path_length + len(dirname) + 1)
  322. File "/Users/<username>/.pyenv/versions/2.7.17/lib/python2.7/test/test_posix.py", line 546, in _create_and_do_getcwd
  323. _create_and_do_getcwd(dirname, current_path_length + len(dirname) + 1)
  324. File "/Users/<username>/.pyenv/versions/2.7.17/lib/python2.7/test/test_posix.py", line 546, in _create_and_do_getcwd
  325. _create_and_do_getcwd(dirname, current_path_length + len(dirname) + 1)
  326. File "/Users/<username>/.pyenv/versions/2.7.17/lib/python2.7/test/test_posix.py", line 546, in _create_and_do_getcwd
  327. _create_and_do_getcwd(dirname, current_path_length + len(dirname) + 1)
  328. File "/Users/<username>/.pyenv/versions/2.7.17/lib/python2.7/test/test_posix.py", line 546, in _create_and_do_getcwd
  329. _create_and_do_getcwd(dirname, current_path_length + len(dirname) + 1)
  330. File "/Users/<username>/.pyenv/versions/2.7.17/lib/python2.7/test/test_posix.py", line 546, in _create_and_do_getcwd
  331. _create_and_do_getcwd(dirname, current_path_length + len(dirname) + 1)
  332. File "/Users/<username>/.pyenv/versions/2.7.17/lib/python2.7/test/test_posix.py", line 546, in _create_and_do_getcwd
  333. _create_and_do_getcwd(dirname, current_path_length + len(dirname) + 1)
  334. File "/Users/<username>/.pyenv/versions/2.7.17/lib/python2.7/test/test_posix.py", line 546, in _create_and_do_getcwd
  335. _create_and_do_getcwd(dirname, current_path_length + len(dirname) + 1)
  336. File "/Users/<username>/.pyenv/versions/2.7.17/lib/python2.7/test/test_posix.py", line 559, in _create_and_do_getcwd
  337. self.assertEqual(e.errno, expected_errno)
  338. AssertionError: 2 != 63
  339.  
  340. 0:03:42 load avg: 7.03 [262/404/1] test_posixpath -- test_posix failed
  341. 0:03:42 load avg: 7.03 [263/404/1] test_pow
  342. 0:03:42 load avg: 7.03 [264/404/1] test_pprint
  343. 0:03:42 load avg: 7.03 [265/404/1] test_print
  344. 0:03:42 load avg: 7.03 [266/404/1] test_profile
  345. 0:03:43 load avg: 7.03 [267/404/1] test_property
  346. 0:03:43 load avg: 7.03 [268/404/1] test_pstats
  347. 0:03:43 load avg: 7.03 [269/404/1] test_pty
  348. 0:03:43 load avg: 7.03 [270/404/1] test_pwd
  349. 0:03:43 load avg: 7.03 [271/404/1] test_py3kwarn
  350. test_py3kwarn skipped -- test.test_py3kwarn must be run with the -3 flag
  351. 0:03:43 load avg: 7.03 [272/404/1] test_py_compile -- test_py3kwarn skipped
  352. test test_py_compile failed -- Traceback (most recent call last):
  353. File "/Users/<username>/.pyenv/versions/2.7.17/lib/python2.7/test/test_py_compile.py", line 45, in test_relative_path
  354. os.path.relpath(self.pyc_path))
  355. File "/Users/<username>/.pyenv/versions/2.7.17/lib/python2.7/py_compile.py", line 123, in compile
  356. with open(cfile, 'wb') as fc:
  357. IOError: [Errno 2] No such file or directory: '../../../../../../../var/folders/_v/9r245bv51z77v4_khb_j55y40000gn/T/tmpxFJL_k/_test.pyc'
  358.  
  359. 0:03:44 load avg: 7.03 [273/404/2] test_pyclbr -- test_py_compile failed
  360. 0:03:45 load avg: 7.03 [274/404/2] test_pydoc
  361. 0:03:45 load avg: 6.70 [275/404/2] test_pyexpat
  362. 0:03:45 load avg: 6.70 [276/404/2] test_queue
  363. 0:03:49 load avg: 6.70 [277/404/2] test_quopri
  364. 0:03:49 load avg: 6.70 [278/404/2] test_random
  365. 0:03:50 load avg: 7.77 [279/404/2] test_re
  366. 0:03:51 load avg: 7.77 [280/404/2] test_readline
  367. 0:03:51 load avg: 7.77 [281/404/2] test_regrtest
  368. 0:03:55 load avg: 7.55 [282/404/2] test_repr
  369. 0:03:55 load avg: 7.55 [283/404/2] test_resource
  370. 0:03:56 load avg: 7.55 [284/404/2] test_rfc822
  371. 0:03:56 load avg: 7.55 [285/404/2] test_richcmp
  372. 0:03:56 load avg: 7.55 [286/404/2] test_rlcompleter
  373. 0:03:56 load avg: 7.55 [287/404/2] test_robotparser
  374. 0:03:56 load avg: 7.55 [288/404/2] test_runpy
  375. 0:04:03 load avg: 7.18 [289/404/2] test_sax
  376. 0:04:03 load avg: 7.18 [290/404/2] test_scope
  377. 0:04:03 load avg: 7.18 [291/404/2] test_scriptpackages
  378. 0:04:03 load avg: 7.18 [292/404/2] test_select
  379. 0:04:15 load avg: 6.62 [293/404/2] test_set
  380. 0:04:15 load avg: 6.33 [294/404/2] test_setcomps
  381. 0:04:15 load avg: 6.33 [295/404/2] test_sets
  382. 0:04:16 load avg: 6.33 [296/404/2] test_sgmllib
  383. 0:04:16 load avg: 6.33 [297/404/2] test_sha
  384. 0:04:16 load avg: 6.33 [298/404/2] test_shelve
  385. 0:04:16 load avg: 6.33 [299/404/2] test_shlex
  386. 0:04:16 load avg: 6.33 [300/404/2] test_shutil
  387. 0:04:16 load avg: 6.33 [301/404/2] test_signal
  388. 0:04:24 load avg: 5.98 [302/404/2] test_site
  389. 0:04:24 load avg: 5.98 [303/404/2] test_slice
  390. 0:04:24 load avg: 5.98 [304/404/2] test_smtplib
  391. 0:04:25 load avg: 5.98 [305/404/2] test_smtpnet
  392. test_smtpnet skipped -- Use of the `network' resource not enabled
  393. 0:04:25 load avg: 5.98 [306/404/2] test_socket -- test_smtpnet skipped (resource denied)
  394. 0:04:42 load avg: 4.72 [307/404/2] test_socketserver
  395. test_socketserver skipped -- Use of the `network' resource not enabled
  396. 0:04:42 load avg: 4.72 [308/404/2] test_softspace -- test_socketserver skipped (resource denied)
  397. 0:04:42 load avg: 4.72 [309/404/2] test_sort
  398. 0:04:42 load avg: 4.72 [310/404/2] test_source_encoding
  399. 0:04:43 load avg: 4.72 [311/404/2] test_spwd
  400. test_spwd skipped -- No module named spwd
  401. 0:04:43 load avg: 4.72 [312/404/2] test_sqlite -- test_spwd skipped
  402. 0:04:43 load avg: 4.72 [313/404/2] test_ssl
  403. Exception in thread Thread-605:
  404. Traceback (most recent call last):
  405. File "/Users/<username>/.pyenv/versions/2.7.17/lib/python2.7/threading.py", line 801, in __bootstrap_inner
  406. self.run()
  407. File "/Users/<username>/.pyenv/versions/2.7.17/lib/python2.7/test/test_ssl.py", line 1810, in run
  408. msg = self.read()
  409. File "/Users/<username>/.pyenv/versions/2.7.17/lib/python2.7/test/test_ssl.py", line 1787, in read
  410. return self.sslconn.read()
  411. File "/Users/<username>/.pyenv/versions/2.7.17/lib/python2.7/ssl.py", line 641, in read
  412. v = self._sslobj.read(len)
  413. error: [Errno 54] Connection reset by peer
  414.  
  415. Exception in thread Thread-658:
  416. Traceback (most recent call last):
  417. File "/Users/<username>/.pyenv/versions/2.7.17/lib/python2.7/threading.py", line 801, in __bootstrap_inner
  418. self.run()
  419. File "/Users/<username>/.pyenv/versions/2.7.17/lib/python2.7/test/test_ssl.py", line 1810, in run
  420. msg = self.read()
  421. File "/Users/<username>/.pyenv/versions/2.7.17/lib/python2.7/test/test_ssl.py", line 1787, in read
  422. return self.sslconn.read()
  423. File "/Users/<username>/.pyenv/versions/2.7.17/lib/python2.7/ssl.py", line 641, in read
  424. v = self._sslobj.read(len)
  425. error: [Errno 54] Connection reset by peer
  426.  
  427. Exception in thread Thread-687:
  428. Traceback (most recent call last):
  429. File "/Users/<username>/.pyenv/versions/2.7.17/lib/python2.7/threading.py", line 801, in __bootstrap_inner
  430. self.run()
  431. File "/Users/<username>/.pyenv/versions/2.7.17/lib/python2.7/test/test_ssl.py", line 1810, in run
  432. msg = self.read()
  433. File "/Users/<username>/.pyenv/versions/2.7.17/lib/python2.7/test/test_ssl.py", line 1787, in read
  434. return self.sslconn.read()
  435. File "/Users/<username>/.pyenv/versions/2.7.17/lib/python2.7/ssl.py", line 641, in read
  436. v = self._sslobj.read(len)
  437. error: [Errno 54] Connection reset by peer
  438.  
  439. 0:04:45 load avg: 4.72 [314/404/2] test_startfile
  440. test_startfile skipped -- module 'os' has no attribute 'startfile'
  441. 0:04:45 load avg: 4.72 [315/404/2] test_stat -- test_startfile skipped
  442. 0:04:45 load avg: 4.72 [316/404/2] test_str
  443. 0:04:46 load avg: 4.66 [317/404/2] test_strftime
  444. 0:04:46 load avg: 4.66 [318/404/2] test_string
  445. 0:04:47 load avg: 4.66 [319/404/2] test_stringprep
  446. 0:04:47 load avg: 4.66 [320/404/2] test_strop
  447. 0:04:47 load avg: 4.66 [321/404/2] test_strptime
  448. 0:04:47 load avg: 4.66 [322/404/2] test_strtod
  449. 0:04:48 load avg: 4.66 [323/404/2] test_struct
  450. 0:04:48 load avg: 4.66 [324/404/2] test_structmembers
  451. 0:04:48 load avg: 4.66 [325/404/2] test_structseq
  452. 0:04:48 load avg: 4.66 [326/404/2] test_subprocess
  453. 2019-12-11 05:43:34.381 defaults[97395:351212]
  454. The domain/default pair of (com.apple.CrashReporter, DialogType) does not exist
  455. 0:05:20 load avg: 3.90 [327/404/2] test_sunau -- test_subprocess passed in 31 sec 455 ms
  456. 0:05:20 load avg: 3.90 [328/404/2] test_sunaudiodev
  457. test_sunaudiodev skipped -- No module named sunaudiodev
  458. 0:05:20 load avg: 3.90 [329/404/2] test_sundry -- test_sunaudiodev skipped
  459. 0:05:20 load avg: 3.90 [330/404/2] test_symtable
  460. 0:05:20 load avg: 3.90 [331/404/2] test_syntax
  461. 0:05:21 load avg: 3.90 [332/404/2] test_sys
  462. 0:05:21 load avg: 3.98 [333/404/2] test_sys_setprofile
  463. 0:05:21 load avg: 3.98 [334/404/2] test_sys_settrace
  464. 0:05:22 load avg: 3.98 [335/404/2] test_sysconfig
  465. 0:05:22 load avg: 3.98 [336/404/2] test_tarfile
  466. 0:05:24 load avg: 3.98 [337/404/2] test_tcl
  467. test_tcl skipped -- No module named _tkinter
  468. 0:05:24 load avg: 3.98 [338/404/2] test_telnetlib -- test_tcl skipped
  469. 0:05:29 load avg: 4.07 [339/404/2] test_tempfile
  470. 0:05:29 load avg: 4.07 [340/404/2] test_test_support
  471. 0:05:30 load avg: 4.07 [341/404/2] test_textwrap
  472. 0:05:30 load avg: 4.07 [342/404/2] test_thread
  473. 0:05:30 load avg: 4.07 [343/404/2] test_threaded_import
  474. 0:05:30 load avg: 4.07 [344/404/2] test_threadedtempfile
  475. 0:05:31 load avg: 4.06 [345/404/2] test_threading
  476. 0:05:34 load avg: 4.06 [346/404/2] test_threading_local
  477. 0:05:35 load avg: 4.06 [347/404/2] test_threadsignals
  478. 0:05:35 load avg: 4.06 [348/404/2] test_time
  479. 0:05:37 load avg: 3.90 [349/404/2] test_timeit
  480. 0:05:37 load avg: 3.90 [350/404/2] test_timeout
  481. test_timeout skipped -- Use of the `network' resource not enabled
  482. 0:05:37 load avg: 3.90 [351/404/2] test_tk -- test_timeout skipped (resource denied)
  483. test_tk skipped -- No module named _tkinter
  484. 0:05:37 load avg: 3.90 [352/404/2] test_tokenize -- test_tk skipped
  485. 0:05:37 load avg: 3.90 [353/404/2] test_tools
  486. test_tools skipped -- test irrelevant for an installed Python
  487. 0:05:38 load avg: 3.90 [354/404/2] test_trace -- test_tools skipped
  488. 0:05:39 load avg: 3.90 [355/404/2] test_traceback
  489. 0:05:43 load avg: 3.82 [356/404/2] test_transformer
  490. 0:05:43 load avg: 3.82 [357/404/2] test_ttk_guionly
  491. test_ttk_guionly skipped -- No module named _tkinter
  492. 0:05:43 load avg: 3.82 [358/404/2] test_ttk_textonly -- test_ttk_guionly skipped
  493. test_ttk_textonly skipped -- No module named _tkinter
  494. 0:05:43 load avg: 3.82 [359/404/2] test_tuple -- test_ttk_textonly skipped
  495. 0:05:51 load avg: 4.02 [360/404/2] test_turtle
  496. test_turtle skipped -- No module named _tkinter
  497. 0:05:51 load avg: 4.02 [361/404/2] test_typechecks -- test_turtle skipped
  498. 0:05:52 load avg: 4.02 [362/404/2] test_ucn
  499. 0:05:52 load avg: 4.02 [363/404/2] test_unary
  500. 0:05:52 load avg: 4.02 [364/404/2] test_undocumented_details
  501. 0:05:52 load avg: 4.02 [365/404/2] test_unicode
  502. 0:05:55 load avg: 4.02 [366/404/2] test_unicode_file
  503. 0:05:55 load avg: 4.02 [367/404/2] test_unicodedata
  504. 0:05:57 load avg: 4.26 [368/404/2] test_univnewlines
  505. 0:05:57 load avg: 4.26 [369/404/2] test_univnewlines2k
  506. 0:05:57 load avg: 4.26 [370/404/2] test_unpack
  507. 0:05:57 load avg: 4.26 [371/404/2] test_urllib
  508. 0:05:57 load avg: 4.26 [372/404/2] test_urllib2
  509. 0:06:00 load avg: 4.26 [373/404/2] test_urllib2_localnet
  510. 0:06:02 load avg: 4.15 [374/404/2] test_urllib2net
  511. test_urllib2net skipped -- Use of the `network' resource not enabled
  512. 0:06:02 load avg: 4.15 [375/404/2] test_urllibnet -- test_urllib2net skipped (resource denied)
  513. test_urllibnet skipped -- Use of the `network' resource not enabled
  514. 0:06:02 load avg: 4.15 [376/404/2] test_urlparse -- test_urllibnet skipped (resource denied)
  515. 0:06:02 load avg: 4.15 [377/404/2] test_userdict
  516. 0:06:03 load avg: 4.15 [378/404/2] test_userlist
  517. 0:06:03 load avg: 4.15 [379/404/2] test_userstring
  518. 0:06:06 load avg: 4.15 [380/404/2] test_uu
  519. 0:06:06 load avg: 4.06 [381/404/2] test_uuid
  520. 0:06:07 load avg: 4.06 [382/404/2] test_wait3
  521. 0:06:11 load avg: 4.06 [383/404/2] test_wait4
  522. 0:06:16 load avg: 4.30 [384/404/2] test_warnings
  523. 0:06:17 load avg: 4.30 [385/404/2] test_wave
  524. 0:06:17 load avg: 4.30 [386/404/2] test_weakref
  525. 0:06:24 load avg: 4.83 [387/404/2] test_weakset
  526. 0:06:24 load avg: 4.83 [388/404/2] test_whichdb
  527. 0:06:25 load avg: 4.83 [389/404/2] test_winreg
  528. test_winreg skipped -- No module named _winreg
  529. 0:06:25 load avg: 4.83 [390/404/2] test_winsound -- test_winreg skipped
  530. test_winsound skipped -- Use of the `audio' resource not enabled
  531. 0:06:25 load avg: 4.83 [391/404/2] test_with -- test_winsound skipped (resource denied)
  532. 0:06:25 load avg: 4.83 [392/404/2] test_wsgiref
  533. 0:06:25 load avg: 4.83 [393/404/2] test_xdrlib
  534. 0:06:25 load avg: 4.83 [394/404/2] test_xml_etree
  535. 0:06:26 load avg: 4.83 [395/404/2] test_xml_etree_c
  536. 0:06:26 load avg: 4.85 [396/404/2] test_xmllib
  537. 0:06:26 load avg: 4.85 [397/404/2] test_xmlrpc
  538. 0:06:30 load avg: 4.85 [398/404/2] test_xpickle
  539. 0:06:30 load avg: 4.85 [399/404/2] test_xrange
  540. 0:06:31 load avg: 4.85 [400/404/2] test_zipfile
  541. 0:06:34 load avg: 4.86 [401/404/2] test_zipfile64
  542. test_zipfile64 skipped -- test requires loads of disk-space bytes and a long time to run
  543. 0:06:34 load avg: 4.86 [402/404/2] test_zipimport -- test_zipfile64 skipped (resource denied)
  544. 0:06:35 load avg: 4.86 [403/404/2] test_zipimport_support
  545. 0:06:35 load avg: 4.86 [404/404/2] test_zlib
  546.  
  547. == Tests result: FAILURE ==
  548.  
  549. 361 tests OK.
  550.  
  551. 2 tests failed:
  552. test_posix test_py_compile
  553.  
  554. 41 tests skipped:
  555. test_al test_bsddb test_bsddb3 test_cd test_cl test_codecmaps_cn
  556. test_codecmaps_hk test_codecmaps_jp test_codecmaps_kr
  557. test_codecmaps_tw test_curses test_dl test_epoll test_gdb
  558. test_gdbm test_gl test_idle test_imageop test_imgfile
  559. test_largefile test_linuxaudiodev test_msilib test_ossaudiodev
  560. test_py3kwarn test_smtpnet test_socketserver test_spwd
  561. test_startfile test_sunaudiodev test_tcl test_timeout test_tk
  562. test_tools test_ttk_guionly test_ttk_textonly test_turtle
  563. test_urllib2net test_urllibnet test_winreg test_winsound
  564. test_zipfile64
  565. 9 skips unexpected on darwin:
  566. test_dl test_idle test_spwd test_tcl test_tk test_tools
  567. test_ttk_guionly test_ttk_textonly test_turtle
  568.  
  569. Total duration: 6 min 37 sec
  570. Tests result: FAILURE
RAW Paste Data