DyadGames

Untitled

Apr 28th, 2016
267
0
Never
1
Not a member of Pastebin yet? Sign Up, it unlocks many cool features!
text 13.81 KB | None | 0 0
  1. Compile started: 4:04:47 AM
  2. "D:\SteamLibrary\steamapps\common\gamemaker_studio\GMAssetCompiler.exe" /fU="C:\Tryhard\gm_ttt_79072\a35449.txt" /c /m=android /studio /config="Default" /tgt=8 /obob=True /obpp=False /obru=True /obes=False /i=3 /cvm /tp=1024 /mv=1 /iv=0 /rv=0 /bv=1757 /gn="appodeal-gamemaker-demo" /td="C:\Tryhard" /cd="C:\G" /sh=True /dbgp="6502" /hip="192.168.0.5" /hprt="51268" /o="C:\Tryhard\gm_ttt_79072\appodeal-gamemaker-demo" /optionsini="C:\Tryhard\gm_ttt_79072\gm_ttt_16672\appodeal-gamemaker-demo.ini" "C:\Users\Homie\Downloads\appodeal-gamemaker-demo-master.gmx\appodeal-gamemaker-demo.project.gmx"
  3.  
  4. Reading project file....finished.
  5. Compile Constants...finished.
  6. Remove DnD...finished.
  7. Compile Scripts...finished.
  8. Compile Objects...finished.
  9. Compile Timelines...finished.
  10. Compile Triggers...finished.
  11. Compile Rooms...finished.
  12. Compile Extensions...finished.
  13. Final Compile...finished.
  14. Saving IFF file... C:\Tryhard\gm_ttt_79072\appodeal-gamemaker-demo\appodeal-gamemaker-demo.zip
  15. Writing Chunk... GEN8
  16. Writing Chunk... OPTN
  17. Writing Chunk... EXTN
  18. Writing Chunk... SOND
  19. Writing Chunk... AGRP
  20. Writing Chunk... SPRT
  21. Writing Chunk... BGND
  22. Writing Chunk... PATH
  23. Writing Chunk... SCPT
  24. Writing Chunk... SHDR
  25. Writing Chunk... FONT
  26. Writing Chunk... TMLN
  27. Writing Chunk... OBJT
  28. Writing Chunk... ROOM
  29. Writing Chunk... DAFL
  30. Writing Chunk... TPAGE
  31. Writing Chunk... CODE
  32. Writing Chunk... VARI
  33. Writing Chunk... FUNC
  34. Writing Chunk... STRG
  35. Writing Chunk... TXTR
  36. 0 Compressing texture... writing texture texture_0.png...
  37. Writing Chunk... AUDO
  38. Writing Chunk... SCPT
  39. Writing Chunk... DBGI
  40. Writing Chunk... INST
  41. Writing Chunk... LOCL
  42. Writing Chunk... STRG
  43. Stats : GMA : Elapsed=1669.1742
  44. Stats : GMA : sp=6,au=0,bk=0,pt=0,sc=0,sh=0,fo=0,tl=0,ob=6,ro=1,da=0,ex=2,ma=5,fm=0x0
  45. "C:\JavaSDK\platform-tools\adb" get-state
  46.  
  47. device
  48. "C:\JavaSDK\platform-tools\adb" shell echo $INTERNAL_STORAGE
  49.  
  50. "C:\JavaSDK\platform-tools\adb" shell echo $EXTERNAL_STORAGE
  51.  
  52. /sdcard "C:\JavaSDK\platform-tools\adb" get-state
  53.  
  54. device
  55. "C:\JavaSDK\platform-tools\adb" shell echo $INTERNAL_STORAGE
  56.  
  57. "C:\JavaSDK\platform-tools\adb" shell echo $EXTERNAL_STORAGE
  58.  
  59. /sdcard "C:\JavaSDK\platform-tools\adb" shell mkdir -p "/sdcard/GMstudio"
  60.  
  61. "C:\JavaSDK\platform-tools\adb" shell [ -d /sdcard/GMstudio ] && cd /sdcard/GMstudio; rm -r *;
  62.  
  63. rm: *: No such file or directory "C:\JavaSDK\platform-tools\adb" push "C:\Tryhard\gm_ttt_79072\appodeal-gamemaker-demo\\GameAssetsDROID.zip" /sdcard/GMstudio/GameAssetsDROID.zip
  64.  
  65. 249 KB/s (6639 bytes in 0.026s)
  66. "C:\JavaSDK\platform-tools\adb" push "C:\Tryhard\gm_ttt_79072\appodeal-gamemaker-demo\\GameDownload.lock" /sdcard/GMstudio/GameDownload.lock
  67.  
  68. 0 KB/s (13 bytes in 0.019s)
  69. "C:\JavaSDK\platform-tools\adb" shell cat /system/build.prop
  70.  
  71. # begin build properties # autogenerated by buildinfo.sh ro.build.id=MMB29K ro.build.display.id=MMB29K.G920PVPU3CPB6 ro.build.version.incremental=G920PVPU3CPB6 ro.build.version.sdk=23 ro.build.version.preview_sdk=0 ro.build.version.codename=REL ro.build.version.all_codenames=REL ro.build.version.release=6.0.1 ro.build.version.security_patch=2016-02-01 ro.build.version.base_os= ro.build.date=Thu Feb 18 18:56:29 KST 2016 ro.build.date.utc=1455789389 ro.build.type=user ro.build.user=dpi ro.build.host=SWHD7407 ro.build.tags=release-keys ro.build.flavor=zerofltespr-user ro.product.model=SM-G920P ro.product.brand=samsung ro.product.name=zerofltespr ro.product.device=zerofltespr ro.product.board=universal7420 # ro.product.cpu.abi and ro.product.cpu.abi2 are obsolete, # use ro.product.cpu.abilist instead. ro.product.cpu.abi=arm64-v8a ro.product.cpu.abilist=arm64-v8a,armeabi-v7a,armeabi ro.product.cpu.abilist32=armeabi-v7a,armeabi ro.product.cpu.abilist64=arm64-v8a ro.product.manufacturer=samsung ro.product.locale=en-US ro.wifi.channels= ro.board.platform=exynos5 # ro.build.product is obsolete; use ro.product.device ro.build.product=zerofltespr # Do not try to parse description, fingerprint, or thumbprint ro.build.description=zerofltespr-user 6.0.1 MMB29K G920PVPU3CPB6 release-keys ro.build.fingerprint=samsung/zerofltespr/zerofltespr:6.0.1/MMB29K/G920PVPU3CPB6:user/release-keys ro.build.characteristics=chameleon # Samsung Specific Properties ro.build.PDA=G920PVPU3CPB6 ro.build.hidden_ver=G920PVPU3CPB6 ro.config.rm_preload_enabled=0 ro.build.changelist=7280193 ro.product_ship=true ro.chipname=exynos7420 # end build properties # # HWUI_BUILD_PROPERTIES # ro.hwui.texture_cache_size=88 ro.hwui.layer_cache_size=58 ro.hwui.path_cache_size=16 ro.hwui.texture_cache_flushrate=0.4 ro.hwui.shape_cache_size=4 ro.hwui.gradient_cache_size=2 ro.hwui.drop_shadow_cache_size=6 ro.hwui.r_buffer_cache_size=8 ro.hwui.text_small_cache_width=1024 ro.hwui.text_small_cache_height=1024 ro.hwui.text_large_cache_width=4096 ro.hwui.text_large_cache_height=2048 ro.hwui.fbo_cache_size=16 # # from device/samsung/zerofltespr/system.prop # # # system.prop for universal7420 # # # Integrate the Kineto VOWIFI changes #rild.libpath=/system/lib64/libsec-ril.so rild.libpath=/system/lib64/librilswitch.so rilswitch.vendorlibpath=/system/lib64/libsec-ril.so rilswitch.cfilibpath=/system/lib64/libcfiril.so # End of kineto change # rild.libargs=-d /dev/smd0 ro.sf.lcd_density=640 ro.arch=exynos7420 persist.demo.hdmirotationlock=false ro.zygote.disable_gl_preload=1 ro.sf.lcd_density=640 # Multimedia property for Smart View media.enable-commonsource=true # Enable time services daemon persist.timed.enable=true # Keep SIM state on LPM mode persist.radio.apm_sim_not_pwdn=1 # Don't wait the card state for RADIO POWER request persist.radio.no_wait_for_card=1 # For sys info indication persist.radio.add_power_save=1 # Snapshot setting persist.radio.snapshot_enabled=1 persist.radio.snapshot_timer=22 # Use CP SE13 Table persist.radio.use_se_table_only=1 # Default ECCList ro.ril.ecclist=911,#911,*911 # QMI mux enabled for Fusion 4.0 (For APQ8084 model, MDM9x35) persist.rmnet.mux=enabled # Use CDMALTE Phone (For 4G model) telephony.lteOnCdmaDevice=1 # Support Global Mode (For global mode model) ro.config.multimode_cdma=1 # Data modules (For evolution RIL model) ro.use_data_netmgrd=false persist.data.netmgrd.qos.enable=false # Use data service state for signal display (Except USC CS model) ro.config.combined_signal=true # Default Network Mode (For 4G / Global model) ro.telephony.default_network=10 # Chameleon Default Operator (SPR with Chameleon) ro.cdma.default_numeric=310000 ro.cdma.default_alpha=Chameleon # Multimedia property for Camcorder Recording media.sfrec.adj_frames=2 # # ADDITIONAL_BUILD_PROPERTIES # ro.astcenc.astcsupport=1 ro.mct.compressiontype=ETC1 ro.config.tima=1 ro.config.timaversion=3.0 ro.config.dmverity=true ro.config.rkp=true ro.config.kap_default_on=true ro.config.kap=true ro.ril.ecclist=911,#911,*911 ril.subscription.types=NV,RUIM ro.com.android.dataroaming=true ro.telephony.default_network=10 ro.cdma.default_numeric=310000 ro.cdma.default_alpha=Chameleon ro.use_data_netmgrd=false persist.radio.sib16_support=0 dalvik.vm.image-dex2oat-filter=speed dalvik.vm.dex2oat-filter=speed ro.config.notification_sound=Skyline.ogg ro.config.vc_call_vol_steps=7 ro.config.ringtone=Over_the_Horizon.ogg ro.config.alarm_alert=Morning_Flower.ogg ro.config.media_sound=Media_preview_Touch_the_light.ogg ro.config.ringtone_2=Basic_Bell.ogg ro.config.notification_sound_2=S_Charming_Bell.ogg dalvik.vm.heapstartsize=8m dalvik.vm.heapgrowthlimit=256m dalvik.vm.heapsize=512m dalvik.vm.heaptargetutilization=0.75 dalvik.vm.heapminfree=2m dalvik.vm.heapmaxfree=8m ro.opengles.version=196609 ro.sf.lcd_density=480 debug.hwc.force_gpu=0 debug.hwc.nodirtyregion=0 debug.hwc.winupdate=1 drm.service.enabled=true ro.hdcp2.rx=tz ro.secwvk=220 ro.securestorage.support=true ro.build.scafe=capuccino ro.build.scafe.size=short ro.build.scafe.shot=single ro.build.scafe.cream=white ro.build.scafe.version=2016A ro.sec.fle.encryption=false ro.im.param.offset=7341648 ro.me.param.offset=7341728 ro.sn.param.offset=7341808 ro.pr.param.offset=7341888 ro.sku.param.offset=7341968 security.mdpp=None ro.security.mdpp.ver=2.0 ro.security.mdpp.release=6 security.mdpp.result=None ro.hardware.keystore=mdfpp ro.security.vpnpp.ver=1.4 ro.security.vpnpp.release=6.0 ro.error.receiver.default=com.samsung.receiver.error ro.config.dha_cached_min=6 ro.config.dha_cached_max=12 ro.config.dha_empty_min=8 ro.config.dha_lmk_scale=1.909 ro.config.64bit_lmk_enable=false ro.config.dha_pwhitelist_enable=1 config.disable_atlas=true sys.config.samp_oak_enable=true sys.config.samp_oakoom_enable=true sys.config.bigdata_enable=true sys.config.bigdata_mem_enable=true ro.security.mdpp.ux=Enabled ro.frp.pst=/dev/block/persistent keyguard.no_require_sim=true ro.carrier=unknown ro.com.google.clientidbase=android-samsung ro.security.icd.flagmode=multi ro.ril.hsxpa=1 ro.ril.gprsclass=10 ro.adb.qemud=1 ro.setupwizard.mode=DISABLED ro.com.google.gmsversion=6.0_r2 ro.com.google.clientidbase.gmm=android-samsung ro.build.selinux=1 persist.sys.dalvik.vm.lib.2=libart.so dalvik.vm.isa.arm64.variant=generic dalvik.vm.isa.arm64.features=default dalvik.vm.isa.arm.variant=cortex-a15 dalvik.vm.isa.arm.features=default ro.config.knox=v30 ro.kernel.qemu=0 net.bt.name=Android dalvik.vm.stack-trace-file=/data/anr/traces.txt persist.gps.qc_nlp_in_use=1 persist.loc.nlp_name=com.qualcomm.location ro.gps.agps_provider=1 ro.build.version.sdl=2301 ro.itson.path=/carrier/itson/ ro.expect.recovery_id=0x39215734c904ef198f0e06255fde8b4977f8b45e000000000000000000000000 FastCreate started: 4:04:52 AM
  72. FastCreate End File Copies: 4:04:53 AM
  73. cmd /c ""D:\SteamLibrary\steamapps\common\gamemaker_studio\Android\runner\gradle\gradlew"" build -x assembleDebug
  74.  
  75. :com.appodeal.test:preBuild UP-TO-DATE
  76. :com.appodeal.test:preReleaseBuild UP-TO-DATE
  77. :com.appodeal.test:checkReleaseManifest
  78. :com.appodeal.test:preDebugBuild UP-TO-DATE
  79. :google-play-services_lib:compileLint
  80. :google-play-services_lib:copyReleaseLint UP-TO-DATE
  81. :google-play-services_lib:mergeReleaseProguardFiles
  82. :google-play-services_lib:preBuild UP-TO-DATE
  83. :google-play-services_lib:preReleaseBuild UP-TO-DATE
  84. :google-play-services_lib:checkReleaseManifest
  85. :google-play-services_lib:prepareReleaseDependencies
  86. :google-play-services_lib:compileReleaseAidl
  87. :google-play-services_lib:compileReleaseRenderscript
  88. :google-play-services_lib:generateReleaseBuildConfig
  89. :google-play-services_lib:generateReleaseAssets UP-TO-DATE
  90. :google-play-services_lib:mergeReleaseAssets
  91. :google-play-services_lib:generateReleaseResValues
  92. :google-play-services_lib:generateReleaseResources
  93. :google-play-services_lib:packageReleaseResources
  94. :google-play-services_lib:processReleaseManifest
  95. :google-play-services_lib:processReleaseResources
  96. :google-play-services_lib:generateReleaseSources
  97. :google-play-services_lib:processReleaseJavaRes UP-TO-DATE
  98. :google-play-services_lib:compileReleaseJavaWithJavac
  99. :google-play-services_lib:packageReleaseJar
  100. :google-play-services_lib:compileReleaseNdk UP-TO-DATE
  101. :google-play-services_lib:packageReleaseJniLibs UP-TO-DATE
  102. :google-play-services_lib:packageReleaseLocalJar
  103. :google-play-services_lib:packageReleaseRenderscript UP-TO-DATE
  104. :google-play-services_lib:bundleRelease
  105. :com.appodeal.test:prepareComAndroidSupportMultidex101Library
  106. :com.appodeal.test:prepareComAndroidSupportSupportV42311Library
  107. :com.appodeal.test:prepareDefaultGooglePlayServices_libUnspecifiedLibrary
  108. :com.appodeal.test:prepareReleaseDependencies
  109. :com.appodeal.test:compileReleaseAidl
  110. :com.appodeal.test:compileReleaseRenderscript
  111. :com.appodeal.test:generateReleaseBuildConfig
  112. :com.appodeal.test:generateReleaseAssets UP-TO-DATE
  113. :com.appodeal.test:mergeReleaseAssets
  114. :com.appodeal.test:generateReleaseResValues
  115. :com.appodeal.test:generateReleaseResources
  116. :com.appodeal.test:mergeReleaseResourcesAAPT err(32144753): C:\G\appodeal-gamemaker-demo\Android\Default\com.appodeal.test\src\main\res\drawable-xxxhdpi\icon.png: libpng warning: iCCP: Not recognizing known sRGB profile that has been edited
  117. AAPT err(22650539): C:\G\appodeal-gamemaker-demo\Android\Default\com.appodeal.test\src\main\res\drawable-xxhdpi\icon.png: libpng warning: iCCP: Not recognizing known sRGB profile that has been edited
  118. AAPT err(2631801): C:\G\appodeal-gamemaker-demo\Android\Default\com.appodeal.test\src\main\res\drawable\icon.png: libpng warning: iCCP: Not recognizing known sRGB profile that has been edited
  119. AAPT err(717094): C:\G\appodeal-gamemaker-demo\Android\Default\com.appodeal.test\src\main\res\drawable-xhdpi\icon.png: libpng warning: iCCP: Not recognizing known sRGB profile that has been edited
  120.  
  121. :com.appodeal.test:processReleaseManifest
  122. C:\G\appodeal-gamemaker-demo\Android\Default\com.appodeal.test\src\main\AndroidManifest.xml:18:1-76 Warning:
  123. Element uses-permission#android.permission.WRITE_EXTERNAL_STORAGE at AndroidManifest.xml:18:1-76 duplicated with element declared at AndroidManifest.xml:11:1-77
  124. C:\G\appodeal-gamemaker-demo\Android\Default\com.appodeal.test\src\main\AndroidManifest.xml:98:194-309 Error:
  125. Element meta-data#com.google.android.gms.version at AndroidManifest.xml:98:194-309 duplicated with element declared at AndroidManifest.xml:54:5-118
  126. C:\G\appodeal-gamemaker-demo\Android\Default\com.appodeal.test\src\main\AndroidManifest.xml:101:1-176 Error:
  127. Element activity#com.google.android.gms.ads.AdActivity at AndroidManifest.xml:101:1-176 duplicated with element declared at AndroidManifest.xml:55:5-229
  128. C:\G\appodeal-gamemaker-demo\Android\Default\com.appodeal.test\src\main\AndroidManifest.xml Error:
  129. Validation failed, exiting
  130. :com.appodeal.test:processReleaseManifest FAILED
  131.  
  132. FAILURE: Build failed with an exception.
  133.  
  134. * What went wrong:
  135. Execution failed for task ':com.appodeal.test:processReleaseManifest'.
  136. > Manifest merger failed with multiple errors, see logs
  137.  
  138. * Try:
  139. Run with --stacktrace option to get the stack trace. Run with --info or --debug option to get more log output.
  140.  
  141. BUILD FAILED
  142.  
  143. Total time: 11.982 secs
  144. FastCreate End End: 4:05:05 AM
  145. Compile finished: 4:05:05 AM
Advertisement
Comments
  • User was banned
Add Comment
Please, Sign In to add comment