daily pastebin goal
66%
SHARE
TWEET

config.log

a guest Jun 13th, 2018 71 Never
Not a member of Pastebin yet? Sign Up, it unlocks many cool features!
  1. Command line: -opensource -confirm-license -release -prefix /opt/Qt5.9.1 -nomake examples -nomake tests
  2. executing config test use_gold_linker
  3. + cd /home/kiosk/WEBKIT/qt-everywhere-opensource-src-5.9.1/build/config.tests && g++ -fuse-ld=gold -o conftest-out conftest.cpp
  4. test config.qtbase.tests.use_gold_linker succeeded
  5. executing config test machineTuple
  6. + g++ -dumpmachine
  7. > i686-linux-gnu
  8. test config.qtbase.tests.machineTuple succeeded
  9. executing config test verifyspec
  10. + cd /home/kiosk/WEBKIT/qt-everywhere-opensource-src-5.9.1/build/config.tests/common/verifyspec && /home/kiosk/WEBKIT/qt-everywhere-opensource-src-5.9.1/build/qtbase/bin/qmake "CONFIG -= qt debug_and_release app_bundle lib_bundle" "CONFIG += shared use_gold_linker console single_arch" /home/kiosk/WEBKIT/qt-everywhere-opensource-src-5.9.1/qtbase/config.tests/common/verifyspec
  11. + cd /home/kiosk/WEBKIT/qt-everywhere-opensource-src-5.9.1/build/config.tests/common/verifyspec && MAKEFLAGS= /usr/bin/make
  12. > g++ -c -pipe -O2 -Wall -W -fPIC  -I/home/kiosk/WEBKIT/qt-everywhere-opensource-src-5.9.1/qtbase/config.tests/common/verifyspec -I. -I/home/kiosk/WEBKIT/qt-everywhere-opensource-src-5.9.1/qtbase/mkspecs/linux-g++ -o verifyspec.o /home/kiosk/WEBKIT/qt-everywhere-opensource-src-5.9.1/qtbase/config.tests/common/verifyspec/verifyspec.cpp
  13. > g++ -Wl,-O1 -fuse-ld=gold -o verifyspec verifyspec.o    
  14. test config.qtbase.tests.verifyspec succeeded
  15. executing config test alloca_h
  16. + cd /home/kiosk/WEBKIT/qt-everywhere-opensource-src-5.9.1/build/config.tests/common/alloca && /home/kiosk/WEBKIT/qt-everywhere-opensource-src-5.9.1/build/qtbase/bin/qmake "CONFIG -= qt debug_and_release app_bundle lib_bundle" "CONFIG += shared use_gold_linker console single_arch" DEFINES+=USE_ALLOCA_H /home/kiosk/WEBKIT/qt-everywhere-opensource-src-5.9.1/qtbase/config.tests/common/alloca
  17. + cd /home/kiosk/WEBKIT/qt-everywhere-opensource-src-5.9.1/build/config.tests/common/alloca && MAKEFLAGS= /usr/bin/make
  18. > g++ -c -pipe -O2 -Wall -W -fPIC -DUSE_ALLOCA_H -I/home/kiosk/WEBKIT/qt-everywhere-opensource-src-5.9.1/qtbase/config.tests/common/alloca -I. -I/home/kiosk/WEBKIT/qt-everywhere-opensource-src-5.9.1/qtbase/mkspecs/linux-g++ -o alloca.o /home/kiosk/WEBKIT/qt-everywhere-opensource-src-5.9.1/qtbase/config.tests/common/alloca/alloca.cpp
  19. > g++ -Wl,-O1 -fuse-ld=gold -o alloca alloca.o    
  20. test config.qtbase.tests.alloca_h succeeded
  21. executing config test architecture
  22. + cd /home/kiosk/WEBKIT/qt-everywhere-opensource-src-5.9.1/build/config.tests/arch && /home/kiosk/WEBKIT/qt-everywhere-opensource-src-5.9.1/build/qtbase/bin/qmake "CONFIG -= qt debug_and_release app_bundle lib_bundle" "CONFIG += shared use_gold_linker console single_arch" /home/kiosk/WEBKIT/qt-everywhere-opensource-src-5.9.1/qtbase/config.tests/arch
  23. + cd /home/kiosk/WEBKIT/qt-everywhere-opensource-src-5.9.1/build/config.tests/arch && MAKEFLAGS= /usr/bin/make
  24. > g++ -c -pipe -g -Wall -W -fPIC  -I/home/kiosk/WEBKIT/qt-everywhere-opensource-src-5.9.1/qtbase/config.tests/arch -I. -I/home/kiosk/WEBKIT/qt-everywhere-opensource-src-5.9.1/qtbase/mkspecs/linux-g++ -o arch.o /home/kiosk/WEBKIT/qt-everywhere-opensource-src-5.9.1/qtbase/config.tests/arch/arch.cpp
  25. > g++ -fuse-ld=gold -o arch arch.o    
  26. Detected architecture: i386 ()
  27. test config.qtbase.tests.architecture gave result i386
  28. executing config test sse2
  29. + cd /home/kiosk/WEBKIT/qt-everywhere-opensource-src-5.9.1/build/config.tests/common/sse2 && /home/kiosk/WEBKIT/qt-everywhere-opensource-src-5.9.1/build/qtbase/bin/qmake "CONFIG -= qt debug_and_release app_bundle lib_bundle" "CONFIG += shared use_gold_linker console single_arch" /home/kiosk/WEBKIT/qt-everywhere-opensource-src-5.9.1/qtbase/config.tests/common/sse2
  30. + cd /home/kiosk/WEBKIT/qt-everywhere-opensource-src-5.9.1/build/config.tests/common/sse2 && MAKEFLAGS= /usr/bin/make
  31. > g++ -c -pipe -msse2 -g -Wall -W -fPIC  -I/home/kiosk/WEBKIT/qt-everywhere-opensource-src-5.9.1/qtbase/config.tests/common/sse2 -I. -I/home/kiosk/WEBKIT/qt-everywhere-opensource-src-5.9.1/qtbase/mkspecs/linux-g++ -o sse2.o /home/kiosk/WEBKIT/qt-everywhere-opensource-src-5.9.1/qtbase/config.tests/common/sse2/sse2.cpp
  32. > g++ -fuse-ld=gold -o sse2 sse2.o    
  33. test config.qtbase.tests.sse2 succeeded
  34. executing config test sse3
  35. + cd /home/kiosk/WEBKIT/qt-everywhere-opensource-src-5.9.1/build/config.tests/common/sse3 && /home/kiosk/WEBKIT/qt-everywhere-opensource-src-5.9.1/build/qtbase/bin/qmake "CONFIG -= qt debug_and_release app_bundle lib_bundle" "CONFIG += shared use_gold_linker console single_arch" /home/kiosk/WEBKIT/qt-everywhere-opensource-src-5.9.1/qtbase/config.tests/common/sse3
  36. + cd /home/kiosk/WEBKIT/qt-everywhere-opensource-src-5.9.1/build/config.tests/common/sse3 && MAKEFLAGS= /usr/bin/make
  37. > g++ -c -pipe -msse3 -g -Wall -W -fPIC  -I/home/kiosk/WEBKIT/qt-everywhere-opensource-src-5.9.1/qtbase/config.tests/common/sse3 -I. -I/home/kiosk/WEBKIT/qt-everywhere-opensource-src-5.9.1/qtbase/mkspecs/linux-g++ -o sse3.o /home/kiosk/WEBKIT/qt-everywhere-opensource-src-5.9.1/qtbase/config.tests/common/sse3/sse3.cpp
  38. > g++ -fuse-ld=gold -o sse3 sse3.o    
  39. test config.qtbase.tests.sse3 succeeded
  40. executing config test ssse3
  41. + cd /home/kiosk/WEBKIT/qt-everywhere-opensource-src-5.9.1/build/config.tests/common/ssse3 && /home/kiosk/WEBKIT/qt-everywhere-opensource-src-5.9.1/build/qtbase/bin/qmake "CONFIG -= qt debug_and_release app_bundle lib_bundle" "CONFIG += shared use_gold_linker console single_arch" /home/kiosk/WEBKIT/qt-everywhere-opensource-src-5.9.1/qtbase/config.tests/common/ssse3
  42. + cd /home/kiosk/WEBKIT/qt-everywhere-opensource-src-5.9.1/build/config.tests/common/ssse3 && MAKEFLAGS= /usr/bin/make
  43. > g++ -c -pipe -mssse3 -g -Wall -W -fPIC  -I/home/kiosk/WEBKIT/qt-everywhere-opensource-src-5.9.1/qtbase/config.tests/common/ssse3 -I. -I/home/kiosk/WEBKIT/qt-everywhere-opensource-src-5.9.1/qtbase/mkspecs/linux-g++ -o ssse3.o /home/kiosk/WEBKIT/qt-everywhere-opensource-src-5.9.1/qtbase/config.tests/common/ssse3/ssse3.cpp
  44. > g++ -fuse-ld=gold -o ssse3 ssse3.o    
  45. test config.qtbase.tests.ssse3 succeeded
  46. executing config test sse4_1
  47. + cd /home/kiosk/WEBKIT/qt-everywhere-opensource-src-5.9.1/build/config.tests/common/sse4_1 && /home/kiosk/WEBKIT/qt-everywhere-opensource-src-5.9.1/build/qtbase/bin/qmake "CONFIG -= qt debug_and_release app_bundle lib_bundle" "CONFIG += shared use_gold_linker console single_arch" /home/kiosk/WEBKIT/qt-everywhere-opensource-src-5.9.1/qtbase/config.tests/common/sse4_1
  48. + cd /home/kiosk/WEBKIT/qt-everywhere-opensource-src-5.9.1/build/config.tests/common/sse4_1 && MAKEFLAGS= /usr/bin/make
  49. > g++ -c -pipe -msse4.1 -g -Wall -W -fPIC  -I/home/kiosk/WEBKIT/qt-everywhere-opensource-src-5.9.1/qtbase/config.tests/common/sse4_1 -I. -I/home/kiosk/WEBKIT/qt-everywhere-opensource-src-5.9.1/qtbase/mkspecs/linux-g++ -o sse4_1.o /home/kiosk/WEBKIT/qt-everywhere-opensource-src-5.9.1/qtbase/config.tests/common/sse4_1/sse4_1.cpp
  50. > g++ -fuse-ld=gold -o sse4_1 sse4_1.o    
  51. test config.qtbase.tests.sse4_1 succeeded
  52. executing config test sse4_2
  53. + cd /home/kiosk/WEBKIT/qt-everywhere-opensource-src-5.9.1/build/config.tests/common/sse4_2 && /home/kiosk/WEBKIT/qt-everywhere-opensource-src-5.9.1/build/qtbase/bin/qmake "CONFIG -= qt debug_and_release app_bundle lib_bundle" "CONFIG += shared use_gold_linker console single_arch" /home/kiosk/WEBKIT/qt-everywhere-opensource-src-5.9.1/qtbase/config.tests/common/sse4_2
  54. + cd /home/kiosk/WEBKIT/qt-everywhere-opensource-src-5.9.1/build/config.tests/common/sse4_2 && MAKEFLAGS= /usr/bin/make
  55. > g++ -c -pipe -msse4.2 -g -Wall -W -fPIC  -I/home/kiosk/WEBKIT/qt-everywhere-opensource-src-5.9.1/qtbase/config.tests/common/sse4_2 -I. -I/home/kiosk/WEBKIT/qt-everywhere-opensource-src-5.9.1/qtbase/mkspecs/linux-g++ -o sse4_2.o /home/kiosk/WEBKIT/qt-everywhere-opensource-src-5.9.1/qtbase/config.tests/common/sse4_2/sse4_2.cpp
  56. > g++ -fuse-ld=gold -o sse4_2 sse4_2.o    
  57. test config.qtbase.tests.sse4_2 succeeded
  58. executing config test avx
  59. + cd /home/kiosk/WEBKIT/qt-everywhere-opensource-src-5.9.1/build/config.tests/common/avx && /home/kiosk/WEBKIT/qt-everywhere-opensource-src-5.9.1/build/qtbase/bin/qmake "CONFIG -= qt debug_and_release app_bundle lib_bundle" "CONFIG += shared use_gold_linker console single_arch" /home/kiosk/WEBKIT/qt-everywhere-opensource-src-5.9.1/qtbase/config.tests/common/avx
  60. + cd /home/kiosk/WEBKIT/qt-everywhere-opensource-src-5.9.1/build/config.tests/common/avx && MAKEFLAGS= /usr/bin/make
  61. > g++ -c -pipe -mavx -g -Wall -W -fPIC  -I/home/kiosk/WEBKIT/qt-everywhere-opensource-src-5.9.1/qtbase/config.tests/common/avx -I. -I/home/kiosk/WEBKIT/qt-everywhere-opensource-src-5.9.1/qtbase/mkspecs/linux-g++ -o avx.o /home/kiosk/WEBKIT/qt-everywhere-opensource-src-5.9.1/qtbase/config.tests/common/avx/avx.cpp
  62. > g++ -fuse-ld=gold -o avx avx.o    
  63. test config.qtbase.tests.avx succeeded
  64. executing config test avx2
  65. + cd /home/kiosk/WEBKIT/qt-everywhere-opensource-src-5.9.1/build/config.tests/common/avx2 && /home/kiosk/WEBKIT/qt-everywhere-opensource-src-5.9.1/build/qtbase/bin/qmake "CONFIG -= qt debug_and_release app_bundle lib_bundle" "CONFIG += shared use_gold_linker console single_arch" /home/kiosk/WEBKIT/qt-everywhere-opensource-src-5.9.1/qtbase/config.tests/common/avx2
  66. + cd /home/kiosk/WEBKIT/qt-everywhere-opensource-src-5.9.1/build/config.tests/common/avx2 && MAKEFLAGS= /usr/bin/make
  67. > g++ -c -pipe -mavx2 -g -Wall -W -fPIC  -I/home/kiosk/WEBKIT/qt-everywhere-opensource-src-5.9.1/qtbase/config.tests/common/avx2 -I. -I/home/kiosk/WEBKIT/qt-everywhere-opensource-src-5.9.1/qtbase/mkspecs/linux-g++ -o avx2.o /home/kiosk/WEBKIT/qt-everywhere-opensource-src-5.9.1/qtbase/config.tests/common/avx2/avx2.cpp
  68. > g++ -fuse-ld=gold -o avx2 avx2.o    
  69. test config.qtbase.tests.avx2 succeeded
  70. executing config test avx512f
  71. + cd /home/kiosk/WEBKIT/qt-everywhere-opensource-src-5.9.1/build/config.tests/common/avx512 && /home/kiosk/WEBKIT/qt-everywhere-opensource-src-5.9.1/build/qtbase/bin/qmake "CONFIG -= qt debug_and_release app_bundle lib_bundle" "CONFIG += shared use_gold_linker console single_arch" AVX512=F /home/kiosk/WEBKIT/qt-everywhere-opensource-src-5.9.1/qtbase/config.tests/common/avx512
  72. + cd /home/kiosk/WEBKIT/qt-everywhere-opensource-src-5.9.1/build/config.tests/common/avx512 && MAKEFLAGS= /usr/bin/make
  73. > g++ -c -pipe -mavx512f -g -Wall -W -fPIC -DAVX512WANT=F -I/home/kiosk/WEBKIT/qt-everywhere-opensource-src-5.9.1/qtbase/config.tests/common/avx512 -I. -I/home/kiosk/WEBKIT/qt-everywhere-opensource-src-5.9.1/qtbase/mkspecs/linux-g++ -o avx512.o /home/kiosk/WEBKIT/qt-everywhere-opensource-src-5.9.1/qtbase/config.tests/common/avx512/avx512.cpp
  74. > g++ -fuse-ld=gold -o avx512 avx512.o    
  75. test config.qtbase.tests.avx512f succeeded
  76. executing config test avx512bw
  77. + cd /home/kiosk/WEBKIT/qt-everywhere-opensource-src-5.9.1/build/config.tests/common/avx512 && /home/kiosk/WEBKIT/qt-everywhere-opensource-src-5.9.1/build/qtbase/bin/qmake "CONFIG -= qt debug_and_release app_bundle lib_bundle" "CONFIG += shared use_gold_linker console single_arch" AVX512=BW /home/kiosk/WEBKIT/qt-everywhere-opensource-src-5.9.1/qtbase/config.tests/common/avx512
  78. + cd /home/kiosk/WEBKIT/qt-everywhere-opensource-src-5.9.1/build/config.tests/common/avx512 && MAKEFLAGS= /usr/bin/make clean && MAKEFLAGS= /usr/bin/make
  79. > rm -f avx512.o
  80. > rm -f *~ core *.core
  81. > g++ -c -pipe -mavx512bw -g -Wall -W -fPIC -DAVX512WANT=BW -I/home/kiosk/WEBKIT/qt-everywhere-opensource-src-5.9.1/qtbase/config.tests/common/avx512 -I. -I/home/kiosk/WEBKIT/qt-everywhere-opensource-src-5.9.1/qtbase/mkspecs/linux-g++ -o avx512.o /home/kiosk/WEBKIT/qt-everywhere-opensource-src-5.9.1/qtbase/config.tests/common/avx512/avx512.cpp
  82. > g++ -fuse-ld=gold -o avx512 avx512.o    
  83. test config.qtbase.tests.avx512bw succeeded
  84. executing config test avx512cd
  85. + cd /home/kiosk/WEBKIT/qt-everywhere-opensource-src-5.9.1/build/config.tests/common/avx512 && /home/kiosk/WEBKIT/qt-everywhere-opensource-src-5.9.1/build/qtbase/bin/qmake "CONFIG -= qt debug_and_release app_bundle lib_bundle" "CONFIG += shared use_gold_linker console single_arch" AVX512=CD /home/kiosk/WEBKIT/qt-everywhere-opensource-src-5.9.1/qtbase/config.tests/common/avx512
  86. + cd /home/kiosk/WEBKIT/qt-everywhere-opensource-src-5.9.1/build/config.tests/common/avx512 && MAKEFLAGS= /usr/bin/make clean && MAKEFLAGS= /usr/bin/make
  87. > rm -f avx512.o
  88. > rm -f *~ core *.core
  89. > g++ -c -pipe -mavx512cd -g -Wall -W -fPIC -DAVX512WANT=CD -I/home/kiosk/WEBKIT/qt-everywhere-opensource-src-5.9.1/qtbase/config.tests/common/avx512 -I. -I/home/kiosk/WEBKIT/qt-everywhere-opensource-src-5.9.1/qtbase/mkspecs/linux-g++ -o avx512.o /home/kiosk/WEBKIT/qt-everywhere-opensource-src-5.9.1/qtbase/config.tests/common/avx512/avx512.cpp
  90. > g++ -fuse-ld=gold -o avx512 avx512.o    
  91. test config.qtbase.tests.avx512cd succeeded
  92. executing config test avx512dq
  93. + cd /home/kiosk/WEBKIT/qt-everywhere-opensource-src-5.9.1/build/config.tests/common/avx512 && /home/kiosk/WEBKIT/qt-everywhere-opensource-src-5.9.1/build/qtbase/bin/qmake "CONFIG -= qt debug_and_release app_bundle lib_bundle" "CONFIG += shared use_gold_linker console single_arch" AVX512=DQ /home/kiosk/WEBKIT/qt-everywhere-opensource-src-5.9.1/qtbase/config.tests/common/avx512
  94. + cd /home/kiosk/WEBKIT/qt-everywhere-opensource-src-5.9.1/build/config.tests/common/avx512 && MAKEFLAGS= /usr/bin/make clean && MAKEFLAGS= /usr/bin/make
  95. > rm -f avx512.o
  96. > rm -f *~ core *.core
  97. > g++ -c -pipe -mavx512dq -g -Wall -W -fPIC -DAVX512WANT=DQ -I/home/kiosk/WEBKIT/qt-everywhere-opensource-src-5.9.1/qtbase/config.tests/common/avx512 -I. -I/home/kiosk/WEBKIT/qt-everywhere-opensource-src-5.9.1/qtbase/mkspecs/linux-g++ -o avx512.o /home/kiosk/WEBKIT/qt-everywhere-opensource-src-5.9.1/qtbase/config.tests/common/avx512/avx512.cpp
  98. > g++ -fuse-ld=gold -o avx512 avx512.o    
  99. test config.qtbase.tests.avx512dq succeeded
  100. executing config test avx512er
  101. + cd /home/kiosk/WEBKIT/qt-everywhere-opensource-src-5.9.1/build/config.tests/common/avx512 && /home/kiosk/WEBKIT/qt-everywhere-opensource-src-5.9.1/build/qtbase/bin/qmake "CONFIG -= qt debug_and_release app_bundle lib_bundle" "CONFIG += shared use_gold_linker console single_arch" AVX512=ER /home/kiosk/WEBKIT/qt-everywhere-opensource-src-5.9.1/qtbase/config.tests/common/avx512
  102. + cd /home/kiosk/WEBKIT/qt-everywhere-opensource-src-5.9.1/build/config.tests/common/avx512 && MAKEFLAGS= /usr/bin/make clean && MAKEFLAGS= /usr/bin/make
  103. > rm -f avx512.o
  104. > rm -f *~ core *.core
  105. > g++ -c -pipe -mavx512er -g -Wall -W -fPIC -DAVX512WANT=ER -I/home/kiosk/WEBKIT/qt-everywhere-opensource-src-5.9.1/qtbase/config.tests/common/avx512 -I. -I/home/kiosk/WEBKIT/qt-everywhere-opensource-src-5.9.1/qtbase/mkspecs/linux-g++ -o avx512.o /home/kiosk/WEBKIT/qt-everywhere-opensource-src-5.9.1/qtbase/config.tests/common/avx512/avx512.cpp
  106. > g++ -fuse-ld=gold -o avx512 avx512.o    
  107. test config.qtbase.tests.avx512er succeeded
  108. executing config test avx512ifma
  109. + cd /home/kiosk/WEBKIT/qt-everywhere-opensource-src-5.9.1/build/config.tests/common/avx512 && /home/kiosk/WEBKIT/qt-everywhere-opensource-src-5.9.1/build/qtbase/bin/qmake "CONFIG -= qt debug_and_release app_bundle lib_bundle" "CONFIG += shared use_gold_linker console single_arch" AVX512=IFMA /home/kiosk/WEBKIT/qt-everywhere-opensource-src-5.9.1/qtbase/config.tests/common/avx512
  110. + cd /home/kiosk/WEBKIT/qt-everywhere-opensource-src-5.9.1/build/config.tests/common/avx512 && MAKEFLAGS= /usr/bin/make clean && MAKEFLAGS= /usr/bin/make
  111. > rm -f avx512.o
  112. > rm -f *~ core *.core
  113. > g++ -c -pipe -mavx512ifma -g -Wall -W -fPIC -DAVX512WANT=IFMA -I/home/kiosk/WEBKIT/qt-everywhere-opensource-src-5.9.1/qtbase/config.tests/common/avx512 -I. -I/home/kiosk/WEBKIT/qt-everywhere-opensource-src-5.9.1/qtbase/mkspecs/linux-g++ -o avx512.o /home/kiosk/WEBKIT/qt-everywhere-opensource-src-5.9.1/qtbase/config.tests/common/avx512/avx512.cpp
  114. > g++ -fuse-ld=gold -o avx512 avx512.o    
  115. test config.qtbase.tests.avx512ifma succeeded
  116. executing config test avx512pf
  117. + cd /home/kiosk/WEBKIT/qt-everywhere-opensource-src-5.9.1/build/config.tests/common/avx512 && /home/kiosk/WEBKIT/qt-everywhere-opensource-src-5.9.1/build/qtbase/bin/qmake "CONFIG -= qt debug_and_release app_bundle lib_bundle" "CONFIG += shared use_gold_linker console single_arch" AVX512=PF /home/kiosk/WEBKIT/qt-everywhere-opensource-src-5.9.1/qtbase/config.tests/common/avx512
  118. + cd /home/kiosk/WEBKIT/qt-everywhere-opensource-src-5.9.1/build/config.tests/common/avx512 && MAKEFLAGS= /usr/bin/make clean && MAKEFLAGS= /usr/bin/make
  119. > rm -f avx512.o
  120. > rm -f *~ core *.core
  121. > g++ -c -pipe -mavx512pf -g -Wall -W -fPIC -DAVX512WANT=PF -I/home/kiosk/WEBKIT/qt-everywhere-opensource-src-5.9.1/qtbase/config.tests/common/avx512 -I. -I/home/kiosk/WEBKIT/qt-everywhere-opensource-src-5.9.1/qtbase/mkspecs/linux-g++ -o avx512.o /home/kiosk/WEBKIT/qt-everywhere-opensource-src-5.9.1/qtbase/config.tests/common/avx512/avx512.cpp
  122. > g++ -fuse-ld=gold -o avx512 avx512.o    
  123. test config.qtbase.tests.avx512pf succeeded
  124. executing config test avx512vbmi
  125. + cd /home/kiosk/WEBKIT/qt-everywhere-opensource-src-5.9.1/build/config.tests/common/avx512 && /home/kiosk/WEBKIT/qt-everywhere-opensource-src-5.9.1/build/qtbase/bin/qmake "CONFIG -= qt debug_and_release app_bundle lib_bundle" "CONFIG += shared use_gold_linker console single_arch" AVX512=VBMI /home/kiosk/WEBKIT/qt-everywhere-opensource-src-5.9.1/qtbase/config.tests/common/avx512
  126. + cd /home/kiosk/WEBKIT/qt-everywhere-opensource-src-5.9.1/build/config.tests/common/avx512 && MAKEFLAGS= /usr/bin/make clean && MAKEFLAGS= /usr/bin/make
  127. > rm -f avx512.o
  128. > rm -f *~ core *.core
  129. > g++ -c -pipe -mavx512vbmi -g -Wall -W -fPIC -DAVX512WANT=VBMI -I/home/kiosk/WEBKIT/qt-everywhere-opensource-src-5.9.1/qtbase/config.tests/common/avx512 -I. -I/home/kiosk/WEBKIT/qt-everywhere-opensource-src-5.9.1/qtbase/mkspecs/linux-g++ -o avx512.o /home/kiosk/WEBKIT/qt-everywhere-opensource-src-5.9.1/qtbase/config.tests/common/avx512/avx512.cpp
  130. > g++ -fuse-ld=gold -o avx512 avx512.o    
  131. test config.qtbase.tests.avx512vbmi succeeded
  132. executing config test avx512vl
  133. + cd /home/kiosk/WEBKIT/qt-everywhere-opensource-src-5.9.1/build/config.tests/common/avx512 && /home/kiosk/WEBKIT/qt-everywhere-opensource-src-5.9.1/build/qtbase/bin/qmake "CONFIG -= qt debug_and_release app_bundle lib_bundle" "CONFIG += shared use_gold_linker console single_arch" AVX512=VL /home/kiosk/WEBKIT/qt-everywhere-opensource-src-5.9.1/qtbase/config.tests/common/avx512
  134. + cd /home/kiosk/WEBKIT/qt-everywhere-opensource-src-5.9.1/build/config.tests/common/avx512 && MAKEFLAGS= /usr/bin/make clean && MAKEFLAGS= /usr/bin/make
  135. > rm -f avx512.o
  136. > rm -f *~ core *.core
  137. > g++ -c -pipe -mavx512vl -g -Wall -W -fPIC -DAVX512WANT=VL -I/home/kiosk/WEBKIT/qt-everywhere-opensource-src-5.9.1/qtbase/config.tests/common/avx512 -I. -I/home/kiosk/WEBKIT/qt-everywhere-opensource-src-5.9.1/qtbase/mkspecs/linux-g++ -o avx512.o /home/kiosk/WEBKIT/qt-everywhere-opensource-src-5.9.1/qtbase/config.tests/common/avx512/avx512.cpp
  138. > g++ -fuse-ld=gold -o avx512 avx512.o    
  139. test config.qtbase.tests.avx512vl succeeded
  140. executing config test c++14
  141. + cd /home/kiosk/WEBKIT/qt-everywhere-opensource-src-5.9.1/build/config.tests/common/c++14 && /home/kiosk/WEBKIT/qt-everywhere-opensource-src-5.9.1/build/qtbase/bin/qmake "CONFIG -= qt debug_and_release app_bundle lib_bundle" "CONFIG += shared use_gold_linker console single_arch" /home/kiosk/WEBKIT/qt-everywhere-opensource-src-5.9.1/qtbase/config.tests/common/c++14
  142. + cd /home/kiosk/WEBKIT/qt-everywhere-opensource-src-5.9.1/build/config.tests/common/c++14 && MAKEFLAGS= /usr/bin/make
  143. > g++ -c -pipe -O2 -std=gnu++1y -Wall -W -fPIC  -I/home/kiosk/WEBKIT/qt-everywhere-opensource-src-5.9.1/qtbase/config.tests/common/c++14 -I. -I/home/kiosk/WEBKIT/qt-everywhere-opensource-src-5.9.1/qtbase/mkspecs/linux-g++ -o c++14.o /home/kiosk/WEBKIT/qt-everywhere-opensource-src-5.9.1/qtbase/config.tests/common/c++14/c++14.cpp
  144. > g++ -Wl,-O1 -fuse-ld=gold -o c++14 c++14.o    
  145. test config.qtbase.tests.c++14 succeeded
  146. executing config test c++1z
  147. + cd /home/kiosk/WEBKIT/qt-everywhere-opensource-src-5.9.1/build/config.tests/common/c++1z && /home/kiosk/WEBKIT/qt-everywhere-opensource-src-5.9.1/build/qtbase/bin/qmake "CONFIG -= qt debug_and_release app_bundle lib_bundle" "CONFIG += shared use_gold_linker console single_arch" /home/kiosk/WEBKIT/qt-everywhere-opensource-src-5.9.1/qtbase/config.tests/common/c++1z
  148. + cd /home/kiosk/WEBKIT/qt-everywhere-opensource-src-5.9.1/build/config.tests/common/c++1z && MAKEFLAGS= /usr/bin/make
  149. > g++ -c -pipe -O2 -std=gnu++1z -Wall -W -fPIC  -I/home/kiosk/WEBKIT/qt-everywhere-opensource-src-5.9.1/qtbase/config.tests/common/c++1z -I. -I/home/kiosk/WEBKIT/qt-everywhere-opensource-src-5.9.1/qtbase/mkspecs/linux-g++ -o c++1z.o /home/kiosk/WEBKIT/qt-everywhere-opensource-src-5.9.1/qtbase/config.tests/common/c++1z/c++1z.cpp
  150. > g++ -Wl,-O1 -fuse-ld=gold -o c++1z c++1z.o    
  151. test config.qtbase.tests.c++1z succeeded
  152. executing config test pkg-config
  153. Found pkg-config from path: /usr/bin/pkg-config
  154. test config.qtbase.tests.pkg-config succeeded
  155. looking for library dbus
  156. Trying source 0 (type pkgConfig) of library dbus ...
  157. + /usr/bin/pkg-config --exists --silence-errors dbus-1 '>=' 1.2
  158. pkg-config did not find package.
  159.   => source produced no result.
  160. Trying source 1 (type inline) of library dbus ...
  161.   => source failed condition 'config.win32'.
  162. Trying source 2 (type inline) of library dbus ...
  163. + cd /home/kiosk/WEBKIT/qt-everywhere-opensource-src-5.9.1/build/config.tests/unix/dbus && /home/kiosk/WEBKIT/qt-everywhere-opensource-src-5.9.1/build/qtbase/bin/qmake "CONFIG -= qt debug_and_release app_bundle lib_bundle" "CONFIG += shared use_gold_linker console single_arch" 'LIBS += -ldbus-1' /home/kiosk/WEBKIT/qt-everywhere-opensource-src-5.9.1/qtbase/config.tests/unix/dbus
  164. + cd /home/kiosk/WEBKIT/qt-everywhere-opensource-src-5.9.1/build/config.tests/unix/dbus && MAKEFLAGS= /usr/bin/make
  165. > g++ -c -pipe -O2 -Wall -W -fPIC  -I/home/kiosk/WEBKIT/qt-everywhere-opensource-src-5.9.1/qtbase/config.tests/unix/dbus -I. -I/home/kiosk/WEBKIT/qt-everywhere-opensource-src-5.9.1/qtbase/mkspecs/linux-g++ -o dbus.o /home/kiosk/WEBKIT/qt-everywhere-opensource-src-5.9.1/qtbase/config.tests/unix/dbus/dbus.cpp
  166. > /home/kiosk/WEBKIT/qt-everywhere-opensource-src-5.9.1/qtbase/config.tests/unix/dbus/dbus.cpp:41:23: fatal error: dbus/dbus.h: Нет такого файла или каталога
  167. >  #include <dbus/dbus.h>
  168. >                        ^
  169. > compilation terminated.
  170. > Makefile:168: ошибка выполнения рецепта для цели «dbus.o»
  171. > make: *** [dbus.o] Ошибка 1
  172.  => source failed verification.
  173. test config.qtbase.libraries.dbus FAILED
  174. executing config test enable_new_dtags
  175. + cd /home/kiosk/WEBKIT/qt-everywhere-opensource-src-5.9.1/build/config.tests && g++ -fuse-ld=gold -Wl,--enable-new-dtags -o conftest-out conftest.cpp
  176. test config.qtbase.tests.enable_new_dtags succeeded
  177. executing config test f16c
  178. + cd /home/kiosk/WEBKIT/qt-everywhere-opensource-src-5.9.1/build/config.tests/common/f16c && /home/kiosk/WEBKIT/qt-everywhere-opensource-src-5.9.1/build/qtbase/bin/qmake "CONFIG -= qt debug_and_release app_bundle lib_bundle" "CONFIG += shared use_gold_linker console single_arch" /home/kiosk/WEBKIT/qt-everywhere-opensource-src-5.9.1/qtbase/config.tests/common/f16c
  179. + cd /home/kiosk/WEBKIT/qt-everywhere-opensource-src-5.9.1/build/config.tests/common/f16c && MAKEFLAGS= /usr/bin/make
  180. > g++ -c -pipe -mf16c -g -Wall -W -fPIC  -I/home/kiosk/WEBKIT/qt-everywhere-opensource-src-5.9.1/qtbase/config.tests/common/f16c -I. -I/home/kiosk/WEBKIT/qt-everywhere-opensource-src-5.9.1/qtbase/mkspecs/linux-g++ -o f16c.o /home/kiosk/WEBKIT/qt-everywhere-opensource-src-5.9.1/qtbase/config.tests/common/f16c/f16c.cpp
  181. > g++ -fuse-ld=gold -o f16c f16c.o    
  182. test config.qtbase.tests.f16c succeeded
  183. looking for library host_dbus
  184. Trying source 0 (type pkgConfig) of library host_dbus ...
  185. + /usr/bin/pkg-config --exists --silence-errors dbus-1 '>=' 1.2
  186. pkg-config did not find package.
  187.   => source produced no result.
  188. Trying source 1 (type inline) of library host_dbus ...
  189.  => source accepted.
  190. test config.qtbase.libraries.host_dbus succeeded
  191. looking for library libudev
  192. Trying source 0 (type pkgConfig) of library libudev ...
  193. + /usr/bin/pkg-config --exists --silence-errors libudev
  194. + /usr/bin/pkg-config --modversion libudev
  195. > 229
  196. + /usr/bin/pkg-config --libs-only-L libudev
  197. + /usr/bin/pkg-config --libs-only-l libudev
  198. > -ludev
  199. + /usr/bin/pkg-config --cflags libudev
  200. + cd /home/kiosk/WEBKIT/qt-everywhere-opensource-src-5.9.1/build/config.tests/unix/libudev && /home/kiosk/WEBKIT/qt-everywhere-opensource-src-5.9.1/build/qtbase/bin/qmake "CONFIG -= qt debug_and_release app_bundle lib_bundle" "CONFIG += shared use_gold_linker console single_arch" 'LIBS += -ludev' /home/kiosk/WEBKIT/qt-everywhere-opensource-src-5.9.1/qtbase/config.tests/unix/libudev
  201. + cd /home/kiosk/WEBKIT/qt-everywhere-opensource-src-5.9.1/build/config.tests/unix/libudev && MAKEFLAGS= /usr/bin/make
  202. > g++ -c -pipe -O2 -Wall -W -fPIC  -I/home/kiosk/WEBKIT/qt-everywhere-opensource-src-5.9.1/qtbase/config.tests/unix/libudev -I. -I/home/kiosk/WEBKIT/qt-everywhere-opensource-src-5.9.1/qtbase/mkspecs/linux-g++ -o libudev.o /home/kiosk/WEBKIT/qt-everywhere-opensource-src-5.9.1/qtbase/config.tests/unix/libudev/libudev.cpp
  203. > g++ -Wl,-O1 -fuse-ld=gold -o libudev libudev.o   -ludev
  204.  => source accepted.
  205. test config.qtbase.libraries.libudev succeeded
  206. executing config test mremap
  207. + cd /home/kiosk/WEBKIT/qt-everywhere-opensource-src-5.9.1/build/config.tests/unix/mremap && /home/kiosk/WEBKIT/qt-everywhere-opensource-src-5.9.1/build/qtbase/bin/qmake "CONFIG -= qt debug_and_release app_bundle lib_bundle" "CONFIG += shared use_gold_linker console single_arch" /home/kiosk/WEBKIT/qt-everywhere-opensource-src-5.9.1/qtbase/config.tests/unix/mremap
  208. + cd /home/kiosk/WEBKIT/qt-everywhere-opensource-src-5.9.1/build/config.tests/unix/mremap && MAKEFLAGS= /usr/bin/make
  209. > g++ -c -pipe -O2 -Wall -W -fPIC  -I/home/kiosk/WEBKIT/qt-everywhere-opensource-src-5.9.1/qtbase/config.tests/unix/mremap -I. -I/home/kiosk/WEBKIT/qt-everywhere-opensource-src-5.9.1/qtbase/mkspecs/linux-g++ -o mremap.o /home/kiosk/WEBKIT/qt-everywhere-opensource-src-5.9.1/qtbase/config.tests/unix/mremap/mremap.cpp
  210. > g++ -Wl,-O1 -fuse-ld=gold -o mremap mremap.o    
  211. test config.qtbase.tests.mremap succeeded
  212. executing config test posix_fallocate
  213. + cd /home/kiosk/WEBKIT/qt-everywhere-opensource-src-5.9.1/build/config.tests/unix/posix_fallocate && /home/kiosk/WEBKIT/qt-everywhere-opensource-src-5.9.1/build/qtbase/bin/qmake "CONFIG -= qt debug_and_release app_bundle lib_bundle" "CONFIG += shared use_gold_linker console single_arch" /home/kiosk/WEBKIT/qt-everywhere-opensource-src-5.9.1/qtbase/config.tests/unix/posix_fallocate
  214. + cd /home/kiosk/WEBKIT/qt-everywhere-opensource-src-5.9.1/build/config.tests/unix/posix_fallocate && MAKEFLAGS= /usr/bin/make
  215. > g++ -c -pipe -O2 -Wall -W -fPIC  -I/home/kiosk/WEBKIT/qt-everywhere-opensource-src-5.9.1/qtbase/config.tests/unix/posix_fallocate -I. -I/home/kiosk/WEBKIT/qt-everywhere-opensource-src-5.9.1/qtbase/mkspecs/linux-g++ -o posix_fallocate.o /home/kiosk/WEBKIT/qt-everywhere-opensource-src-5.9.1/qtbase/config.tests/unix/posix_fallocate/posix_fallocate.cpp
  216. > g++ -Wl,-O1 -fuse-ld=gold -o posix_fallocate posix_fallocate.o    
  217. test config.qtbase.tests.posix_fallocate succeeded
  218. executing config test precompile_header
  219. + cd /home/kiosk/WEBKIT/qt-everywhere-opensource-src-5.9.1/build/config.tests/common/pch && /home/kiosk/WEBKIT/qt-everywhere-opensource-src-5.9.1/build/qtbase/bin/qmake "CONFIG -= qt debug_and_release app_bundle lib_bundle" "CONFIG += shared use_gold_linker console single_arch" /home/kiosk/WEBKIT/qt-everywhere-opensource-src-5.9.1/qtbase/config.tests/common/pch
  220. + cd /home/kiosk/WEBKIT/qt-everywhere-opensource-src-5.9.1/build/config.tests/common/pch && MAKEFLAGS= /usr/bin/make
  221. > g++ -pipe -O2 -Wall -W -fPIC  -I/home/kiosk/WEBKIT/qt-everywhere-opensource-src-5.9.1/qtbase/config.tests/common/pch -I. -I/home/kiosk/WEBKIT/qt-everywhere-opensource-src-5.9.1/qtbase/mkspecs/linux-g++ -x c++-header -c /home/kiosk/WEBKIT/qt-everywhere-opensource-src-5.9.1/qtbase/config.tests/common/pch/header.h -o .pch/pch.gch/c++
  222. > g++ -c -include .pch/pch -pipe -O2 -Wall -W -fPIC  -I/home/kiosk/WEBKIT/qt-everywhere-opensource-src-5.9.1/qtbase/config.tests/common/pch -I. -I/home/kiosk/WEBKIT/qt-everywhere-opensource-src-5.9.1/qtbase/mkspecs/linux-g++ -o source.o /home/kiosk/WEBKIT/qt-everywhere-opensource-src-5.9.1/qtbase/config.tests/common/pch/source.cpp
  223. > g++ -Wl,-O1 -fuse-ld=gold -o pch source.o    
  224. test config.qtbase.tests.precompile_header succeeded
  225. executing config test reduce_exports
  226. + cd /home/kiosk/WEBKIT/qt-everywhere-opensource-src-5.9.1/build/config.tests/unix/reduce_exports && /home/kiosk/WEBKIT/qt-everywhere-opensource-src-5.9.1/build/qtbase/bin/qmake "CONFIG -= qt debug_and_release app_bundle lib_bundle" "CONFIG += shared use_gold_linker console single_arch" /home/kiosk/WEBKIT/qt-everywhere-opensource-src-5.9.1/qtbase/config.tests/unix/reduce_exports
  227. + cd /home/kiosk/WEBKIT/qt-everywhere-opensource-src-5.9.1/build/config.tests/unix/reduce_exports && MAKEFLAGS= /usr/bin/make
  228. > gcc -c -pipe -O2 -fvisibility=hidden -Wall -W -fPIC  -I/home/kiosk/WEBKIT/qt-everywhere-opensource-src-5.9.1/qtbase/config.tests/unix/reduce_exports -I. -I/home/kiosk/WEBKIT/qt-everywhere-opensource-src-5.9.1/qtbase/mkspecs/linux-g++ -o fvisibility.o /home/kiosk/WEBKIT/qt-everywhere-opensource-src-5.9.1/qtbase/config.tests/unix/reduce_exports/fvisibility.c
  229. > rm -f libreduce_exports.so.1.0.0 libreduce_exports.so libreduce_exports.so.1 libreduce_exports.so.1.0
  230. > g++ -Wl,-O1 -fuse-ld=gold -shared -Wl,-soname,libreduce_exports.so.1 -o libreduce_exports.so.1.0.0 fvisibility.o    
  231. > ln -s libreduce_exports.so.1.0.0 libreduce_exports.so
  232. > ln -s libreduce_exports.so.1.0.0 libreduce_exports.so.1
  233. > ln -s libreduce_exports.so.1.0.0 libreduce_exports.so.1.0
  234. test config.qtbase.tests.reduce_exports succeeded
  235. executing config test reduce_relocations
  236. + cd /home/kiosk/WEBKIT/qt-everywhere-opensource-src-5.9.1/build/config.tests/unix/reduce_relocs && /home/kiosk/WEBKIT/qt-everywhere-opensource-src-5.9.1/build/qtbase/bin/qmake "CONFIG -= qt debug_and_release app_bundle lib_bundle" "CONFIG += shared use_gold_linker console single_arch" /home/kiosk/WEBKIT/qt-everywhere-opensource-src-5.9.1/qtbase/config.tests/unix/reduce_relocs
  237. + cd /home/kiosk/WEBKIT/qt-everywhere-opensource-src-5.9.1/build/config.tests/unix/reduce_relocs && MAKEFLAGS= /usr/bin/make
  238. > gcc -c -pipe -O2 -Wall -W -fPIC  -I/home/kiosk/WEBKIT/qt-everywhere-opensource-src-5.9.1/qtbase/config.tests/unix/reduce_relocs -I. -I/home/kiosk/WEBKIT/qt-everywhere-opensource-src-5.9.1/qtbase/mkspecs/linux-g++ -o bsymbolic_functions.o /home/kiosk/WEBKIT/qt-everywhere-opensource-src-5.9.1/qtbase/config.tests/unix/reduce_relocs/bsymbolic_functions.c
  239. > rm -f libreduce_relocs.so.1.0.0 libreduce_relocs.so libreduce_relocs.so.1 libreduce_relocs.so.1.0
  240. > g++ -Wl,-O1 -fuse-ld=gold -shared -Wl,-Bsymbolic-functions -Wl,-soname,libreduce_relocs.so.1 -o libreduce_relocs.so.1.0.0 bsymbolic_functions.o    
  241. > ln -s libreduce_relocs.so.1.0.0 libreduce_relocs.so
  242. > ln -s libreduce_relocs.so.1.0.0 libreduce_relocs.so.1
  243. > ln -s libreduce_relocs.so.1.0.0 libreduce_relocs.so.1.0
  244. test config.qtbase.tests.reduce_relocations succeeded
  245. executing config test stl
  246. + cd /home/kiosk/WEBKIT/qt-everywhere-opensource-src-5.9.1/build/config.tests/unix/stl && /home/kiosk/WEBKIT/qt-everywhere-opensource-src-5.9.1/build/qtbase/bin/qmake "CONFIG -= qt debug_and_release app_bundle lib_bundle" "CONFIG += shared use_gold_linker console single_arch" /home/kiosk/WEBKIT/qt-everywhere-opensource-src-5.9.1/qtbase/config.tests/unix/stl
  247. + cd /home/kiosk/WEBKIT/qt-everywhere-opensource-src-5.9.1/build/config.tests/unix/stl && MAKEFLAGS= /usr/bin/make
  248. > g++ -c -pipe -O2 -Wall -W -fPIC  -I/home/kiosk/WEBKIT/qt-everywhere-opensource-src-5.9.1/qtbase/config.tests/unix/stl -I. -I/home/kiosk/WEBKIT/qt-everywhere-opensource-src-5.9.1/qtbase/mkspecs/linux-g++ -o stltest.o /home/kiosk/WEBKIT/qt-everywhere-opensource-src-5.9.1/qtbase/config.tests/unix/stl/stltest.cpp
  249. > /home/kiosk/WEBKIT/qt-everywhere-opensource-src-5.9.1/qtbase/config.tests/unix/stl/stltest.cpp: In function ‘int main()’:
  250. > /home/kiosk/WEBKIT/qt-everywhere-opensource-src-5.9.1/qtbase/config.tests/unix/stl/stltest.cpp:134:13: warning: variable ‘first’ set but not used [-Wunused-but-set-variable]
  251. >          int first = (*m1it).first;
  252. >              ^~~~~
  253. > /home/kiosk/WEBKIT/qt-everywhere-opensource-src-5.9.1/qtbase/config.tests/unix/stl/stltest.cpp:136:16: warning: variable ‘second’ set but not used [-Wunused-but-set-variable]
  254. >          double second = (*m1it).second;
  255. >                 ^~~~~~
  256. > /home/kiosk/WEBKIT/qt-everywhere-opensource-src-5.9.1/qtbase/config.tests/unix/stl/stltest.cpp:107:9: warning: variable ‘v1size’ set but not used [-Wunused-but-set-variable]
  257. >      int v1size = v1.size();
  258. >          ^~~~~~
  259. > /home/kiosk/WEBKIT/qt-everywhere-opensource-src-5.9.1/qtbase/config.tests/unix/stl/stltest.cpp:109:9: warning: variable ‘v1capacity’ set but not used [-Wunused-but-set-variable]
  260. >      int v1capacity = v1.capacity();
  261. >          ^~~~~~~~~~
  262. > /home/kiosk/WEBKIT/qt-everywhere-opensource-src-5.9.1/qtbase/config.tests/unix/stl/stltest.cpp:113:10: warning: variable ‘v1notfound’ set but not used [-Wunused-but-set-variable]
  263. >      bool v1notfound = (v1it == v1.end());
  264. >           ^~~~~~~~~~
  265. > /home/kiosk/WEBKIT/qt-everywhere-opensource-src-5.9.1/qtbase/config.tests/unix/stl/stltest.cpp:117:10: warning: variable ‘v1found’ set but not used [-Wunused-but-set-variable]
  266. >      bool v1found = (v1it != v1.end());
  267. >           ^~~~~~~
  268. > /home/kiosk/WEBKIT/qt-everywhere-opensource-src-5.9.1/qtbase/config.tests/unix/stl/stltest.cpp:122:9: warning: variable ‘v2size’ set but not used [-Wunused-but-set-variable]
  269. >      int v2size = v2.size();
  270. >          ^~~~~~
  271. > /home/kiosk/WEBKIT/qt-everywhere-opensource-src-5.9.1/qtbase/config.tests/unix/stl/stltest.cpp:130:9: warning: variable ‘m1size’ set but not used [-Wunused-but-set-variable]
  272. >      int m1size = m1.size();
  273. >          ^~~~~~
  274. > /home/kiosk/WEBKIT/qt-everywhere-opensource-src-5.9.1/qtbase/config.tests/unix/stl/stltest.cpp:140:9: warning: variable ‘m2size’ set but not used [-Wunused-but-set-variable]
  275. >      int m2size = m2.size();
  276. >          ^~~~~~
  277. > /home/kiosk/WEBKIT/qt-everywhere-opensource-src-5.9.1/qtbase/config.tests/unix/stl/stltest.cpp:144:9: warning: unused variable ‘n’ [-Wunused-variable]
  278. >      int n = std::distance(it1, it2);
  279. >          ^
  280. > g++ -Wl,-O1 -fuse-ld=gold -o stl stltest.o    
  281. test config.qtbase.tests.stl succeeded
  282. looking for library zlib
  283. Trying source 0 (type inline) of library zlib ...
  284.   => source failed condition 'config.msvc'.
  285. Trying source 1 (type inline) of library zlib ...
  286. + cd /home/kiosk/WEBKIT/qt-everywhere-opensource-src-5.9.1/build/config.tests/unix/zlib && /home/kiosk/WEBKIT/qt-everywhere-opensource-src-5.9.1/build/qtbase/bin/qmake "CONFIG -= qt debug_and_release app_bundle lib_bundle" "CONFIG += shared use_gold_linker console single_arch" 'LIBS += -lz' /home/kiosk/WEBKIT/qt-everywhere-opensource-src-5.9.1/qtbase/config.tests/unix/zlib
  287. + cd /home/kiosk/WEBKIT/qt-everywhere-opensource-src-5.9.1/build/config.tests/unix/zlib && MAKEFLAGS= /usr/bin/make
  288. > g++ -c -pipe -O2 -Wall -W -fPIC  -I/home/kiosk/WEBKIT/qt-everywhere-opensource-src-5.9.1/qtbase/config.tests/unix/zlib -I. -I/home/kiosk/WEBKIT/qt-everywhere-opensource-src-5.9.1/qtbase/mkspecs/linux-g++ -o zlib.o /home/kiosk/WEBKIT/qt-everywhere-opensource-src-5.9.1/qtbase/config.tests/unix/zlib/zlib.cpp
  289. > /home/kiosk/WEBKIT/qt-everywhere-opensource-src-5.9.1/qtbase/config.tests/unix/zlib/zlib.cpp: In function ‘int main(int, char**)’:
  290. > /home/kiosk/WEBKIT/qt-everywhere-opensource-src-5.9.1/qtbase/config.tests/unix/zlib/zlib.cpp:44:15: warning: variable ‘stream’ set but not used [-Wunused-but-set-variable]
  291. >      z_streamp stream;
  292. >                ^~~~~~
  293. > /home/kiosk/WEBKIT/qt-everywhere-opensource-src-5.9.1/qtbase/config.tests/unix/zlib/zlib.cpp:46:17: warning: variable ‘ver’ set but not used [-Wunused-but-set-variable]
  294. >      const char *ver = zlibVersion();
  295. >                  ^~~
  296. > /home/kiosk/WEBKIT/qt-everywhere-opensource-src-5.9.1/qtbase/config.tests/unix/zlib/zlib.cpp:49:9: warning: variable ‘res’ set but not used [-Wunused-but-set-variable]
  297. >      int res = compress2(0, 0, 0, 0, 1);
  298. >          ^~~
  299. > g++ -Wl,-O1 -fuse-ld=gold -o zlib zlib.o   -lz
  300.  => source accepted.
  301. test config.qtbase.libraries.zlib succeeded
  302. looking for library librt
  303. Trying source 0 (type inline) of library librt ...
  304. + cd /home/kiosk/WEBKIT/qt-everywhere-opensource-src-5.9.1/build/config.tests/unix/clock-gettime && /home/kiosk/WEBKIT/qt-everywhere-opensource-src-5.9.1/build/qtbase/bin/qmake "CONFIG -= qt debug_and_release app_bundle lib_bundle" "CONFIG += shared use_gold_linker console single_arch" /home/kiosk/WEBKIT/qt-everywhere-opensource-src-5.9.1/qtbase/config.tests/unix/clock-gettime
  305. + cd /home/kiosk/WEBKIT/qt-everywhere-opensource-src-5.9.1/build/config.tests/unix/clock-gettime && MAKEFLAGS= /usr/bin/make
  306. > g++ -c -pipe -O2 -Wall -W -fPIC  -I/home/kiosk/WEBKIT/qt-everywhere-opensource-src-5.9.1/qtbase/config.tests/unix/clock-gettime -I. -I/home/kiosk/WEBKIT/qt-everywhere-opensource-src-5.9.1/qtbase/mkspecs/linux-g++ -o clock-gettime.o /home/kiosk/WEBKIT/qt-everywhere-opensource-src-5.9.1/qtbase/config.tests/unix/clock-gettime/clock-gettime.cpp
  307. > g++ -Wl,-O1 -fuse-ld=gold -o clock-gettime clock-gettime.o    
  308.  => source accepted.
  309. test config.corelib.libraries.librt succeeded
  310. executing config test clock-monotonic
  311. + cd /home/kiosk/WEBKIT/qt-everywhere-opensource-src-5.9.1/build/config.tests/unix/clock-monotonic && /home/kiosk/WEBKIT/qt-everywhere-opensource-src-5.9.1/build/qtbase/bin/qmake "CONFIG -= qt debug_and_release app_bundle lib_bundle" "CONFIG += shared use_gold_linker console single_arch" /home/kiosk/WEBKIT/qt-everywhere-opensource-src-5.9.1/qtbase/config.tests/unix/clock-monotonic
  312. + cd /home/kiosk/WEBKIT/qt-everywhere-opensource-src-5.9.1/build/config.tests/unix/clock-monotonic && MAKEFLAGS= /usr/bin/make
  313. > g++ -c -pipe -O2 -Wall -W -fPIC  -I/home/kiosk/WEBKIT/qt-everywhere-opensource-src-5.9.1/qtbase/config.tests/unix/clock-monotonic -I. -I/home/kiosk/WEBKIT/qt-everywhere-opensource-src-5.9.1/qtbase/mkspecs/linux-g++ -o clock-monotonic.o /home/kiosk/WEBKIT/qt-everywhere-opensource-src-5.9.1/qtbase/config.tests/unix/clock-monotonic/clock-monotonic.cpp
  314. > g++ -Wl,-O1 -fuse-ld=gold -o clock-monotonic clock-monotonic.o    
  315. test config.corelib.tests.clock-monotonic succeeded
  316. looking for library libdl
  317. Trying source 0 (type inline) of library libdl ...
  318. + cd /home/kiosk/WEBKIT/qt-everywhere-opensource-src-5.9.1/build/config.tests/unix/dlopen && /home/kiosk/WEBKIT/qt-everywhere-opensource-src-5.9.1/build/qtbase/bin/qmake "CONFIG -= qt debug_and_release app_bundle lib_bundle" "CONFIG += shared use_gold_linker console single_arch" /home/kiosk/WEBKIT/qt-everywhere-opensource-src-5.9.1/qtbase/config.tests/unix/dlopen
  319. + cd /home/kiosk/WEBKIT/qt-everywhere-opensource-src-5.9.1/build/config.tests/unix/dlopen && MAKEFLAGS= /usr/bin/make
  320. > g++ -c -pipe -O2 -Wall -W -fPIC  -I/home/kiosk/WEBKIT/qt-everywhere-opensource-src-5.9.1/qtbase/config.tests/unix/dlopen -I. -I/home/kiosk/WEBKIT/qt-everywhere-opensource-src-5.9.1/qtbase/mkspecs/linux-g++ -o dlopen.o /home/kiosk/WEBKIT/qt-everywhere-opensource-src-5.9.1/qtbase/config.tests/unix/dlopen/dlopen.cpp
  321. > g++ -Wl,-O1 -fuse-ld=gold -o dlopen dlopen.o    
  322. > dlopen.o:dlopen.cpp:function main: error: undefined reference to 'dlopen'
  323. > collect2: error: ld returned 1 exit status
  324. > Makefile:66: ошибка выполнения рецепта для цели «dlopen»
  325. > make: *** [dlopen] Ошибка 1
  326.  => source failed verification.
  327. Trying source 1 (type inline) of library libdl ...
  328. + cd /home/kiosk/WEBKIT/qt-everywhere-opensource-src-5.9.1/build/config.tests/unix/dlopen && /home/kiosk/WEBKIT/qt-everywhere-opensource-src-5.9.1/build/qtbase/bin/qmake "CONFIG -= qt debug_and_release app_bundle lib_bundle" "CONFIG += shared use_gold_linker console single_arch" 'LIBS += -ldl' /home/kiosk/WEBKIT/qt-everywhere-opensource-src-5.9.1/qtbase/config.tests/unix/dlopen
  329. + cd /home/kiosk/WEBKIT/qt-everywhere-opensource-src-5.9.1/build/config.tests/unix/dlopen && MAKEFLAGS= /usr/bin/make clean && MAKEFLAGS= /usr/bin/make
  330. > rm -f dlopen.o
  331. > rm -f *~ core *.core
  332. > g++ -c -pipe -O2 -Wall -W -fPIC  -I/home/kiosk/WEBKIT/qt-everywhere-opensource-src-5.9.1/qtbase/config.tests/unix/dlopen -I. -I/home/kiosk/WEBKIT/qt-everywhere-opensource-src-5.9.1/qtbase/mkspecs/linux-g++ -o dlopen.o /home/kiosk/WEBKIT/qt-everywhere-opensource-src-5.9.1/qtbase/config.tests/unix/dlopen/dlopen.cpp
  333. > g++ -Wl,-O1 -fuse-ld=gold -o dlopen dlopen.o   -ldl
  334.  => source accepted.
  335. test config.corelib.libraries.libdl succeeded
  336. executing config test eventfd
  337. + cd /home/kiosk/WEBKIT/qt-everywhere-opensource-src-5.9.1/build/config.tests/unix/eventfd && /home/kiosk/WEBKIT/qt-everywhere-opensource-src-5.9.1/build/qtbase/bin/qmake "CONFIG -= qt debug_and_release app_bundle lib_bundle" "CONFIG += shared use_gold_linker console single_arch" /home/kiosk/WEBKIT/qt-everywhere-opensource-src-5.9.1/qtbase/config.tests/unix/eventfd
  338. + cd /home/kiosk/WEBKIT/qt-everywhere-opensource-src-5.9.1/build/config.tests/unix/eventfd && MAKEFLAGS= /usr/bin/make
  339. > g++ -c -pipe -O2 -Wall -W -fPIC  -I/home/kiosk/WEBKIT/qt-everywhere-opensource-src-5.9.1/qtbase/config.tests/unix/eventfd -I. -I/home/kiosk/WEBKIT/qt-everywhere-opensource-src-5.9.1/qtbase/mkspecs/linux-g++ -o main.o /home/kiosk/WEBKIT/qt-everywhere-opensource-src-5.9.1/qtbase/config.tests/unix/eventfd/main.cpp
  340. > g++ -Wl,-O1 -fuse-ld=gold -o eventfd main.o    
  341. test config.corelib.tests.eventfd succeeded
  342. looking for library glib
  343. Trying source 0 (type pkgConfig) of library glib ...
  344. + /usr/bin/pkg-config --exists --silence-errors glib-2.0 gthread-2.0
  345. pkg-config did not find package.
  346.   => source produced no result.
  347. test config.corelib.libraries.glib FAILED
  348. executing config test posix-iconv
  349. + cd /home/kiosk/WEBKIT/qt-everywhere-opensource-src-5.9.1/build/config.tests/unix/iconv && /home/kiosk/WEBKIT/qt-everywhere-opensource-src-5.9.1/build/qtbase/bin/qmake "CONFIG -= qt debug_and_release app_bundle lib_bundle" "CONFIG += shared use_gold_linker console single_arch" /home/kiosk/WEBKIT/qt-everywhere-opensource-src-5.9.1/qtbase/config.tests/unix/iconv
  350. + cd /home/kiosk/WEBKIT/qt-everywhere-opensource-src-5.9.1/build/config.tests/unix/iconv && MAKEFLAGS= /usr/bin/make
  351. > g++ -c -pipe -O2 -Wall -W -fPIC  -I/home/kiosk/WEBKIT/qt-everywhere-opensource-src-5.9.1/qtbase/config.tests/unix/iconv -I. -I/home/kiosk/WEBKIT/qt-everywhere-opensource-src-5.9.1/qtbase/mkspecs/linux-g++ -o iconv.o /home/kiosk/WEBKIT/qt-everywhere-opensource-src-5.9.1/qtbase/config.tests/unix/iconv/iconv.cpp
  352. > g++ -Wl,-O1 -fuse-ld=gold -o iconv iconv.o    
  353. test config.corelib.tests.posix-iconv succeeded
  354. looking for library icu
  355. Trying source 0 (type inline) of library icu ...
  356.   => source failed condition 'config.win32 && !features.shared'.
  357. Trying source 1 (type inline) of library icu ...
  358.   => source failed condition 'config.win32 && features.shared'.
  359. Trying source 2 (type inline) of library icu ...
  360. + cd /home/kiosk/WEBKIT/qt-everywhere-opensource-src-5.9.1/build/config.tests/unix/icu && /home/kiosk/WEBKIT/qt-everywhere-opensource-src-5.9.1/build/qtbase/bin/qmake "CONFIG -= qt debug_and_release app_bundle lib_bundle" "CONFIG += shared use_gold_linker console single_arch" 'LIBS += -licui18n -licuuc -licudata' 'LIBS += -ldl' /home/kiosk/WEBKIT/qt-everywhere-opensource-src-5.9.1/qtbase/config.tests/unix/icu
  361. + cd /home/kiosk/WEBKIT/qt-everywhere-opensource-src-5.9.1/build/config.tests/unix/icu && MAKEFLAGS= /usr/bin/make
  362. > g++ -c -pipe -O2 -Wall -W -fPIC  -I/home/kiosk/WEBKIT/qt-everywhere-opensource-src-5.9.1/qtbase/config.tests/unix/icu -I. -I/home/kiosk/WEBKIT/qt-everywhere-opensource-src-5.9.1/qtbase/mkspecs/linux-g++ -o icu.o /home/kiosk/WEBKIT/qt-everywhere-opensource-src-5.9.1/qtbase/config.tests/unix/icu/icu.cpp
  363. > g++ -Wl,-O1 -fuse-ld=gold -o icu icu.o   -licui18n -licuuc -licudata -ldl
  364.  => source accepted.
  365. test config.corelib.libraries.icu succeeded
  366. executing config test inotify
  367. + cd /home/kiosk/WEBKIT/qt-everywhere-opensource-src-5.9.1/build/config.tests/unix/inotify && /home/kiosk/WEBKIT/qt-everywhere-opensource-src-5.9.1/build/qtbase/bin/qmake "CONFIG -= qt debug_and_release app_bundle lib_bundle" "CONFIG += shared use_gold_linker console single_arch" /home/kiosk/WEBKIT/qt-everywhere-opensource-src-5.9.1/qtbase/config.tests/unix/inotify
  368. + cd /home/kiosk/WEBKIT/qt-everywhere-opensource-src-5.9.1/build/config.tests/unix/inotify && MAKEFLAGS= /usr/bin/make
  369. > g++ -c -pipe -O2 -Wall -W -fPIC  -I/home/kiosk/WEBKIT/qt-everywhere-opensource-src-5.9.1/qtbase/config.tests/unix/inotify -I. -I/home/kiosk/WEBKIT/qt-everywhere-opensource-src-5.9.1/qtbase/mkspecs/linux-g++ -o inotifytest.o /home/kiosk/WEBKIT/qt-everywhere-opensource-src-5.9.1/qtbase/config.tests/unix/inotify/inotifytest.cpp
  370. > g++ -Wl,-O1 -fuse-ld=gold -o inotify inotifytest.o    
  371. test config.corelib.tests.inotify succeeded
  372. executing config test ipc_sysv
  373. + cd /home/kiosk/WEBKIT/qt-everywhere-opensource-src-5.9.1/build/config.tests/unix/ipc_sysv && /home/kiosk/WEBKIT/qt-everywhere-opensource-src-5.9.1/build/qtbase/bin/qmake "CONFIG -= qt debug_and_release app_bundle lib_bundle" "CONFIG += shared use_gold_linker console single_arch" /home/kiosk/WEBKIT/qt-everywhere-opensource-src-5.9.1/qtbase/config.tests/unix/ipc_sysv
  374. + cd /home/kiosk/WEBKIT/qt-everywhere-opensource-src-5.9.1/build/config.tests/unix/ipc_sysv && MAKEFLAGS= /usr/bin/make
  375. > g++ -c -pipe -O2 -Wall -W -fPIC  -I/home/kiosk/WEBKIT/qt-everywhere-opensource-src-5.9.1/qtbase/config.tests/unix/ipc_sysv -I. -I/home/kiosk/WEBKIT/qt-everywhere-opensource-src-5.9.1/qtbase/mkspecs/linux-g++ -o ipc.o /home/kiosk/WEBKIT/qt-everywhere-opensource-src-5.9.1/qtbase/config.tests/unix/ipc_sysv/ipc.cpp
  376. > g++ -Wl,-O1 -fuse-ld=gold -o ipc_sysv ipc.o    
  377. test config.corelib.tests.ipc_sysv succeeded
  378. executing config test atomic64
  379. + cd /home/kiosk/WEBKIT/qt-everywhere-opensource-src-5.9.1/build/config.tests/common/atomic64 && /home/kiosk/WEBKIT/qt-everywhere-opensource-src-5.9.1/build/qtbase/bin/qmake "CONFIG -= qt debug_and_release app_bundle lib_bundle" "CONFIG += shared use_gold_linker console single_arch" /home/kiosk/WEBKIT/qt-everywhere-opensource-src-5.9.1/qtbase/config.tests/common/atomic64
  380. + cd /home/kiosk/WEBKIT/qt-everywhere-opensource-src-5.9.1/build/config.tests/common/atomic64 && MAKEFLAGS= /usr/bin/make
  381. > g++ -c -pipe -O2 -std=gnu++11 -Wall -W -fPIC  -I/home/kiosk/WEBKIT/qt-everywhere-opensource-src-5.9.1/qtbase/config.tests/common/atomic64 -I. -I/home/kiosk/WEBKIT/qt-everywhere-opensource-src-5.9.1/qtbase/mkspecs/linux-g++ -o atomic64.o /home/kiosk/WEBKIT/qt-everywhere-opensource-src-5.9.1/qtbase/config.tests/common/atomic64/atomic64.cpp
  382. > g++ -Wl,-O1 -fuse-ld=gold -o atomic64 atomic64.o    
  383. test config.corelib.tests.atomic64 succeeded
  384. executing config test ppoll
  385. + cd /home/kiosk/WEBKIT/qt-everywhere-opensource-src-5.9.1/build/config.tests/unix/ppoll && /home/kiosk/WEBKIT/qt-everywhere-opensource-src-5.9.1/build/qtbase/bin/qmake "CONFIG -= qt debug_and_release app_bundle lib_bundle" "CONFIG += shared use_gold_linker console single_arch" /home/kiosk/WEBKIT/qt-everywhere-opensource-src-5.9.1/qtbase/config.tests/unix/ppoll
  386. + cd /home/kiosk/WEBKIT/qt-everywhere-opensource-src-5.9.1/build/config.tests/unix/ppoll && MAKEFLAGS= /usr/bin/make
  387. > g++ -c -pipe -O2 -Wall -W -fPIC  -I/home/kiosk/WEBKIT/qt-everywhere-opensource-src-5.9.1/qtbase/config.tests/unix/ppoll -I. -I/home/kiosk/WEBKIT/qt-everywhere-opensource-src-5.9.1/qtbase/mkspecs/linux-g++ -o ppoll.o /home/kiosk/WEBKIT/qt-everywhere-opensource-src-5.9.1/qtbase/config.tests/unix/ppoll/ppoll.cpp
  388. > g++ -Wl,-O1 -fuse-ld=gold -o ppoll ppoll.o    
  389. test config.corelib.tests.ppoll succeeded
  390. looking for library slog2
  391. Trying source 0 (type inline) of library slog2 ...
  392. + cd /home/kiosk/WEBKIT/qt-everywhere-opensource-src-5.9.1/build/config.tests/unix/slog2 && /home/kiosk/WEBKIT/qt-everywhere-opensource-src-5.9.1/build/qtbase/bin/qmake "CONFIG -= qt debug_and_release app_bundle lib_bundle" "CONFIG += shared use_gold_linker console single_arch" 'LIBS += -lslog2' /home/kiosk/WEBKIT/qt-everywhere-opensource-src-5.9.1/qtbase/config.tests/unix/slog2
  393. + cd /home/kiosk/WEBKIT/qt-everywhere-opensource-src-5.9.1/build/config.tests/unix/slog2 && MAKEFLAGS= /usr/bin/make
  394. > g++ -c -pipe -O2 -Wall -W -fPIC  -I/home/kiosk/WEBKIT/qt-everywhere-opensource-src-5.9.1/qtbase/config.tests/unix/slog2 -I. -I/home/kiosk/WEBKIT/qt-everywhere-opensource-src-5.9.1/qtbase/mkspecs/linux-g++ -o slog2.o /home/kiosk/WEBKIT/qt-everywhere-opensource-src-5.9.1/qtbase/config.tests/unix/slog2/slog2.cpp
  395. > /home/kiosk/WEBKIT/qt-everywhere-opensource-src-5.9.1/qtbase/config.tests/unix/slog2/slog2.cpp:40:19: fatal error: slog2.h: Нет такого файла или каталога
  396. >  #include <slog2.h>
  397. >                    ^
  398. > compilation terminated.
  399. > Makefile:170: ошибка выполнения рецепта для цели «slog2.o»
  400. > make: *** [slog2.o] Ошибка 1
  401.  => source failed verification.
  402. test config.corelib.libraries.slog2 FAILED
  403. looking for library doubleconversion
  404. Trying source 0 (type inline) of library doubleconversion ...
  405. + cd /home/kiosk/WEBKIT/qt-everywhere-opensource-src-5.9.1/build/config.tests/unix/doubleconversion && /home/kiosk/WEBKIT/qt-everywhere-opensource-src-5.9.1/build/qtbase/bin/qmake "CONFIG -= qt debug_and_release app_bundle lib_bundle" "CONFIG += shared use_gold_linker console single_arch" 'LIBS += -ldouble-conversion' /home/kiosk/WEBKIT/qt-everywhere-opensource-src-5.9.1/qtbase/config.tests/unix/doubleconversion
  406. + cd /home/kiosk/WEBKIT/qt-everywhere-opensource-src-5.9.1/build/config.tests/unix/doubleconversion && MAKEFLAGS= /usr/bin/make
  407. > g++ -c -pipe -O2 -Wall -W -fPIC  -I/home/kiosk/WEBKIT/qt-everywhere-opensource-src-5.9.1/qtbase/config.tests/unix/doubleconversion -I. -I/home/kiosk/WEBKIT/qt-everywhere-opensource-src-5.9.1/qtbase/mkspecs/linux-g++ -o doubleconversion.o /home/kiosk/WEBKIT/qt-everywhere-opensource-src-5.9.1/qtbase/config.tests/unix/doubleconversion/doubleconversion.cpp
  408. > /home/kiosk/WEBKIT/qt-everywhere-opensource-src-5.9.1/qtbase/config.tests/unix/doubleconversion/doubleconversion.cpp:40:49: fatal error: double-conversion/double-conversion.h: Нет такого файла или каталога
  409. >  #include <double-conversion/double-conversion.h>
  410. >                                                  ^
  411. > compilation terminated.
  412. > Makefile:170: ошибка выполнения рецепта для цели «doubleconversion.o»
  413. > make: *** [doubleconversion.o] Ошибка 1
  414.  => source failed verification.
  415. test config.corelib.libraries.doubleconversion FAILED
  416. looking for library pcre2
  417. Trying source 0 (type inline) of library pcre2 ...
  418. + cd /home/kiosk/WEBKIT/qt-everywhere-opensource-src-5.9.1/build/config.tests/unix/pcre2 && /home/kiosk/WEBKIT/qt-everywhere-opensource-src-5.9.1/build/qtbase/bin/qmake "CONFIG -= qt debug_and_release app_bundle lib_bundle" "CONFIG += shared use_gold_linker console single_arch" 'LIBS += -lpcre2-16' /home/kiosk/WEBKIT/qt-everywhere-opensource-src-5.9.1/qtbase/config.tests/unix/pcre2
  419. + cd /home/kiosk/WEBKIT/qt-everywhere-opensource-src-5.9.1/build/config.tests/unix/pcre2 && MAKEFLAGS= /usr/bin/make
  420. > g++ -c -pipe -O2 -Wall -W -fPIC  -I/home/kiosk/WEBKIT/qt-everywhere-opensource-src-5.9.1/qtbase/config.tests/unix/pcre2 -I. -I/home/kiosk/WEBKIT/qt-everywhere-opensource-src-5.9.1/qtbase/mkspecs/linux-g++ -o pcre2.o /home/kiosk/WEBKIT/qt-everywhere-opensource-src-5.9.1/qtbase/config.tests/unix/pcre2/pcre2.cpp
  421. > /home/kiosk/WEBKIT/qt-everywhere-opensource-src-5.9.1/qtbase/config.tests/unix/pcre2/pcre2.cpp:42:19: fatal error: pcre2.h: Нет такого файла или каталога
  422. >  #include <pcre2.h>
  423. >                    ^
  424. > compilation terminated.
  425. > Makefile:170: ошибка выполнения рецепта для цели «pcre2.o»
  426. > make: *** [pcre2.o] Ошибка 1
  427.  => source failed verification.
  428. test config.corelib.libraries.pcre2 FAILED
  429. executing config test cloexec
  430. + cd /home/kiosk/WEBKIT/qt-everywhere-opensource-src-5.9.1/build/config.tests/unix/cloexec && /home/kiosk/WEBKIT/qt-everywhere-opensource-src-5.9.1/build/qtbase/bin/qmake "CONFIG -= qt debug_and_release app_bundle lib_bundle" "CONFIG += shared use_gold_linker console single_arch" /home/kiosk/WEBKIT/qt-everywhere-opensource-src-5.9.1/qtbase/config.tests/unix/cloexec
  431. + cd /home/kiosk/WEBKIT/qt-everywhere-opensource-src-5.9.1/build/config.tests/unix/cloexec && MAKEFLAGS= /usr/bin/make
  432. > g++ -c -pipe -O2 -Wall -W -fPIC  -I/home/kiosk/WEBKIT/qt-everywhere-opensource-src-5.9.1/qtbase/config.tests/unix/cloexec -I. -I/home/kiosk/WEBKIT/qt-everywhere-opensource-src-5.9.1/qtbase/mkspecs/linux-g++ -o cloexec.o /home/kiosk/WEBKIT/qt-everywhere-opensource-src-5.9.1/qtbase/config.tests/unix/cloexec/cloexec.cpp
  433. > /home/kiosk/WEBKIT/qt-everywhere-opensource-src-5.9.1/qtbase/config.tests/unix/cloexec/cloexec.cpp: In function ‘int main()’:
  434. > /home/kiosk/WEBKIT/qt-everywhere-opensource-src-5.9.1/qtbase/config.tests/unix/cloexec/cloexec.cpp:50:48: warning: ignoring return value of ‘int pipe2(int*, int)’, declared with attribute warn_unused_result [-Wunused-result]
  435. >      (void) pipe2(pipes, O_CLOEXEC | O_NONBLOCK);
  436. >                                                 ^
  437. > g++ -Wl,-O1 -fuse-ld=gold -o cloexec cloexec.o    
  438. test config.corelib.tests.cloexec succeeded
  439. executing config test atomicfptr
  440. + cd /home/kiosk/WEBKIT/qt-everywhere-opensource-src-5.9.1/build/config.tests/common/atomicfptr && /home/kiosk/WEBKIT/qt-everywhere-opensource-src-5.9.1/build/qtbase/bin/qmake "CONFIG -= qt debug_and_release app_bundle lib_bundle" "CONFIG += shared use_gold_linker console single_arch" /home/kiosk/WEBKIT/qt-everywhere-opensource-src-5.9.1/qtbase/config.tests/common/atomicfptr
  441. + cd /home/kiosk/WEBKIT/qt-everywhere-opensource-src-5.9.1/build/config.tests/common/atomicfptr && MAKEFLAGS= /usr/bin/make
  442. > g++ -c -pipe -O2 -std=gnu++11 -Wall -W -fPIC  -I/home/kiosk/WEBKIT/qt-everywhere-opensource-src-5.9.1/qtbase/config.tests/common/atomicfptr -I. -I/home/kiosk/WEBKIT/qt-everywhere-opensource-src-5.9.1/qtbase/mkspecs/linux-g++ -o atomicfptr.o /home/kiosk/WEBKIT/qt-everywhere-opensource-src-5.9.1/qtbase/config.tests/common/atomicfptr/atomicfptr.cpp
  443. > g++ -Wl,-O1 -fuse-ld=gold -o atomicfptr atomicfptr.o    
  444. test config.corelib.tests.atomicfptr succeeded
  445. Trying source 0 (type makeSpec) of library network ...
  446.  => source accepted.
  447. executing config test getaddrinfo
  448. + cd /home/kiosk/WEBKIT/qt-everywhere-opensource-src-5.9.1/build/config.tests/unix/getaddrinfo && /home/kiosk/WEBKIT/qt-everywhere-opensource-src-5.9.1/build/qtbase/bin/qmake "CONFIG -= qt debug_and_release app_bundle lib_bundle" "CONFIG += shared use_gold_linker console single_arch" /home/kiosk/WEBKIT/qt-everywhere-opensource-src-5.9.1/qtbase/config.tests/unix/getaddrinfo
  449. + cd /home/kiosk/WEBKIT/qt-everywhere-opensource-src-5.9.1/build/config.tests/unix/getaddrinfo && MAKEFLAGS= /usr/bin/make
  450. > g++ -c -pipe -O2 -Wall -W -fPIC  -I/home/kiosk/WEBKIT/qt-everywhere-opensource-src-5.9.1/qtbase/config.tests/unix/getaddrinfo -I. -I/home/kiosk/WEBKIT/qt-everywhere-opensource-src-5.9.1/qtbase/mkspecs/linux-g++ -o getaddrinfotest.o /home/kiosk/WEBKIT/qt-everywhere-opensource-src-5.9.1/qtbase/config.tests/unix/getaddrinfo/getaddrinfotest.cpp
  451. > g++ -Wl,-O1 -fuse-ld=gold -o getaddrinfo getaddrinfotest.o    
  452. test config.network.tests.getaddrinfo succeeded
  453. executing config test getifaddrs
  454. + cd /home/kiosk/WEBKIT/qt-everywhere-opensource-src-5.9.1/build/config.tests/unix/getifaddrs && /home/kiosk/WEBKIT/qt-everywhere-opensource-src-5.9.1/build/qtbase/bin/qmake "CONFIG -= qt debug_and_release app_bundle lib_bundle" "CONFIG += shared use_gold_linker console single_arch" /home/kiosk/WEBKIT/qt-everywhere-opensource-src-5.9.1/qtbase/config.tests/unix/getifaddrs
  455. + cd /home/kiosk/WEBKIT/qt-everywhere-opensource-src-5.9.1/build/config.tests/unix/getifaddrs && MAKEFLAGS= /usr/bin/make
  456. > g++ -c -pipe -O2 -Wall -W -fPIC  -I/home/kiosk/WEBKIT/qt-everywhere-opensource-src-5.9.1/qtbase/config.tests/unix/getifaddrs -I. -I/home/kiosk/WEBKIT/qt-everywhere-opensource-src-5.9.1/qtbase/mkspecs/linux-g++ -o getifaddrs.o /home/kiosk/WEBKIT/qt-everywhere-opensource-src-5.9.1/qtbase/config.tests/unix/getifaddrs/getifaddrs.cpp
  457. > g++ -Wl,-O1 -fuse-ld=gold -o getifaddrs getifaddrs.o    
  458. test config.network.tests.getifaddrs succeeded
  459. executing config test ipv6ifname
  460. + cd /home/kiosk/WEBKIT/qt-everywhere-opensource-src-5.9.1/build/config.tests/unix/ipv6ifname && /home/kiosk/WEBKIT/qt-everywhere-opensource-src-5.9.1/build/qtbase/bin/qmake "CONFIG -= qt debug_and_release app_bundle lib_bundle" "CONFIG += shared use_gold_linker console single_arch" /home/kiosk/WEBKIT/qt-everywhere-opensource-src-5.9.1/qtbase/config.tests/unix/ipv6ifname
  461. + cd /home/kiosk/WEBKIT/qt-everywhere-opensource-src-5.9.1/build/config.tests/unix/ipv6ifname && MAKEFLAGS= /usr/bin/make
  462. > g++ -c -pipe -O2 -Wall -W -fPIC  -I/home/kiosk/WEBKIT/qt-everywhere-opensource-src-5.9.1/qtbase/config.tests/unix/ipv6ifname -I. -I/home/kiosk/WEBKIT/qt-everywhere-opensource-src-5.9.1/qtbase/mkspecs/linux-g++ -o ipv6ifname.o /home/kiosk/WEBKIT/qt-everywhere-opensource-src-5.9.1/qtbase/config.tests/unix/ipv6ifname/ipv6ifname.cpp
  463. > g++ -Wl,-O1 -fuse-ld=gold -o ipv6ifname ipv6ifname.o    
  464. test config.network.tests.ipv6ifname succeeded
  465. looking for library openssl_headers
  466. Trying source 0 (type inline) of library openssl_headers ...
  467. + cd /home/kiosk/WEBKIT/qt-everywhere-opensource-src-5.9.1/build/config.tests/unix/openssl && /home/kiosk/WEBKIT/qt-everywhere-opensource-src-5.9.1/build/qtbase/bin/qmake "CONFIG -= qt debug_and_release app_bundle lib_bundle" "CONFIG += shared use_gold_linker console single_arch" /home/kiosk/WEBKIT/qt-everywhere-opensource-src-5.9.1/qtbase/config.tests/unix/openssl
  468. + cd /home/kiosk/WEBKIT/qt-everywhere-opensource-src-5.9.1/build/config.tests/unix/openssl && MAKEFLAGS= /usr/bin/make
  469. > g++ -c -pipe -O2 -Wall -W -fPIC  -I/home/kiosk/WEBKIT/qt-everywhere-opensource-src-5.9.1/qtbase/config.tests/unix/openssl -I. -I/home/kiosk/WEBKIT/qt-everywhere-opensource-src-5.9.1/qtbase/mkspecs/linux-g++ -o openssl.o /home/kiosk/WEBKIT/qt-everywhere-opensource-src-5.9.1/qtbase/config.tests/unix/openssl/openssl.cpp
  470. > g++ -Wl,-O1 -fuse-ld=gold -o openssl openssl.o    
  471.  => source accepted.
  472. test config.network.libraries.openssl_headers succeeded
  473. looking for library xcb
  474. Trying source 0 (type pkgConfig) of library xcb ...
  475. + /usr/bin/pkg-config --exists --silence-errors xcb '>=' 1.5
  476. + /usr/bin/pkg-config --modversion xcb '>=' 1.5
  477. > 1.11.1
  478. + /usr/bin/pkg-config --libs-only-L xcb '>=' 1.5
  479. + /usr/bin/pkg-config --libs-only-l xcb '>=' 1.5
  480. > -lxcb
  481. + /usr/bin/pkg-config --cflags xcb '>=' 1.5
  482. + cd /home/kiosk/WEBKIT/qt-everywhere-opensource-src-5.9.1/build/config.tests/qpa/xcb && /home/kiosk/WEBKIT/qt-everywhere-opensource-src-5.9.1/build/qtbase/bin/qmake "CONFIG -= qt debug_and_release app_bundle lib_bundle" "CONFIG += shared use_gold_linker console single_arch" 'LIBS += -lxcb' /home/kiosk/WEBKIT/qt-everywhere-opensource-src-5.9.1/qtbase/config.tests/qpa/xcb
  483. + cd /home/kiosk/WEBKIT/qt-everywhere-opensource-src-5.9.1/build/config.tests/qpa/xcb && MAKEFLAGS= /usr/bin/make
  484. > g++ -c -pipe -O2 -Wall -W -fPIC  -I/home/kiosk/WEBKIT/qt-everywhere-opensource-src-5.9.1/qtbase/config.tests/qpa/xcb -I. -I/home/kiosk/WEBKIT/qt-everywhere-opensource-src-5.9.1/qtbase/mkspecs/linux-g++ -o xcb.o /home/kiosk/WEBKIT/qt-everywhere-opensource-src-5.9.1/qtbase/config.tests/qpa/xcb/xcb.cpp
  485. > /home/kiosk/WEBKIT/qt-everywhere-opensource-src-5.9.1/qtbase/config.tests/qpa/xcb/xcb.cpp: In function ‘int main(int, char**)’:
  486. > /home/kiosk/WEBKIT/qt-everywhere-opensource-src-5.9.1/qtbase/config.tests/qpa/xcb/xcb.cpp:45:23: warning: unused variable ‘t’ [-Wunused-variable]
  487. >      xcb_connection_t *t = xcb_connect("", &primaryScreen);
  488. >                        ^
  489. > /home/kiosk/WEBKIT/qt-everywhere-opensource-src-5.9.1/qtbase/config.tests/qpa/xcb/xcb.cpp:48:9: warning: unused variable ‘xcbAtomPrimary’ [-Wunused-variable]
  490. >      int xcbAtomPrimary = XCB_ATOM_PRIMARY;
  491. >          ^~~~~~~~~~~~~~
  492. > g++ -Wl,-O1 -fuse-ld=gold -o xcb xcb.o   -lxcb
  493.  => source accepted.
  494. test config.gui.libraries.xcb succeeded
  495. looking for library opengl
  496. Trying source 0 (type pkgConfig) of library opengl ...
  497. + /usr/bin/pkg-config --exists --silence-errors gl
  498. + /usr/bin/pkg-config --modversion gl
  499. > 11.2.0
  500. + /usr/bin/pkg-config --libs-only-L gl
  501. + /usr/bin/pkg-config --libs-only-l gl
  502. > -lGL
  503. + /usr/bin/pkg-config --cflags gl
  504. > -I/usr/include/libdrm
  505. + cd /home/kiosk/WEBKIT/qt-everywhere-opensource-src-5.9.1/build/config.tests/unix/opengldesktop && /home/kiosk/WEBKIT/qt-everywhere-opensource-src-5.9.1/build/qtbase/bin/qmake "CONFIG -= qt debug_and_release app_bundle lib_bundle" "CONFIG += shared use_gold_linker console single_arch" 'LIBS += -lGL' 'QMAKE_CFLAGS += -I/usr/include/libdrm' 'QMAKE_CXXFLAGS += -I/usr/include/libdrm' /home/kiosk/WEBKIT/qt-everywhere-opensource-src-5.9.1/qtbase/config.tests/unix/opengldesktop
  506. + cd /home/kiosk/WEBKIT/qt-everywhere-opensource-src-5.9.1/build/config.tests/unix/opengldesktop && MAKEFLAGS= /usr/bin/make
  507. > g++ -c -pipe -I/usr/include/libdrm -O2 -Wall -W -fPIC  -I/home/kiosk/WEBKIT/qt-everywhere-opensource-src-5.9.1/qtbase/config.tests/unix/opengldesktop -I. -I/home/kiosk/WEBKIT/qt-everywhere-opensource-src-5.9.1/qtbase/mkspecs/linux-g++ -o opengldesktop.o /home/kiosk/WEBKIT/qt-everywhere-opensource-src-5.9.1/qtbase/config.tests/unix/opengldesktop/opengldesktop.cpp
  508. > g++ -Wl,-O1 -fuse-ld=gold -o opengldesktop opengldesktop.o   -lGL
  509.  => source accepted.
  510. test config.gui.libraries.opengl succeeded
  511. looking for library egl
  512. Trying source 0 (type pkgConfig) of library egl ...
  513. + /usr/bin/pkg-config --exists --silence-errors egl
  514. + /usr/bin/pkg-config --modversion egl
  515. > 11.2.0
  516. + /usr/bin/pkg-config --libs-only-L egl
  517. + /usr/bin/pkg-config --libs-only-l egl
  518. > -lEGL
  519. + /usr/bin/pkg-config --cflags egl
  520. > -I/usr/include/libdrm
  521. + cd /home/kiosk/WEBKIT/qt-everywhere-opensource-src-5.9.1/build/config.tests/qpa/egl && /home/kiosk/WEBKIT/qt-everywhere-opensource-src-5.9.1/build/qtbase/bin/qmake "CONFIG -= qt debug_and_release app_bundle lib_bundle" "CONFIG += shared use_gold_linker console single_arch" 'LIBS += -lEGL' 'QMAKE_CFLAGS += -I/usr/include/libdrm' 'QMAKE_CXXFLAGS += -I/usr/include/libdrm' /home/kiosk/WEBKIT/qt-everywhere-opensource-src-5.9.1/qtbase/config.tests/qpa/egl
  522. + cd /home/kiosk/WEBKIT/qt-everywhere-opensource-src-5.9.1/build/config.tests/qpa/egl && MAKEFLAGS= /usr/bin/make
  523. > g++ -c -pipe -I/usr/include/libdrm -O2 -Wall -W -fPIC  -I/home/kiosk/WEBKIT/qt-everywhere-opensource-src-5.9.1/qtbase/config.tests/qpa/egl -I. -I/home/kiosk/WEBKIT/qt-everywhere-opensource-src-5.9.1/qtbase/mkspecs/linux-g++ -o egl.o /home/kiosk/WEBKIT/qt-everywhere-opensource-src-5.9.1/qtbase/config.tests/qpa/egl/egl.cpp
  524. > /home/kiosk/WEBKIT/qt-everywhere-opensource-src-5.9.1/qtbase/config.tests/qpa/egl/egl.cpp: In function ‘int main(int, char**)’:
  525. > /home/kiosk/WEBKIT/qt-everywhere-opensource-src-5.9.1/qtbase/config.tests/qpa/egl/egl.cpp:44:12: warning: unused variable ‘x’ [-Wunused-variable]
  526. >      EGLint x = 0;
  527. >             ^
  528. > g++ -Wl,-O1 -fuse-ld=gold -o egl egl.o   -lEGL
  529.  => source accepted.
  530. test config.gui.libraries.egl succeeded
  531. looking for library xcb_xlib
  532. Trying source 0 (type pkgConfig) of library xcb_xlib ...
  533. + /usr/bin/pkg-config --exists --silence-errors X11-xcb x11 xcb
  534. pkg-config did not find package.
  535.   => source produced no result.
  536. Trying source 1 (type inline) of library xcb_xlib ...
  537. + cd /home/kiosk/WEBKIT/qt-everywhere-opensource-src-5.9.1/build/config.tests/qpa/xcb-xlib && /home/kiosk/WEBKIT/qt-everywhere-opensource-src-5.9.1/build/qtbase/bin/qmake "CONFIG -= qt debug_and_release app_bundle lib_bundle" "CONFIG += shared use_gold_linker console single_arch" 'LIBS += -lxcb -lX11 -lX11-xcb' /home/kiosk/WEBKIT/qt-everywhere-opensource-src-5.9.1/qtbase/config.tests/qpa/xcb-xlib
  538. + cd /home/kiosk/WEBKIT/qt-everywhere-opensource-src-5.9.1/build/config.tests/qpa/xcb-xlib && MAKEFLAGS= /usr/bin/make
  539. > g++ -c -pipe -O2 -Wall -W -fPIC  -I/home/kiosk/WEBKIT/qt-everywhere-opensource-src-5.9.1/qtbase/config.tests/qpa/xcb-xlib -I. -I/home/kiosk/WEBKIT/qt-everywhere-opensource-src-5.9.1/qtbase/mkspecs/linux-g++ -o xcb-xlib.o /home/kiosk/WEBKIT/qt-everywhere-opensource-src-5.9.1/qtbase/config.tests/qpa/xcb-xlib/xcb-xlib.cpp
  540. > /home/kiosk/WEBKIT/qt-everywhere-opensource-src-5.9.1/qtbase/config.tests/qpa/xcb-xlib/xcb-xlib.cpp: In function ‘int main(int, char**)’:
  541. > /home/kiosk/WEBKIT/qt-everywhere-opensource-src-5.9.1/qtbase/config.tests/qpa/xcb-xlib/xcb-xlib.cpp:47:23: warning: unused variable ‘connection’ [-Wunused-variable]
  542. >      xcb_connection_t *connection =  XGetXCBConnection(dpy);
  543. >                        ^~~~~~~~~~
  544. > g++ -Wl,-O1 -fuse-ld=gold -o xcb-xlib xcb-xlib.o   -lxcb -lX11 -lX11-xcb
  545.  => source accepted.
  546. test config.gui.libraries.xcb_xlib succeeded
  547. executing config test egl-x11
  548. + cd /home/kiosk/WEBKIT/qt-everywhere-opensource-src-5.9.1/build/config.tests/qpa/egl-x11 && /home/kiosk/WEBKIT/qt-everywhere-opensource-src-5.9.1/build/qtbase/bin/qmake "CONFIG -= qt debug_and_release app_bundle lib_bundle" "CONFIG += shared use_gold_linker console single_arch" 'LIBS += -lEGL' 'QMAKE_CFLAGS += -I/usr/include/libdrm' 'QMAKE_CXXFLAGS += -I/usr/include/libdrm' 'LIBS += -lxcb -lX11 -lX11-xcb' /home/kiosk/WEBKIT/qt-everywhere-opensource-src-5.9.1/qtbase/config.tests/qpa/egl-x11
  549. + cd /home/kiosk/WEBKIT/qt-everywhere-opensource-src-5.9.1/build/config.tests/qpa/egl-x11 && MAKEFLAGS= /usr/bin/make
  550. > g++ -c -pipe -I/usr/include/libdrm -O2 -Wall -W -fPIC  -I/home/kiosk/WEBKIT/qt-everywhere-opensource-src-5.9.1/qtbase/config.tests/qpa/egl-x11 -I. -I/home/kiosk/WEBKIT/qt-everywhere-opensource-src-5.9.1/qtbase/mkspecs/linux-g++ -o egl-x11.o /home/kiosk/WEBKIT/qt-everywhere-opensource-src-5.9.1/qtbase/config.tests/qpa/egl-x11/egl-x11.cpp
  551. > g++ -Wl,-O1 -fuse-ld=gold -o egl-x11 egl-x11.o   -lEGL -lxcb -lX11 -lX11-xcb
  552. test config.gui.tests.egl-x11 succeeded
  553. Trying source 0 (type inline) of library bcm_host ...
  554.  => source accepted.
  555. executing config test egl-brcm
  556. + cd /home/kiosk/WEBKIT/qt-everywhere-opensource-src-5.9.1/build/config.tests/qpa/eglfs-brcm && /home/kiosk/WEBKIT/qt-everywhere-opensource-src-5.9.1/build/qtbase/bin/qmake "CONFIG -= qt debug_and_release app_bundle lib_bundle" "CONFIG += shared use_gold_linker console single_arch" 'LIBS += -lEGL' 'QMAKE_CFLAGS += -I/usr/include/libdrm' 'QMAKE_CXXFLAGS += -I/usr/include/libdrm' 'LIBS += -lbcm_host' /home/kiosk/WEBKIT/qt-everywhere-opensource-src-5.9.1/qtbase/config.tests/qpa/eglfs-brcm
  557. + cd /home/kiosk/WEBKIT/qt-everywhere-opensource-src-5.9.1/build/config.tests/qpa/eglfs-brcm && MAKEFLAGS= /usr/bin/make
  558. > g++ -c -pipe -I/usr/include/libdrm -O2 -Wall -W -fPIC  -I/home/kiosk/WEBKIT/qt-everywhere-opensource-src-5.9.1/qtbase/config.tests/qpa/eglfs-brcm -I. -I/home/kiosk/WEBKIT/qt-everywhere-opensource-src-5.9.1/qtbase/mkspecs/linux-g++ -o eglfs-brcm.o /home/kiosk/WEBKIT/qt-everywhere-opensource-src-5.9.1/qtbase/config.tests/qpa/eglfs-brcm/eglfs-brcm.cpp
  559. > /home/kiosk/WEBKIT/qt-everywhere-opensource-src-5.9.1/qtbase/config.tests/qpa/eglfs-brcm/eglfs-brcm.cpp:41:22: fatal error: bcm_host.h: Нет такого файла или каталога
  560. >  #include <bcm_host.h>
  561. >                       ^
  562. > compilation terminated.
  563. > Makefile:170: ошибка выполнения рецепта для цели «eglfs-brcm.o»
  564. > make: *** [eglfs-brcm.o] Ошибка 1
  565. test config.gui.tests.egl-brcm FAILED
  566. executing config test egl-egldevice
  567. + cd /home/kiosk/WEBKIT/qt-everywhere-opensource-src-5.9.1/build/config.tests/qpa/eglfs-egldevice && /home/kiosk/WEBKIT/qt-everywhere-opensource-src-5.9.1/build/qtbase/bin/qmake "CONFIG -= qt debug_and_release app_bundle lib_bundle" "CONFIG += shared use_gold_linker console single_arch" 'LIBS += -lEGL' 'QMAKE_CFLAGS += -I/usr/include/libdrm' 'QMAKE_CXXFLAGS += -I/usr/include/libdrm' /home/kiosk/WEBKIT/qt-everywhere-opensource-src-5.9.1/qtbase/config.tests/qpa/eglfs-egldevice
  568. + cd /home/kiosk/WEBKIT/qt-everywhere-opensource-src-5.9.1/build/config.tests/qpa/eglfs-egldevice && MAKEFLAGS= /usr/bin/make
  569. > g++ -c -pipe -I/usr/include/libdrm -O2 -Wall -W -fPIC  -I/home/kiosk/WEBKIT/qt-everywhere-opensource-src-5.9.1/qtbase/config.tests/qpa/eglfs-egldevice -I. -I/home/kiosk/WEBKIT/qt-everywhere-opensource-src-5.9.1/qtbase/mkspecs/linux-g++ -o eglfs-egldevice.o /home/kiosk/WEBKIT/qt-everywhere-opensource-src-5.9.1/qtbase/config.tests/qpa/eglfs-egldevice/eglfs-egldevice.cpp
  570. > /home/kiosk/WEBKIT/qt-everywhere-opensource-src-5.9.1/qtbase/config.tests/qpa/eglfs-egldevice/eglfs-egldevice.cpp: In function ‘int main(int, char**)’:
  571. > /home/kiosk/WEBKIT/qt-everywhere-opensource-src-5.9.1/qtbase/config.tests/qpa/eglfs-egldevice/eglfs-egldevice.cpp:45:18: warning: unused variable ‘device’ [-Wunused-variable]
  572. >      EGLDeviceEXT device = 0;
  573. >                   ^~~~~~
  574. > /home/kiosk/WEBKIT/qt-everywhere-opensource-src-5.9.1/qtbase/config.tests/qpa/eglfs-egldevice/eglfs-egldevice.cpp:46:18: warning: unused variable ‘stream’ [-Wunused-variable]
  575. >      EGLStreamKHR stream = 0;
  576. >                   ^~~~~~
  577. > /home/kiosk/WEBKIT/qt-everywhere-opensource-src-5.9.1/qtbase/config.tests/qpa/eglfs-egldevice/eglfs-egldevice.cpp:47:23: warning: unused variable ‘layer’ [-Wunused-variable]
  578. >      EGLOutputLayerEXT layer = 0;
  579. >                        ^~~~~
  580. > g++ -Wl,-O1 -fuse-ld=gold -o eglfs-egldevice eglfs-egldevice.o   -lEGL
  581. test config.gui.tests.egl-egldevice succeeded
  582. looking for library drm
  583. Trying source 0 (type pkgConfig) of library drm ...
  584. + /usr/bin/pkg-config --exists --silence-errors libdrm
  585. + /usr/bin/pkg-config --modversion libdrm
  586. > 2.4.67
  587. + /usr/bin/pkg-config --libs-only-L libdrm
  588. + /usr/bin/pkg-config --libs-only-l libdrm
  589. > -ldrm
  590. + /usr/bin/pkg-config --cflags libdrm
  591. > -I/usr/include/libdrm
  592. + cd /home/kiosk/WEBKIT/qt-everywhere-opensource-src-5.9.1/build/config.tests/qpa/kms && /home/kiosk/WEBKIT/qt-everywhere-opensource-src-5.9.1/build/qtbase/bin/qmake "CONFIG -= qt debug_and_release app_bundle lib_bundle" "CONFIG += shared use_gold_linker console single_arch" 'LIBS += -ldrm' 'QMAKE_CFLAGS += -I/usr/include/libdrm' 'QMAKE_CXXFLAGS += -I/usr/include/libdrm' /home/kiosk/WEBKIT/qt-everywhere-opensource-src-5.9.1/qtbase/config.tests/qpa/kms
  593. + cd /home/kiosk/WEBKIT/qt-everywhere-opensource-src-5.9.1/build/config.tests/qpa/kms && MAKEFLAGS= /usr/bin/make
  594. > g++ -c -pipe -I/usr/include/libdrm -O2 -Wall -W -fPIC  -I/home/kiosk/WEBKIT/qt-everywhere-opensource-src-5.9.1/qtbase/config.tests/qpa/kms -I. -I/home/kiosk/WEBKIT/qt-everywhere-opensource-src-5.9.1/qtbase/mkspecs/linux-g++ -o kms.o /home/kiosk/WEBKIT/qt-everywhere-opensource-src-5.9.1/qtbase/config.tests/qpa/kms/kms.cpp
  595. > /home/kiosk/WEBKIT/qt-everywhere-opensource-src-5.9.1/qtbase/config.tests/qpa/kms/kms.cpp: In function ‘int main(int, char**)’:
  596. > /home/kiosk/WEBKIT/qt-everywhere-opensource-src-5.9.1/qtbase/config.tests/qpa/kms/kms.cpp:49:20: warning: unused variable ‘currentMode’ [-Wunused-variable]
  597. >      drmModeCrtcPtr currentMode = drmModeGetCrtc(0, 0);
  598. >                     ^~~~~~~~~~~
  599. > g++ -Wl,-O1 -fuse-ld=gold -o kms kms.o   -ldrm
  600.  => source accepted.
  601. test config.gui.libraries.drm succeeded
  602. looking for library gbm
  603. Trying source 0 (type pkgConfig) of library gbm ...
  604. + /usr/bin/pkg-config --exists --silence-errors gbm
  605. pkg-config did not find package.
  606.   => source produced no result.
  607. test config.gui.libraries.gbm FAILED
  608. executing config test egl-mali
  609. + cd /home/kiosk/WEBKIT/qt-everywhere-opensource-src-5.9.1/build/config.tests/qpa/eglfs-mali && /home/kiosk/WEBKIT/qt-everywhere-opensource-src-5.9.1/build/qtbase/bin/qmake "CONFIG -= qt debug_and_release app_bundle lib_bundle" "CONFIG += shared use_gold_linker console single_arch" 'LIBS += -lEGL' 'QMAKE_CFLAGS += -I/usr/include/libdrm' 'QMAKE_CXXFLAGS += -I/usr/include/libdrm' /home/kiosk/WEBKIT/qt-everywhere-opensource-src-5.9.1/qtbase/config.tests/qpa/eglfs-mali
  610. + cd /home/kiosk/WEBKIT/qt-everywhere-opensource-src-5.9.1/build/config.tests/qpa/eglfs-mali && MAKEFLAGS= /usr/bin/make
  611. > g++ -c -pipe -I/usr/include/libdrm -O2 -Wall -W -fPIC  -I/home/kiosk/WEBKIT/qt-everywhere-opensource-src-5.9.1/qtbase/config.tests/qpa/eglfs-mali -I. -I/home/kiosk/WEBKIT/qt-everywhere-opensource-src-5.9.1/qtbase/mkspecs/linux-g++ -o eglfs-mali.o /home/kiosk/WEBKIT/qt-everywhere-opensource-src-5.9.1/qtbase/config.tests/qpa/eglfs-mali/eglfs-mali.cpp
  612. > /home/kiosk/WEBKIT/qt-everywhere-opensource-src-5.9.1/qtbase/config.tests/qpa/eglfs-mali/eglfs-mali.cpp:40:30: fatal error: EGL/fbdev_window.h: Нет такого файла или каталога
  613. >  #include <EGL/fbdev_window.h>
  614. >                               ^
  615. > compilation terminated.
  616. > Makefile:170: ошибка выполнения рецепта для цели «eglfs-mali.o»
  617. > make: *** [eglfs-mali.o] Ошибка 1
  618. test config.gui.tests.egl-mali FAILED
  619. executing config test egl-mali-2
  620. + cd /home/kiosk/WEBKIT/qt-everywhere-opensource-src-5.9.1/build/config.tests/qpa/eglfs-mali-2 && /home/kiosk/WEBKIT/qt-everywhere-opensource-src-5.9.1/build/qtbase/bin/qmake "CONFIG -= qt debug_and_release app_bundle lib_bundle" "CONFIG += shared use_gold_linker console single_arch" 'LIBS += -lEGL' 'QMAKE_CFLAGS += -I/usr/include/libdrm' 'QMAKE_CXXFLAGS += -I/usr/include/libdrm' /home/kiosk/WEBKIT/qt-everywhere-opensource-src-5.9.1/qtbase/config.tests/qpa/eglfs-mali-2
  621. + cd /home/kiosk/WEBKIT/qt-everywhere-opensource-src-5.9.1/build/config.tests/qpa/eglfs-mali-2 && MAKEFLAGS= /usr/bin/make
  622. > g++ -c -pipe -I/usr/include/libdrm -O2 -Wall -W -fPIC  -I/home/kiosk/WEBKIT/qt-everywhere-opensource-src-5.9.1/qtbase/config.tests/qpa/eglfs-mali-2 -I. -I/home/kiosk/WEBKIT/qt-everywhere-opensource-src-5.9.1/qtbase/mkspecs/linux-g++ -o eglfs-mali-2.o /home/kiosk/WEBKIT/qt-everywhere-opensource-src-5.9.1/qtbase/config.tests/qpa/eglfs-mali-2/eglfs-mali-2.cpp
  623. > /home/kiosk/WEBKIT/qt-everywhere-opensource-src-5.9.1/qtbase/config.tests/qpa/eglfs-mali-2/eglfs-mali-2.cpp: In function ‘int main(int, char**)’:
  624. > /home/kiosk/WEBKIT/qt-everywhere-opensource-src-5.9.1/qtbase/config.tests/qpa/eglfs-mali-2/eglfs-mali-2.cpp:47:5: error: ‘mali_native_window’ was not declared in this scope
  625. >      mali_native_window *w = 0;
  626. >      ^~~~~~~~~~~~~~~~~~
  627. > /home/kiosk/WEBKIT/qt-everywhere-opensource-src-5.9.1/qtbase/config.tests/qpa/eglfs-mali-2/eglfs-mali-2.cpp:47:25: error: ‘w’ was not declared in this scope
  628. >      mali_native_window *w = 0;
  629. >                          ^
  630. > Makefile:170: ошибка выполнения рецепта для цели «eglfs-mali-2.o»
  631. > make: *** [eglfs-mali-2.o] Ошибка 1
  632. test config.gui.tests.egl-mali-2 FAILED
  633. executing config test egl-viv
  634. + cd /home/kiosk/WEBKIT/qt-everywhere-opensource-src-5.9.1/build/config.tests/qpa/eglfs-viv && /home/kiosk/WEBKIT/qt-everywhere-opensource-src-5.9.1/build/qtbase/bin/qmake "CONFIG -= qt debug_and_release app_bundle lib_bundle" "CONFIG += shared use_gold_linker console single_arch" 'LIBS += -lEGL' 'QMAKE_CFLAGS += -I/usr/include/libdrm' 'QMAKE_CXXFLAGS += -I/usr/include/libdrm' /home/kiosk/WEBKIT/qt-everywhere-opensource-src-5.9.1/qtbase/config.tests/qpa/eglfs-viv
  635. + cd /home/kiosk/WEBKIT/qt-everywhere-opensource-src-5.9.1/build/config.tests/qpa/eglfs-viv && MAKEFLAGS= /usr/bin/make
  636. > g++ -c -pipe -I/usr/include/libdrm -O2 -Wall -W -fPIC -DLINUX=1 -DEGL_API_FB=1 -I/home/kiosk/WEBKIT/qt-everywhere-opensource-src-5.9.1/qtbase/config.tests/qpa/eglfs-viv -I. -I/home/kiosk/WEBKIT/qt-everywhere-opensource-src-5.9.1/qtbase/mkspecs/linux-g++ -o eglfs-viv.o /home/kiosk/WEBKIT/qt-everywhere-opensource-src-5.9.1/qtbase/config.tests/qpa/eglfs-viv/eglfs-viv.cpp
  637. > /home/kiosk/WEBKIT/qt-everywhere-opensource-src-5.9.1/qtbase/config.tests/qpa/eglfs-viv/eglfs-viv.cpp:41:28: fatal error: EGL/eglvivante.h: Нет такого файла или каталога
  638. >  #include <EGL/eglvivante.h>
  639. >                             ^
  640. > compilation terminated.
  641. > Makefile:170: ошибка выполнения рецепта для цели «eglfs-viv.o»
  642. > make: *** [eglfs-viv.o] Ошибка 1
  643. test config.gui.tests.egl-viv FAILED
  644. executing config test evdev
  645. + cd /home/kiosk/WEBKIT/qt-everywhere-opensource-src-5.9.1/build/config.tests/unix/evdev && /home/kiosk/WEBKIT/qt-everywhere-opensource-src-5.9.1/build/qtbase/bin/qmake "CONFIG -= qt debug_and_release app_bundle lib_bundle" "CONFIG += shared use_gold_linker console single_arch" /home/kiosk/WEBKIT/qt-everywhere-opensource-src-5.9.1/qtbase/config.tests/unix/evdev
  646. + cd /home/kiosk/WEBKIT/qt-everywhere-opensource-src-5.9.1/build/config.tests/unix/evdev && MAKEFLAGS= /usr/bin/make
  647. > g++ -c -pipe -O2 -Wall -W -fPIC  -I/home/kiosk/WEBKIT/qt-everywhere-opensource-src-5.9.1/qtbase/config.tests/unix/evdev -I. -I/home/kiosk/WEBKIT/qt-everywhere-opensource-src-5.9.1/qtbase/mkspecs/linux-g++ -o evdev.o /home/kiosk/WEBKIT/qt-everywhere-opensource-src-5.9.1/qtbase/config.tests/unix/evdev/evdev.cpp
  648. > g++ -Wl,-O1 -fuse-ld=gold -o evdev evdev.o    
  649. test config.gui.tests.evdev succeeded
  650. looking for library freetype
  651. Trying source 0 (type pkgConfig) of library freetype ...
  652. + /usr/bin/pkg-config --exists --silence-errors freetype2
  653. + /usr/bin/pkg-config --modversion freetype2
  654. > 18.1.12
  655. + /usr/bin/pkg-config --libs-only-L freetype2
  656. + /usr/bin/pkg-config --libs-only-l freetype2
  657. > -lfreetype
  658. + /usr/bin/pkg-config --cflags freetype2
  659. > -I/usr/include/freetype2
  660. + cd /home/kiosk/WEBKIT/qt-everywhere-opensource-src-5.9.1/build/config.tests/unix/freetype && /home/kiosk/WEBKIT/qt-everywhere-opensource-src-5.9.1/build/qtbase/bin/qmake "CONFIG -= qt debug_and_release app_bundle lib_bundle" "CONFIG += shared use_gold_linker console single_arch" 'LIBS += -lfreetype' 'QMAKE_CFLAGS += -I/usr/include/freetype2' 'QMAKE_CXXFLAGS += -I/usr/include/freetype2' /home/kiosk/WEBKIT/qt-everywhere-opensource-src-5.9.1/qtbase/config.tests/unix/freetype
  661. + cd /home/kiosk/WEBKIT/qt-everywhere-opensource-src-5.9.1/build/config.tests/unix/freetype && MAKEFLAGS= /usr/bin/make
  662. > g++ -c -pipe -I/usr/include/freetype2 -O2 -Wall -W -fPIC  -I/home/kiosk/WEBKIT/qt-everywhere-opensource-src-5.9.1/qtbase/config.tests/unix/freetype -I. -I/home/kiosk/WEBKIT/qt-everywhere-opensource-src-5.9.1/qtbase/mkspecs/linux-g++ -o freetype.o /home/kiosk/WEBKIT/qt-everywhere-opensource-src-5.9.1/qtbase/config.tests/unix/freetype/freetype.cpp
  663. > /home/kiosk/WEBKIT/qt-everywhere-opensource-src-5.9.1/qtbase/config.tests/unix/freetype/freetype.cpp: In function ‘int main(int, char**)’:
  664. > /home/kiosk/WEBKIT/qt-everywhere-opensource-src-5.9.1/qtbase/config.tests/unix/freetype/freetype.cpp:49:13: warning: variable ‘face’ set but not used [-Wunused-but-set-variable]
  665. >      FT_Face face;
  666. >              ^~~~
  667. > g++ -Wl,-O1 -fuse-ld=gold -o freetype freetype.o   -lfreetype
  668.  => source accepted.
  669. test config.gui.libraries.freetype succeeded
  670. looking for library fontconfig
  671. Trying source 0 (type pkgConfig) of library fontconfig ...
  672. + /usr/bin/pkg-config --exists --silence-errors fontconfig freetype2
  673. + /usr/bin/pkg-config --modversion fontconfig freetype2
  674. > 2.11.94
  675. > 18.1.12
  676. + /usr/bin/pkg-config --libs-only-L fontconfig freetype2
  677. + /usr/bin/pkg-config --libs-only-l fontconfig freetype2
  678. > -lfontconfig -lfreetype
  679. + /usr/bin/pkg-config --cflags fontconfig freetype2
  680. > -I/usr/include/freetype2
  681. + cd /home/kiosk/WEBKIT/qt-everywhere-opensource-src-5.9.1/build/config.tests/unix/fontconfig && /home/kiosk/WEBKIT/qt-everywhere-opensource-src-5.9.1/build/qtbase/bin/qmake "CONFIG -= qt debug_and_release app_bundle lib_bundle" "CONFIG += shared use_gold_linker console single_arch" 'LIBS += -lfontconfig -lfreetype' 'QMAKE_CFLAGS += -I/usr/include/freetype2' 'QMAKE_CXXFLAGS += -I/usr/include/freetype2' /home/kiosk/WEBKIT/qt-everywhere-opensource-src-5.9.1/qtbase/config.tests/unix/fontconfig
  682. + cd /home/kiosk/WEBKIT/qt-everywhere-opensource-src-5.9.1/build/config.tests/unix/fontconfig && MAKEFLAGS= /usr/bin/make
  683. > g++ -c -pipe -I/usr/include/freetype2 -O2 -Wall -W -fPIC  -I/home/kiosk/WEBKIT/qt-everywhere-opensource-src-5.9.1/qtbase/config.tests/unix/fontconfig -I. -I/home/kiosk/WEBKIT/qt-everywhere-opensource-src-5.9.1/qtbase/mkspecs/linux-g++ -o fontconfig.o /home/kiosk/WEBKIT/qt-everywhere-opensource-src-5.9.1/qtbase/config.tests/unix/fontconfig/fontconfig.cpp
  684. > /home/kiosk/WEBKIT/qt-everywhere-opensource-src-5.9.1/qtbase/config.tests/unix/fontconfig/fontconfig.cpp: In function ‘int main(int, char**)’:
  685. > /home/kiosk/WEBKIT/qt-everywhere-opensource-src-5.9.1/qtbase/config.tests/unix/fontconfig/fontconfig.cpp:54:13: warning: variable ‘face’ set but not used [-Wunused-but-set-variable]
  686. >      FT_Face face;
  687. >              ^~~~
  688. > /home/kiosk/WEBKIT/qt-everywhere-opensource-src-5.9.1/qtbase/config.tests/unix/fontconfig/fontconfig.cpp:56:16: warning: variable ‘pattern’ set but not used [-Wunused-but-set-variable]
  689. >      FcPattern *pattern;
  690. >                 ^~~~~~~
  691. > g++ -Wl,-O1 -fuse-ld=gold -o fontconfig fontconfig.o   -lfontconfig -lfreetype
  692.  => source accepted.
  693. test config.gui.libraries.fontconfig succeeded
  694. looking for library libinput
  695. Trying source 0 (type pkgConfig) of library libinput ...
  696. + /usr/bin/pkg-config --exists --silence-errors libinput
  697. pkg-config did not find package.
  698.   => source produced no result.
  699. test config.gui.libraries.libinput FAILED
  700. executing config test linuxfb
  701. + cd /home/kiosk/WEBKIT/qt-everywhere-opensource-src-5.9.1/build/config.tests/qpa/linuxfb && /home/kiosk/WEBKIT/qt-everywhere-opensource-src-5.9.1/build/qtbase/bin/qmake "CONFIG -= qt debug_and_release app_bundle lib_bundle" "CONFIG += shared use_gold_linker console single_arch" /home/kiosk/WEBKIT/qt-everywhere-opensource-src-5.9.1/qtbase/config.tests/qpa/linuxfb
  702. + cd /home/kiosk/WEBKIT/qt-everywhere-opensource-src-5.9.1/build/config.tests/qpa/linuxfb && MAKEFLAGS= /usr/bin/make
  703. > g++ -c -pipe -O2 -Wall -W -fPIC  -I/home/kiosk/WEBKIT/qt-everywhere-opensource-src-5.9.1/qtbase/config.tests/qpa/linuxfb -I. -I/home/kiosk/WEBKIT/qt-everywhere-opensource-src-5.9.1/qtbase/mkspecs/linux-g++ -o linuxfb.o /home/kiosk/WEBKIT/qt-everywhere-opensource-src-5.9.1/qtbase/config.tests/qpa/linuxfb/linuxfb.cpp
  704. > g++ -Wl,-O1 -fuse-ld=gold -o linuxfb linuxfb.o    
  705. test config.gui.tests.linuxfb succeeded
  706. looking for library mtdev
  707. Trying source 0 (type pkgConfig) of library mtdev ...
  708. + /usr/bin/pkg-config --exists --silence-errors mtdev
  709. pkg-config did not find package.
  710.   => source produced no result.
  711. test config.gui.libraries.mtdev FAILED
  712. looking for library openvg
  713. Trying source 0 (type pkgConfig) of library openvg ...
  714. + /usr/bin/pkg-config --exists --silence-errors vg
  715. pkg-config did not find package.
  716.   => source produced no result.
  717. Trying source 1 (type makeSpec) of library openvg ...
  718. + cd /home/kiosk/WEBKIT/qt-everywhere-opensource-src-5.9.1/build/config.tests/unix/openvg && /home/kiosk/WEBKIT/qt-everywhere-opensource-src-5.9.1/build/qtbase/bin/qmake "CONFIG -= qt debug_and_release app_bundle lib_bundle" "CONFIG += shared use_gold_linker console single_arch" 'LIBS += -lOpenVG' /home/kiosk/WEBKIT/qt-everywhere-opensource-src-5.9.1/qtbase/config.tests/unix/openvg
  719. + cd /home/kiosk/WEBKIT/qt-everywhere-opensource-src-5.9.1/build/config.tests/unix/openvg && MAKEFLAGS= /usr/bin/make
  720. > g++ -c -pipe -O2 -Wall -W -fPIC  -I/home/kiosk/WEBKIT/qt-everywhere-opensource-src-5.9.1/qtbase/config.tests/unix/openvg -I. -I/home/kiosk/WEBKIT/qt-everywhere-opensource-src-5.9.1/qtbase/mkspecs/linux-g++ -o openvg.o /home/kiosk/WEBKIT/qt-everywhere-opensource-src-5.9.1/qtbase/config.tests/unix/openvg/openvg.cpp
  721. > /home/kiosk/WEBKIT/qt-everywhere-opensource-src-5.9.1/qtbase/config.tests/unix/openvg/openvg.cpp:40:23: fatal error: VG/openvg.h: Нет такого файла или каталога
  722. >  #include <VG/openvg.h>
  723. >                        ^
  724. > compilation terminated.
  725. > Makefile:170: ошибка выполнения рецепта для цели «openvg.o»
  726. > make: *** [openvg.o] Ошибка 1
  727.  => source failed verification.
  728. test config.gui.libraries.openvg FAILED
  729. executing config test qpa_default_platform
  730. test config.gui.tests.qpa_default_platform gave result xcb
  731. looking for library harfbuzz
  732. Trying source 0 (type inline) of library harfbuzz ...
  733. + cd /home/kiosk/WEBKIT/qt-everywhere-opensource-src-5.9.1/build/config.tests/unix/harfbuzz && /home/kiosk/WEBKIT/qt-everywhere-opensource-src-5.9.1/build/qtbase/bin/qmake "CONFIG -= qt debug_and_release app_bundle lib_bundle" "CONFIG += shared use_gold_linker console single_arch" 'LIBS += -lharfbuzz' /home/kiosk/WEBKIT/qt-everywhere-opensource-src-5.9.1/qtbase/config.tests/unix/harfbuzz
  734. + cd /home/kiosk/WEBKIT/qt-everywhere-opensource-src-5.9.1/build/config.tests/unix/harfbuzz && MAKEFLAGS= /usr/bin/make
  735. > g++ -c -pipe -O2 -Wall -W -fPIC  -I/home/kiosk/WEBKIT/qt-everywhere-opensource-src-5.9.1/qtbase/config.tests/unix/harfbuzz -I. -I/home/kiosk/WEBKIT/qt-everywhere-opensource-src-5.9.1/qtbase/mkspecs/linux-g++ -o harfbuzz.o /home/kiosk/WEBKIT/qt-everywhere-opensource-src-5.9.1/qtbase/config.tests/unix/harfbuzz/harfbuzz.cpp
  736. > /home/kiosk/WEBKIT/qt-everywhere-opensource-src-5.9.1/qtbase/config.tests/unix/harfbuzz/harfbuzz.cpp:40:25: fatal error: harfbuzz/hb.h: Нет такого файла или каталога
  737. >  #include <harfbuzz/hb.h>
  738. >                          ^
  739. > compilation terminated.
  740. > Makefile:170: ошибка выполнения рецепта для цели «harfbuzz.o»
  741. > make: *** [harfbuzz.o] Ошибка 1
  742.  => source failed verification.
  743. test config.gui.libraries.harfbuzz FAILED
  744. looking for library libjpeg
  745. Trying source 0 (type inline) of library libjpeg ...
  746.   => source failed condition 'config.msvc'.
  747. Trying source 1 (type inline) of library libjpeg ...
  748. + cd /home/kiosk/WEBKIT/qt-everywhere-opensource-src-5.9.1/build/config.tests/unix/libjpeg && /home/kiosk/WEBKIT/qt-everywhere-opensource-src-5.9.1/build/qtbase/bin/qmake "CONFIG -= qt debug_and_release app_bundle lib_bundle" "CONFIG += shared use_gold_linker console single_arch" 'LIBS += -ljpeg' /home/kiosk/WEBKIT/qt-everywhere-opensource-src-5.9.1/qtbase/config.tests/unix/libjpeg
  749. + cd /home/kiosk/WEBKIT/qt-everywhere-opensource-src-5.9.1/build/config.tests/unix/libjpeg && MAKEFLAGS= /usr/bin/make
  750. > g++ -c -pipe -O2 -Wall -W -fPIC  -I/home/kiosk/WEBKIT/qt-everywhere-opensource-src-5.9.1/qtbase/config.tests/unix/libjpeg -I. -I/home/kiosk/WEBKIT/qt-everywhere-opensource-src-5.9.1/qtbase/mkspecs/linux-g++ -o libjpeg.o /home/kiosk/WEBKIT/qt-everywhere-opensource-src-5.9.1/qtbase/config.tests/unix/libjpeg/libjpeg.cpp
  751. > /home/kiosk/WEBKIT/qt-everywhere-opensource-src-5.9.1/qtbase/config.tests/unix/libjpeg/libjpeg.cpp:43:21: fatal error: jpeglib.h: Нет такого файла или каталога
  752. >  #include <jpeglib.h>
  753. >                      ^
  754. > compilation terminated.
  755. > Makefile:170: ошибка выполнения рецепта для цели «libjpeg.o»
  756. > make: *** [libjpeg.o] Ошибка 1
  757.  => source failed verification.
  758. test config.gui.libraries.libjpeg FAILED
  759. looking for library libpng
  760. Trying source 0 (type pkgConfig) of library libpng ...
  761. + /usr/bin/pkg-config --exists --silence-errors libpng
  762. + /usr/bin/pkg-config --modversion libpng
  763. > 1.2.54
  764. + /usr/bin/pkg-config --libs-only-L libpng
  765. + /usr/bin/pkg-config --libs-only-l libpng
  766. > -lpng12
  767. + /usr/bin/pkg-config --cflags libpng
  768. > -I/usr/include/libpng12
  769. + cd /home/kiosk/WEBKIT/qt-everywhere-opensource-src-5.9.1/build/config.tests/unix/libpng && /home/kiosk/WEBKIT/qt-everywhere-opensource-src-5.9.1/build/qtbase/bin/qmake "CONFIG -= qt debug_and_release app_bundle lib_bundle" "CONFIG += shared use_gold_linker console single_arch" 'LIBS += -lpng12' 'QMAKE_CFLAGS += -I/usr/include/libpng12' 'QMAKE_CXXFLAGS += -I/usr/include/libpng12' 'LIBS += -lz' /home/kiosk/WEBKIT/qt-everywhere-opensource-src-5.9.1/qtbase/config.tests/unix/libpng
  770. + cd /home/kiosk/WEBKIT/qt-everywhere-opensource-src-5.9.1/build/config.tests/unix/libpng && MAKEFLAGS= /usr/bin/make
  771. > g++ -c -pipe -I/usr/include/libpng12 -O2 -Wall -W -fPIC  -I/home/kiosk/WEBKIT/qt-everywhere-opensource-src-5.9.1/qtbase/config.tests/unix/libpng -I. -I/home/kiosk/WEBKIT/qt-everywhere-opensource-src-5.9.1/qtbase/mkspecs/linux-g++ -o libpng.o /home/kiosk/WEBKIT/qt-everywhere-opensource-src-5.9.1/qtbase/config.tests/unix/libpng/libpng.cpp
  772. > /home/kiosk/WEBKIT/qt-everywhere-opensource-src-5.9.1/qtbase/config.tests/unix/libpng/libpng.cpp: In function ‘int main(int, char**)’:
  773. > /home/kiosk/WEBKIT/qt-everywhere-opensource-src-5.9.1/qtbase/config.tests/unix/libpng/libpng.cpp:48:17: warning: variable ‘png_ptr’ set but not used [-Wunused-but-set-variable]
  774. >      png_structp png_ptr;
  775. >                  ^~~~~~~
  776. > g++ -Wl,-O1 -fuse-ld=gold -o libpng libpng.o   -lpng12 -lz
  777.  => source accepted.
  778. test config.gui.libraries.libpng succeeded
  779. looking for library xcb_syslibs
  780. Trying source 0 (type pkgConfig) of library xcb_syslibs ...
  781. + /usr/bin/pkg-config --exists --silence-errors xcb xcb-shm xcb-sync xcb-xfixes xcb-randr xcb-image xcb-keysyms xcb-icccm xcb-shape
  782. + /usr/bin/pkg-config --modversion xcb xcb-shm xcb-sync xcb-xfixes xcb-randr xcb-image xcb-keysyms xcb-icccm xcb-shape
  783. > 1.11.1
  784. > 1.11.1
  785. > 1.11.1
  786. > 1.11.1
  787. > 1.11.1
  788. > 0.4.0
  789. > 0.4.0
  790. > 0.4.1
  791. > 1.11.1
  792. + /usr/bin/pkg-config --libs-only-L xcb xcb-shm xcb-sync xcb-xfixes xcb-randr xcb-image xcb-keysyms xcb-icccm xcb-shape
  793. + /usr/bin/pkg-config --libs-only-l xcb xcb-shm xcb-sync xcb-xfixes xcb-randr xcb-image xcb-keysyms xcb-icccm xcb-shape
  794. > -lxcb-sync -lxcb-xfixes -lxcb-randr -lxcb-render -lxcb-image -lxcb-shm -lxcb-keysyms -lxcb-icccm -lxcb-shape -lxcb
  795. + /usr/bin/pkg-config --cflags xcb xcb-shm xcb-sync xcb-xfixes xcb-randr xcb-image xcb-keysyms xcb-icccm xcb-shape
  796. + cd /home/kiosk/WEBKIT/qt-everywhere-opensource-src-5.9.1/build/config.tests/qpa/xcb-syslibs && /home/kiosk/WEBKIT/qt-everywhere-opensource-src-5.9.1/build/qtbase/bin/qmake "CONFIG -= qt debug_and_release app_bundle lib_bundle" "CONFIG += shared use_gold_linker console single_arch" 'LIBS += -lxcb-sync -lxcb-xfixes -lxcb-randr -lxcb-render -lxcb-image -lxcb-shm -lxcb-keysyms -lxcb-icccm -lxcb-shape -lxcb' /home/kiosk/WEBKIT/qt-everywhere-opensource-src-5.9.1/qtbase/config.tests/qpa/xcb-syslibs
  797. + cd /home/kiosk/WEBKIT/qt-everywhere-opensource-src-5.9.1/build/config.tests/qpa/xcb-syslibs && MAKEFLAGS= /usr/bin/make
  798. > g++ -c -pipe -O2 -Wall -W -fPIC  -I/home/kiosk/WEBKIT/qt-everywhere-opensource-src-5.9.1/qtbase/config.tests/qpa/xcb-syslibs -I. -I/home/kiosk/WEBKIT/qt-everywhere-opensource-src-5.9.1/qtbase/mkspecs/linux-g++ -o xcb.o /home/kiosk/WEBKIT/qt-everywhere-opensource-src-5.9.1/qtbase/config.tests/qpa/xcb-syslibs/xcb.cpp
  799. > /home/kiosk/WEBKIT/qt-everywhere-opensource-src-5.9.1/qtbase/config.tests/qpa/xcb-syslibs/xcb.cpp: In function ‘int main(int, char**)’:
  800. > /home/kiosk/WEBKIT/qt-everywhere-opensource-src-5.9.1/qtbase/config.tests/qpa/xcb-syslibs/xcb.cpp:58:23: warning: unused variable ‘connection’ [-Wunused-variable]
  801. >      xcb_connection_t *connection = xcb_connect("", &primaryScreen);
  802. >                        ^~~~~~~~~~
  803. > g++ -Wl,-O1 -fuse-ld=gold -o xcb-syslibs xcb.o   -lxcb-sync -lxcb-xfixes -lxcb-randr -lxcb-render -lxcb-image -lxcb-shm -lxcb-keysyms -lxcb-icccm -lxcb-shape -lxcb
  804.  => source accepted.
  805. test config.gui.libraries.xcb_syslibs succeeded
  806. looking for library tslib
  807. Trying source 0 (type inline) of library tslib ...
  808. + cd /home/kiosk/WEBKIT/qt-everywhere-opensource-src-5.9.1/build/config.tests/unix/tslib && /home/kiosk/WEBKIT/qt-everywhere-opensource-src-5.9.1/build/qtbase/bin/qmake "CONFIG -= qt debug_and_release app_bundle lib_bundle" "CONFIG += shared use_gold_linker console single_arch" 'LIBS += -lts' /home/kiosk/WEBKIT/qt-everywhere-opensource-src-5.9.1/qtbase/config.tests/unix/tslib
  809. + cd /home/kiosk/WEBKIT/qt-everywhere-opensource-src-5.9.1/build/config.tests/unix/tslib && MAKEFLAGS= /usr/bin/make
  810. > g++ -c -pipe -O2 -Wall -W -fPIC  -I/home/kiosk/WEBKIT/qt-everywhere-opensource-src-5.9.1/qtbase/config.tests/unix/tslib -I. -I/home/kiosk/WEBKIT/qt-everywhere-opensource-src-5.9.1/qtbase/mkspecs/linux-g++ -o tslib.o /home/kiosk/WEBKIT/qt-everywhere-opensource-src-5.9.1/qtbase/config.tests/unix/tslib/tslib.cpp
  811. > /home/kiosk/WEBKIT/qt-everywhere-opensource-src-5.9.1/qtbase/config.tests/unix/tslib/tslib.cpp:40:19: fatal error: tslib.h: Нет такого файла или каталога
  812. >  #include <tslib.h>
  813. >                    ^
  814. > compilation terminated.
  815. > Makefile:170: ошибка выполнения рецепта для цели «tslib.o»
  816. > make: *** [tslib.o] Ошибка 1
  817.  => source failed verification.
  818. test config.gui.libraries.tslib FAILED
  819. executing config test x11prefix
  820. + /usr/bin/pkg-config --exists --silence-errors x11
  821. + /usr/bin/pkg-config --variable=prefix x11
  822. > /usr
  823. test config.gui.tests.x11prefix gave result /usr
  824. looking for library xcb_glx
  825. Trying source 0 (type pkgConfig) of library xcb_glx ...
  826. + /usr/bin/pkg-config --exists --silence-errors xcb-glx xcb
  827. + /usr/bin/pkg-config --modversion xcb-glx xcb
  828. > 1.11.1
  829. > 1.11.1
  830. + /usr/bin/pkg-config --libs-only-L xcb-glx xcb
  831. + /usr/bin/pkg-config --libs-only-l xcb-glx xcb
  832. > -lxcb-glx -lxcb
  833. + /usr/bin/pkg-config --cflags xcb-glx xcb
  834. + cd /home/kiosk/WEBKIT/qt-everywhere-opensource-src-5.9.1/build/config.tests/qpa/xcb-glx && /home/kiosk/WEBKIT/qt-everywhere-opensource-src-5.9.1/build/qtbase/bin/qmake "CONFIG -= qt debug_and_release app_bundle lib_bundle" "CONFIG += shared use_gold_linker console single_arch" 'LIBS += -lxcb-glx -lxcb' /home/kiosk/WEBKIT/qt-everywhere-opensource-src-5.9.1/qtbase/config.tests/qpa/xcb-glx
  835. + cd /home/kiosk/WEBKIT/qt-everywhere-opensource-src-5.9.1/build/config.tests/qpa/xcb-glx && MAKEFLAGS= /usr/bin/make
  836. > g++ -c -pipe -O2 -Wall -W -fPIC  -I/home/kiosk/WEBKIT/qt-everywhere-opensource-src-5.9.1/qtbase/config.tests/qpa/xcb-glx -I. -I/home/kiosk/WEBKIT/qt-everywhere-opensource-src-5.9.1/qtbase/mkspecs/linux-g++ -o xcb-glx.o /home/kiosk/WEBKIT/qt-everywhere-opensource-src-5.9.1/qtbase/config.tests/qpa/xcb-glx/xcb-glx.cpp
  837. > g++ -Wl,-O1 -fuse-ld=gold -o xcb-glx xcb-glx.o   -lxcb-glx -lxcb
  838.  => source accepted.
  839. test config.gui.libraries.xcb_glx succeeded
  840. looking for library xcb_render
  841. Trying source 0 (type pkgConfig) of library xcb_render ...
  842. + /usr/bin/pkg-config --exists --silence-errors xcb-renderutil xcb-render xcb
  843. + /usr/bin/pkg-config --modversion xcb-renderutil xcb-render xcb
  844. > 0.3.9
  845. > 1.11.1
  846. > 1.11.1
  847. + /usr/bin/pkg-config --libs-only-L xcb-renderutil xcb-render xcb
  848. + /usr/bin/pkg-config --libs-only-l xcb-renderutil xcb-render xcb
  849. > -lxcb-render-util -lxcb-render -lxcb
  850. + /usr/bin/pkg-config --cflags xcb-renderutil xcb-render xcb
  851. + cd /home/kiosk/WEBKIT/qt-everywhere-opensource-src-5.9.1/build/config.tests/qpa/xcb-render && /home/kiosk/WEBKIT/qt-everywhere-opensource-src-5.9.1/build/qtbase/bin/qmake "CONFIG -= qt debug_and_release app_bundle lib_bundle" "CONFIG += shared use_gold_linker console single_arch" 'LIBS += -lxcb-render-util -lxcb-render -lxcb' /home/kiosk/WEBKIT/qt-everywhere-opensource-src-5.9.1/qtbase/config.tests/qpa/xcb-render
  852. + cd /home/kiosk/WEBKIT/qt-everywhere-opensource-src-5.9.1/build/config.tests/qpa/xcb-render && MAKEFLAGS= /usr/bin/make
  853. > g++ -c -pipe -O2 -Wall -W -fPIC  -I/home/kiosk/WEBKIT/qt-everywhere-opensource-src-5.9.1/qtbase/config.tests/qpa/xcb-render -I. -I/home/kiosk/WEBKIT/qt-everywhere-opensource-src-5.9.1/qtbase/mkspecs/linux-g++ -o xcb-render.o /home/kiosk/WEBKIT/qt-everywhere-opensource-src-5.9.1/qtbase/config.tests/qpa/xcb-render/xcb-render.cpp
  854. > g++ -Wl,-O1 -fuse-ld=gold -o xcb-render xcb-render.o   -lxcb-render-util -lxcb-render -lxcb
  855.  => source accepted.
  856. test config.gui.libraries.xcb_render succeeded
  857. looking for library x11sm
  858. Trying source 0 (type pkgConfig) of library x11sm ...
  859. + /usr/bin/pkg-config --exists --silence-errors sm ice
  860. pkg-config did not find package.
  861.   => source produced no result.
  862. test config.gui.libraries.x11sm FAILED
  863. executing config test xlib
  864. + cd /home/kiosk/WEBKIT/qt-everywhere-opensource-src-5.9.1/build/config.tests/x11/xlib && /home/kiosk/WEBKIT/qt-everywhere-opensource-src-5.9.1/build/qtbase/bin/qmake "CONFIG -= qt debug_and_release app_bundle lib_bundle" "CONFIG += shared use_gold_linker console single_arch" /home/kiosk/WEBKIT/qt-everywhere-opensource-src-5.9.1/qtbase/config.tests/x11/xlib
  865. + cd /home/kiosk/WEBKIT/qt-everywhere-opensource-src-5.9.1/build/config.tests/x11/xlib && MAKEFLAGS= /usr/bin/make
  866. > g++ -c -pipe -O2 -Wall -W -fPIC  -I/home/kiosk/WEBKIT/qt-everywhere-opensource-src-5.9.1/qtbase/config.tests/x11/xlib -I. -I/home/kiosk/WEBKIT/qt-everywhere-opensource-src-5.9.1/qtbase/mkspecs/linux-g++ -o xlib.o /home/kiosk/WEBKIT/qt-everywhere-opensource-src-5.9.1/qtbase/config.tests/x11/xlib/xlib.cpp
  867. > g++ -Wl,-O1 -fuse-ld=gold -o xlib xlib.o    -lXext -lX11 -lm
  868. test config.gui.tests.xlib succeeded
  869. looking for library xinput2
  870. Trying source 0 (type pkgConfig) of library xinput2 ...
  871. + /usr/bin/pkg-config --exists --silence-errors xi
  872. + /usr/bin/pkg-config --modversion xi
  873. > 1.7.6
  874. + /usr/bin/pkg-config --libs-only-L xi
  875. + /usr/bin/pkg-config --libs-only-l xi
  876. > -lXi
  877. + /usr/bin/pkg-config --cflags xi
  878. + cd /home/kiosk/WEBKIT/qt-everywhere-opensource-src-5.9.1/build/config.tests/x11/xinput2 && /home/kiosk/WEBKIT/qt-everywhere-opensource-src-5.9.1/build/qtbase/bin/qmake "CONFIG -= qt debug_and_release app_bundle lib_bundle" "CONFIG += shared use_gold_linker console single_arch" 'LIBS += -lXi' /home/kiosk/WEBKIT/qt-everywhere-opensource-src-5.9.1/qtbase/config.tests/x11/xinput2
  879. + cd /home/kiosk/WEBKIT/qt-everywhere-opensource-src-5.9.1/build/config.tests/x11/xinput2 && MAKEFLAGS= /usr/bin/make
  880. > g++ -c -pipe -O2 -Wall -W -fPIC  -I/home/kiosk/WEBKIT/qt-everywhere-opensource-src-5.9.1/qtbase/config.tests/x11/xinput2 -I. -I/home/kiosk/WEBKIT/qt-everywhere-opensource-src-5.9.1/qtbase/mkspecs/linux-g++ -o xinput2.o /home/kiosk/WEBKIT/qt-everywhere-opensource-src-5.9.1/qtbase/config.tests/x11/xinput2/xinput2.cpp
  881. > /home/kiosk/WEBKIT/qt-everywhere-opensource-src-5.9.1/qtbase/config.tests/x11/xinput2/xinput2.cpp: In function ‘int main(int, char**)’:
  882. > /home/kiosk/WEBKIT/qt-everywhere-opensource-src-5.9.1/qtbase/config.tests/x11/xinput2/xinput2.cpp:57:14: warning: variable ‘xievent’ set but not used [-Wunused-but-set-variable]
  883. >      XIEvent *xievent;
  884. >               ^~~~~~~
  885. > /home/kiosk/WEBKIT/qt-everywhere-opensource-src-5.9.1/qtbase/config.tests/x11/xinput2/xinput2.cpp:60:20: warning: variable ‘xideviceevent’ set but not used [-Wunused-but-set-variable]
  886. >      XIDeviceEvent *xideviceevent;
  887. >                     ^~~~~~~~~~~~~
  888. > /home/kiosk/WEBKIT/qt-everywhere-opensource-src-5.9.1/qtbase/config.tests/x11/xinput2/xinput2.cpp:63:23: warning: variable ‘xihierarchyevent’ set but not used [-Wunused-but-set-variable]
  889. >      XIHierarchyEvent *xihierarchyevent;
  890. >                        ^~~~~~~~~~~~~~~~
  891. > g++ -Wl,-O1 -fuse-ld=gold -o xinput2 xinput2.o   -lXi -lXext -lX11 -lm
  892.  => source accepted.
  893. test config.gui.libraries.xinput2 succeeded
  894. looking for library xcb_xkb
  895. Trying source 0 (type pkgConfig) of library xcb_xkb ...
  896. + /usr/bin/pkg-config --exists --silence-errors xcb-xkb '>=' 1.10 xcb
  897. + /usr/bin/pkg-config --modversion xcb-xkb '>=' 1.10 xcb
  898. > 1.11.1
  899. > 1.11.1
  900. + /usr/bin/pkg-config --libs-only-L xcb-xkb '>=' 1.10 xcb
  901. + /usr/bin/pkg-config --libs-only-l xcb-xkb '>=' 1.10 xcb
  902. > -lxcb-xkb -lxcb
  903. + /usr/bin/pkg-config --cflags xcb-xkb '>=' 1.10 xcb
  904. + cd /home/kiosk/WEBKIT/qt-everywhere-opensource-src-5.9.1/build/config.tests/qpa/xcb-xkb && /home/kiosk/WEBKIT/qt-everywhere-opensource-src-5.9.1/build/qtbase/bin/qmake "CONFIG -= qt debug_and_release app_bundle lib_bundle" "CONFIG += shared use_gold_linker console single_arch" 'LIBS += -lxcb-xkb -lxcb' /home/kiosk/WEBKIT/qt-everywhere-opensource-src-5.9.1/qtbase/config.tests/qpa/xcb-xkb
  905. + cd /home/kiosk/WEBKIT/qt-everywhere-opensource-src-5.9.1/build/config.tests/qpa/xcb-xkb && MAKEFLAGS= /usr/bin/make
  906. > g++ -c -pipe -O2 -Wall -W -fPIC  -I/home/kiosk/WEBKIT/qt-everywhere-opensource-src-5.9.1/qtbase/config.tests/qpa/xcb-xkb -I. -I/home/kiosk/WEBKIT/qt-everywhere-opensource-src-5.9.1/qtbase/mkspecs/linux-g++ -o xcb-xkb.o /home/kiosk/WEBKIT/qt-everywhere-opensource-src-5.9.1/qtbase/config.tests/qpa/xcb-xkb/xcb-xkb.cpp
  907. > /home/kiosk/WEBKIT/qt-everywhere-opensource-src-5.9.1/qtbase/config.tests/qpa/xcb-xkb/xcb-xkb.cpp: In function ‘int main(int, char**)’:
  908. > /home/kiosk/WEBKIT/qt-everywhere-opensource-src-5.9.1/qtbase/config.tests/qpa/xcb-xkb/xcb-xkb.cpp:52:23: warning: unused variable ‘connection’ [-Wunused-variable]
  909. >      xcb_connection_t *connection = xcb_connect("", &primaryScreen);
  910. >                        ^~~~~~~~~~
  911. > /home/kiosk/WEBKIT/qt-everywhere-opensource-src-5.9.1/qtbase/config.tests/qpa/xcb-xkb/xcb-xkb.cpp:58:9: warning: unused variable ‘xcbAtomPrimary’ [-Wunused-variable]
  912. >      int xcbAtomPrimary = XCB_ATOM_PRIMARY;
  913. >          ^~~~~~~~~~~~~~
  914. > g++ -Wl,-O1 -fuse-ld=gold -o xcb-xkb xcb-xkb.o   -lxcb-xkb -lxcb
  915.  => source accepted.
  916. test config.gui.libraries.xcb_xkb succeeded
  917. looking for library xkbcommon_x11
  918. Trying source 0 (type pkgConfig) of library xkbcommon_x11 ...
  919. + /usr/bin/pkg-config --exists --silence-errors xkbcommon xkbcommon-x11 '>=' 0.4.1
  920. pkg-config did not find package.
  921.   => source produced no result.
  922. test config.gui.libraries.xkbcommon_x11 FAILED
  923. executing config test xkbconfigroot
  924. + /usr/bin/pkg-config --exists --silence-errors xkeyboard-config
  925. + /usr/bin/pkg-config --variable=xkb_base xkeyboard-config
  926. > /usr/share/X11/xkb
  927. test config.gui.tests.xkbconfigroot gave result /usr/share/X11/xkb
  928. looking for library xkbcommon
  929. Trying source 0 (type pkgConfig) of library xkbcommon ...
  930. + /usr/bin/pkg-config --exists --silence-errors xkbcommon
  931. + /usr/bin/pkg-config --modversion xkbcommon
  932. > 0.5.0
  933. + /usr/bin/pkg-config --libs-only-L xkbcommon
  934. + /usr/bin/pkg-config --libs-only-l xkbcommon
  935. > -lxkbcommon
  936. + /usr/bin/pkg-config --cflags xkbcommon
  937. + cd /home/kiosk/WEBKIT/qt-everywhere-opensource-src-5.9.1/build/config.tests/unix/xkbcommon && /home/kiosk/WEBKIT/qt-everywhere-opensource-src-5.9.1/build/qtbase/bin/qmake "CONFIG -= qt debug_and_release app_bundle lib_bundle" "CONFIG += shared use_gold_linker console single_arch" 'LIBS += -lxkbcommon' /home/kiosk/WEBKIT/qt-everywhere-opensource-src-5.9.1/qtbase/config.tests/unix/xkbcommon
  938. + cd /home/kiosk/WEBKIT/qt-everywhere-opensource-src-5.9.1/build/config.tests/unix/xkbcommon && MAKEFLAGS= /usr/bin/make
  939. > g++ -c -pipe -O2 -Wall -W -fPIC  -I/home/kiosk/WEBKIT/qt-everywhere-opensource-src-5.9.1/qtbase/config.tests/unix/xkbcommon -I. -I/home/kiosk/WEBKIT/qt-everywhere-opensource-src-5.9.1/qtbase/mkspecs/linux-g++ -o xkbcommon.o /home/kiosk/WEBKIT/qt-everywhere-opensource-src-5.9.1/qtbase/config.tests/unix/xkbcommon/xkbcommon.cpp
  940. > g++ -Wl,-O1 -fuse-ld=gold -o xkbcommon xkbcommon.o   -lxkbcommon
  941.  => source accepted.
  942. test config.gui.libraries.xkbcommon succeeded
  943. looking for library cups
  944. Trying source 0 (type inline) of library cups ...
  945. + cd /home/kiosk/WEBKIT/qt-everywhere-opensource-src-5.9.1/build/config.tests/unix/cups && /home/kiosk/WEBKIT/qt-everywhere-opensource-src-5.9.1/build/qtbase/bin/qmake "CONFIG -= qt debug_and_release app_bundle lib_bundle" "CONFIG += shared use_gold_linker console single_arch" 'LIBS += -lcups' /home/kiosk/WEBKIT/qt-everywhere-opensource-src-5.9.1/qtbase/config.tests/unix/cups
  946. + cd /home/kiosk/WEBKIT/qt-everywhere-opensource-src-5.9.1/build/config.tests/unix/cups && MAKEFLAGS= /usr/bin/make
  947. > g++ -c -pipe -O2 -Wall -W -fPIC  -I/home/kiosk/WEBKIT/qt-everywhere-opensource-src-5.9.1/qtbase/config.tests/unix/cups -I. -I/home/kiosk/WEBKIT/qt-everywhere-opensource-src-5.9.1/qtbase/mkspecs/linux-g++ -o cups.o /home/kiosk/WEBKIT/qt-everywhere-opensource-src-5.9.1/qtbase/config.tests/unix/cups/cups.cpp
  948. > g++ -Wl,-O1 -fuse-ld=gold -o cups cups.o   -lcups
  949.  => source accepted.
  950. test config.printsupport.libraries.cups succeeded
  951. looking for library db2
  952. Trying source 0 (type inline) of library db2 ...
  953.   => source failed condition 'config.win32'.
  954. Trying source 1 (type inline) of library db2 ...
  955. + cd /home/kiosk/WEBKIT/qt-everywhere-opensource-src-5.9.1/build/config.tests/unix/db2 && /home/kiosk/WEBKIT/qt-everywhere-opensource-src-5.9.1/build/qtbase/bin/qmake "CONFIG -= qt debug_and_release app_bundle lib_bundle" "CONFIG += shared use_gold_linker console single_arch" 'LIBS += -ldb2' /home/kiosk/WEBKIT/qt-everywhere-opensource-src-5.9.1/qtbase/config.tests/unix/db2
  956. + cd /home/kiosk/WEBKIT/qt-everywhere-opensource-src-5.9.1/build/config.tests/unix/db2 && MAKEFLAGS= /usr/bin/make
  957. > g++ -c -pipe -O2 -Wall -W -fPIC  -I/home/kiosk/WEBKIT/qt-everywhere-opensource-src-5.9.1/qtbase/config.tests/unix/db2 -I. -I/home/kiosk/WEBKIT/qt-everywhere-opensource-src-5.9.1/qtbase/mkspecs/linux-g++ -o db2.o /home/kiosk/WEBKIT/qt-everywhere-opensource-src-5.9.1/qtbase/config.tests/unix/db2/db2.cpp
  958. > /home/kiosk/WEBKIT/qt-everywhere-opensource-src-5.9.1/qtbase/config.tests/unix/db2/db2.cpp:40:20: fatal error: sqlcli.h: Нет такого файла или каталога
  959. >  #include <sqlcli.h>
  960. >                     ^
  961. > compilation terminated.
  962. > Makefile:170: ошибка выполнения рецепта для цели «db2.o»
  963. > make: *** [db2.o] Ошибка 1
  964.  => source failed verification.
  965. test config.sqldrivers.libraries.db2 FAILED
  966. looking for library ibase
  967. Trying source 0 (type inline) of library ibase ...
  968.   => source failed condition 'config.win32'.
  969. Trying source 1 (type inline) of library ibase ...
  970. + cd /home/kiosk/WEBKIT/qt-everywhere-opensource-src-5.9.1/build/config.tests/unix/ibase && /home/kiosk/WEBKIT/qt-everywhere-opensource-src-5.9.1/build/qtbase/bin/qmake "CONFIG -= qt debug_and_release app_bundle lib_bundle" "CONFIG += shared use_gold_linker console single_arch" 'LIBS += -lgds' /home/kiosk/WEBKIT/qt-everywhere-opensource-src-5.9.1/qtbase/config.tests/unix/ibase
  971. + cd /home/kiosk/WEBKIT/qt-everywhere-opensource-src-5.9.1/build/config.tests/unix/ibase && MAKEFLAGS= /usr/bin/make
  972. > g++ -c -pipe -O2 -Wall -W -fPIC  -I/home/kiosk/WEBKIT/qt-everywhere-opensource-src-5.9.1/qtbase/config.tests/unix/ibase -I. -I/home/kiosk/WEBKIT/qt-everywhere-opensource-src-5.9.1/qtbase/mkspecs/linux-g++ -o ibase.o /home/kiosk/WEBKIT/qt-everywhere-opensource-src-5.9.1/qtbase/config.tests/unix/ibase/ibase.cpp
  973. > /home/kiosk/WEBKIT/qt-everywhere-opensource-src-5.9.1/qtbase/config.tests/unix/ibase/ibase.cpp:40:19: fatal error: ibase.h: Нет такого файла или каталога
  974. >  #include <ibase.h>
  975. >                    ^
  976. > compilation terminated.
  977. > Makefile:170: ошибка выполнения рецепта для цели «ibase.o»
  978. > make: *** [ibase.o] Ошибка 1
  979.  => source failed verification.
  980. test config.sqldrivers.libraries.ibase FAILED
  981. looking for library mysql
  982. Trying source 0 (type mysqlConfig) of library mysql ...
  983. mysql_config not found.
  984.   => source produced no result.
  985. Trying source 1 (type mysqlConfig) of library mysql ...
  986. mysql_config not found.
  987.   => source produced no result.
  988. Trying source 2 (type mysqlConfig) of library mysql ...
  989. mysql_config not found.
  990.   => source produced no result.
  991. Trying source 3 (type mysqlConfig) of library mysql ...
  992. mysql_config not found.
  993.   => source produced no result.
  994. Trying source 4 (type inline) of library mysql ...
  995. + cd /home/kiosk/WEBKIT/qt-everywhere-opensource-src-5.9.1/build/config.tests/unix/mysql && /home/kiosk/WEBKIT/qt-everywhere-opensource-src-5.9.1/build/qtbase/bin/qmake "CONFIG -= qt debug_and_release app_bundle lib_bundle" "CONFIG += shared use_gold_linker console single_arch" 'LIBS += -lmysqlclient_r' /home/kiosk/WEBKIT/qt-everywhere-opensource-src-5.9.1/qtbase/config.tests/unix/mysql
  996. + cd /home/kiosk/WEBKIT/qt-everywhere-opensource-src-5.9.1/build/config.tests/unix/mysql && MAKEFLAGS= /usr/bin/make
  997. > g++ -c -pipe -O2 -Wall -W -fPIC  -I/home/kiosk/WEBKIT/qt-everywhere-opensource-src-5.9.1/qtbase/config.tests/unix/mysql -I. -I/home/kiosk/WEBKIT/qt-everywhere-opensource-src-5.9.1/qtbase/mkspecs/linux-g++ -o mysql.o /home/kiosk/WEBKIT/qt-everywhere-opensource-src-5.9.1/qtbase/config.tests/unix/mysql/mysql.cpp
  998. > /home/kiosk/WEBKIT/qt-everywhere-opensource-src-5.9.1/qtbase/config.tests/unix/mysql/mysql.cpp:43:19: fatal error: mysql.h: Нет такого файла или каталога
  999. >  #include "mysql.h"
  1000. >                    ^
  1001. > compilation terminated.
  1002. > Makefile:170: ошибка выполнения рецепта для цели «mysql.o»
  1003. > make: *** [mysql.o] Ошибка 1
  1004.  => source failed verification.
  1005. Trying source 5 (type inline) of library mysql ...
  1006.   => source failed condition 'config.win32'.
  1007. Trying source 6 (type inline) of library mysql ...
  1008. + cd /home/kiosk/WEBKIT/qt-everywhere-opensource-src-5.9.1/build/config.tests/unix/mysql && /home/kiosk/WEBKIT/qt-everywhere-opensource-src-5.9.1/build/qtbase/bin/qmake "CONFIG -= qt debug_and_release app_bundle lib_bundle" "CONFIG += shared use_gold_linker console single_arch" 'LIBS += -lmysqlclient' /home/kiosk/WEBKIT/qt-everywhere-opensource-src-5.9.1/qtbase/config.tests/unix/mysql
  1009. + cd /home/kiosk/WEBKIT/qt-everywhere-opensource-src-5.9.1/build/config.tests/unix/mysql && MAKEFLAGS= /usr/bin/make clean && MAKEFLAGS= /usr/bin/make
  1010. > rm -f mysql.o
  1011. > rm -f *~ core *.core
  1012. > g++ -c -pipe -O2 -Wall -W -fPIC  -I/home/kiosk/WEBKIT/qt-everywhere-opensource-src-5.9.1/qtbase/config.tests/unix/mysql -I. -I/home/kiosk/WEBKIT/qt-everywhere-opensource-src-5.9.1/qtbase/mkspecs/linux-g++ -o mysql.o /home/kiosk/WEBKIT/qt-everywhere-opensource-src-5.9.1/qtbase/config.tests/unix/mysql/mysql.cpp
  1013. > /home/kiosk/WEBKIT/qt-everywhere-opensource-src-5.9.1/qtbase/config.tests/unix/mysql/mysql.cpp:43:19: fatal error: mysql.h: Нет такого файла или каталога
  1014. >  #include "mysql.h"
  1015. >                    ^
  1016. > compilation terminated.
  1017. > Makefile:170: ошибка выполнения рецепта для цели «mysql.o»
  1018. > make: *** [mysql.o] Ошибка 1
  1019.  => source failed verification.
  1020. test config.sqldrivers.libraries.mysql FAILED
  1021. looking for library oci
  1022. Trying source 0 (type inline) of library oci ...
  1023.   => source failed condition 'config.win32'.
  1024. Trying source 1 (type inline) of library oci ...
  1025. + cd /home/kiosk/WEBKIT/qt-everywhere-opensource-src-5.9.1/build/config.tests/unix/oci && /home/kiosk/WEBKIT/qt-everywhere-opensource-src-5.9.1/build/qtbase/bin/qmake "CONFIG -= qt debug_and_release app_bundle lib_bundle" "CONFIG += shared use_gold_linker console single_arch" 'LIBS += -lclntsh' /home/kiosk/WEBKIT/qt-everywhere-opensource-src-5.9.1/qtbase/config.tests/unix/oci
  1026. + cd /home/kiosk/WEBKIT/qt-everywhere-opensource-src-5.9.1/build/config.tests/unix/oci && MAKEFLAGS= /usr/bin/make
  1027. > g++ -c -pipe -O2 -Wall -W -fPIC  -I/home/kiosk/WEBKIT/qt-everywhere-opensource-src-5.9.1/qtbase/config.tests/unix/oci -I. -I/home/kiosk/WEBKIT/qt-everywhere-opensource-src-5.9.1/qtbase/mkspecs/linux-g++ -o oci.o /home/kiosk/WEBKIT/qt-everywhere-opensource-src-5.9.1/qtbase/config.tests/unix/oci/oci.cpp
  1028. > /home/kiosk/WEBKIT/qt-everywhere-opensource-src-5.9.1/qtbase/config.tests/unix/oci/oci.cpp:40:17: fatal error: oci.h: Нет такого файла или каталога
  1029. >  #include <oci.h>
  1030. >                  ^
  1031. > compilation terminated.
  1032. > Makefile:170: ошибка выполнения рецепта для цели «oci.o»
  1033. > make: *** [oci.o] Ошибка 1
  1034.  => source failed verification.
  1035. test config.sqldrivers.libraries.oci FAILED
  1036. looking for library odbc
  1037. Trying source 0 (type inline) of library odbc ...
  1038.   => source failed condition 'config.win32'.
  1039. Trying source 1 (type inline) of library odbc ...
  1040.   => source failed condition 'config.darwin'.
  1041. Trying source 2 (type inline) of library odbc ...
  1042. + cd /home/kiosk/WEBKIT/qt-everywhere-opensource-src-5.9.1/build/config.tests/unix/odbc && /home/kiosk/WEBKIT/qt-everywhere-opensource-src-5.9.1/build/qtbase/bin/qmake "CONFIG -= qt debug_and_release app_bundle lib_bundle" "CONFIG += shared use_gold_linker console single_arch" 'LIBS += -lodbc' /home/kiosk/WEBKIT/qt-everywhere-opensource-src-5.9.1/qtbase/config.tests/unix/odbc
  1043. + cd /home/kiosk/WEBKIT/qt-everywhere-opensource-src-5.9.1/build/config.tests/unix/odbc && MAKEFLAGS= /usr/bin/make
  1044. > g++ -c -pipe -O2 -Wall -W -fPIC  -I/home/kiosk/WEBKIT/qt-everywhere-opensource-src-5.9.1/qtbase/config.tests/unix/odbc -I. -I/home/kiosk/WEBKIT/qt-everywhere-opensource-src-5.9.1/qtbase/mkspecs/linux-g++ -o odbc.o /home/kiosk/WEBKIT/qt-everywhere-opensource-src-5.9.1/qtbase/config.tests/unix/odbc/odbc.cpp
  1045. > /home/kiosk/WEBKIT/qt-everywhere-opensource-src-5.9.1/qtbase/config.tests/unix/odbc/odbc.cpp:43:17: fatal error: sql.h: Нет такого файла или каталога
  1046. >  #include <sql.h>
  1047. >                  ^
  1048. > compilation terminated.
  1049. > Makefile:170: ошибка выполнения рецепта для цели «odbc.o»
  1050. > make: *** [odbc.o] Ошибка 1
  1051.  => source failed verification.
  1052. test config.sqldrivers.libraries.odbc FAILED
  1053. looking for library psql
  1054. Trying source 0 (type pkgConfig) of library psql ...
  1055. + /usr/bin/pkg-config --exists --silence-errors libpq
  1056. pkg-config did not find package.
  1057.   => source produced no result.
  1058. Trying source 1 (type psqlConfig) of library psql ...
  1059. pg_config not found.
  1060.   => source produced no result.
  1061. Trying source 2 (type psqlEnv) of library psql ...
  1062.   => source failed condition 'config.win32'.
  1063. Trying source 3 (type psqlEnv) of library psql ...
  1064. + cd /home/kiosk/WEBKIT/qt-everywhere-opensource-src-5.9.1/build/config.tests/unix/psql && /home/kiosk/WEBKIT/qt-everywhere-opensource-src-5.9.1/build/qtbase/bin/qmake "CONFIG -= qt debug_and_release app_bundle lib_bundle" "CONFIG += shared use_gold_linker console single_arch" 'LIBS += -lpq' /home/kiosk/WEBKIT/qt-everywhere-opensource-src-5.9.1/qtbase/config.tests/unix/psql
  1065. + cd /home/kiosk/WEBKIT/qt-everywhere-opensource-src-5.9.1/build/config.tests/unix/psql && MAKEFLAGS= /usr/bin/make
  1066. > g++ -c -pipe -O2 -Wall -W -fPIC  -I/home/kiosk/WEBKIT/qt-everywhere-opensource-src-5.9.1/qtbase/config.tests/unix/psql -I. -I/home/kiosk/WEBKIT/qt-everywhere-opensource-src-5.9.1/qtbase/mkspecs/linux-g++ -o psql.o /home/kiosk/WEBKIT/qt-everywhere-opensource-src-5.9.1/qtbase/config.tests/unix/psql/psql.cpp
  1067. > /home/kiosk/WEBKIT/qt-everywhere-opensource-src-5.9.1/qtbase/config.tests/unix/psql/psql.cpp:40:22: fatal error: libpq-fe.h: Нет такого файла или каталога
  1068. >  #include "libpq-fe.h"
  1069. >                       ^
  1070. > compilation terminated.
  1071. > Makefile:170: ошибка выполнения рецепта для цели «psql.o»
  1072. > make: *** [psql.o] Ошибка 1
  1073.  => source failed verification.
  1074. test config.sqldrivers.libraries.psql FAILED
  1075. looking for library sqlite2
  1076. Trying source 0 (type inline) of library sqlite2 ...
  1077. + cd /home/kiosk/WEBKIT/qt-everywhere-opensource-src-5.9.1/build/config.tests/unix/sqlite2 && /home/kiosk/WEBKIT/qt-everywhere-opensource-src-5.9.1/build/qtbase/bin/qmake "CONFIG -= qt debug_and_release app_bundle lib_bundle" "CONFIG += shared use_gold_linker console single_arch" 'LIBS += -lsqlite' /home/kiosk/WEBKIT/qt-everywhere-opensource-src-5.9.1/qtbase/config.tests/unix/sqlite2
  1078. + cd /home/kiosk/WEBKIT/qt-everywhere-opensource-src-5.9.1/build/config.tests/unix/sqlite2 && MAKEFLAGS= /usr/bin/make
  1079. > g++ -c -pipe -O2 -Wall -W -fPIC  -I/home/kiosk/WEBKIT/qt-everywhere-opensource-src-5.9.1/qtbase/config.tests/unix/sqlite2 -I. -I/home/kiosk/WEBKIT/qt-everywhere-opensource-src-5.9.1/qtbase/mkspecs/linux-g++ -o sqlite2.o /home/kiosk/WEBKIT/qt-everywhere-opensource-src-5.9.1/qtbase/config.tests/unix/sqlite2/sqlite2.cpp
  1080. > /home/kiosk/WEBKIT/qt-everywhere-opensource-src-5.9.1/qtbase/config.tests/unix/sqlite2/sqlite2.cpp:40:20: fatal error: sqlite.h: Нет такого файла или каталога
  1081. >  #include <sqlite.h>
  1082. >                     ^
  1083. > compilation terminated.
  1084. > Makefile:170: ошибка выполнения рецепта для цели «sqlite2.o»
  1085. > make: *** [sqlite2.o] Ошибка 1
  1086.  => source failed verification.
  1087. test config.sqldrivers.libraries.sqlite2 FAILED
  1088. looking for library tds
  1089. Trying source 0 (type sybaseEnv) of library tds ...
  1090.   => source failed condition 'config.win32'.
  1091. Trying source 1 (type sybaseEnv) of library tds ...
  1092. + cd /home/kiosk/WEBKIT/qt-everywhere-opensource-src-5.9.1/build/config.tests/unix/tds && /home/kiosk/WEBKIT/qt-everywhere-opensource-src-5.9.1/build/qtbase/bin/qmake "CONFIG -= qt debug_and_release app_bundle lib_bundle" "CONFIG += shared use_gold_linker console single_arch" 'LIBS += -lsybdb' /home/kiosk/WEBKIT/qt-everywhere-opensource-src-5.9.1/qtbase/config.tests/unix/tds
  1093. + cd /home/kiosk/WEBKIT/qt-everywhere-opensource-src-5.9.1/build/config.tests/unix/tds && MAKEFLAGS= /usr/bin/make
  1094. > g++ -c -pipe -O2 -Wall -W -fPIC  -I/home/kiosk/WEBKIT/qt-everywhere-opensource-src-5.9.1/qtbase/config.tests/unix/tds -I. -I/home/kiosk/WEBKIT/qt-everywhere-opensource-src-5.9.1/qtbase/mkspecs/linux-g++ -o tds.o /home/kiosk/WEBKIT/qt-everywhere-opensource-src-5.9.1/qtbase/config.tests/unix/tds/tds.cpp
  1095. > /home/kiosk/WEBKIT/qt-everywhere-opensource-src-5.9.1/qtbase/config.tests/unix/tds/tds.cpp:40:22: fatal error: sybfront.h: Нет такого файла или каталога
  1096. >  #include <sybfront.h>
  1097. >                       ^
  1098. > compilation terminated.
  1099. > Makefile:170: ошибка выполнения рецепта для цели «tds.o»
  1100. > make: *** [tds.o] Ошибка 1
  1101.  => source failed verification.
  1102. test config.sqldrivers.libraries.tds FAILED
  1103. executing config test socketcan
  1104. + cd /home/kiosk/WEBKIT/qt-everywhere-opensource-src-5.9.1/build/config.tests/socketcan && /home/kiosk/WEBKIT/qt-everywhere-opensource-src-5.9.1/build/qtbase/bin/qmake "CONFIG -= qt debug_and_release app_bundle lib_bundle" "CONFIG += shared use_gold_linker console single_arch" /home/kiosk/WEBKIT/qt-everywhere-opensource-src-5.9.1/qtserialbus/config.tests/socketcan
  1105. + cd /home/kiosk/WEBKIT/qt-everywhere-opensource-src-5.9.1/build/config.tests/socketcan && MAKEFLAGS= /usr/bin/make
  1106. > g++ -c -pipe -O2 -Wall -W -fPIC  -I/home/kiosk/WEBKIT/qt-everywhere-opensource-src-5.9.1/qtserialbus/config.tests/socketcan -I. -I/home/kiosk/WEBKIT/qt-everywhere-opensource-src-5.9.1/qtbase/mkspecs/linux-g++ -o main.o /home/kiosk/WEBKIT/qt-everywhere-opensource-src-5.9.1/qtserialbus/config.tests/socketcan/main.cpp
  1107. > /home/kiosk/WEBKIT/qt-everywhere-opensource-src-5.9.1/qtserialbus/config.tests/socketcan/main.cpp: In function ‘int main()’:
  1108. > /home/kiosk/WEBKIT/qt-everywhere-opensource-src-5.9.1/qtserialbus/config.tests/socketcan/main.cpp:41:15: warning: unused variable ‘frame’ [-Wunused-variable]
  1109. >      can_frame frame;
  1110. >                ^~~~~
  1111. > g++ -Wl,-O1 -fuse-ld=gold -o socketcan main.o    
  1112. test config.serialbus.tests.socketcan succeeded
  1113. executing config test socketcan_fd
  1114. + cd /home/kiosk/WEBKIT/qt-everywhere-opensource-src-5.9.1/build/config.tests/socketcan_fd && /home/kiosk/WEBKIT/qt-everywhere-opensource-src-5.9.1/build/qtbase/bin/qmake "CONFIG -= qt debug_and_release app_bundle lib_bundle" "CONFIG += shared use_gold_linker console single_arch" /home/kiosk/WEBKIT/qt-everywhere-opensource-src-5.9.1/qtserialbus/config.tests/socketcan_fd
  1115. + cd /home/kiosk/WEBKIT/qt-everywhere-opensource-src-5.9.1/build/config.tests/socketcan_fd && MAKEFLAGS= /usr/bin/make
  1116. > g++ -c -pipe -O2 -Wall -W -fPIC  -I/home/kiosk/WEBKIT/qt-everywhere-opensource-src-5.9.1/qtserialbus/config.tests/socketcan_fd -I. -I/home/kiosk/WEBKIT/qt-everywhere-opensource-src-5.9.1/qtbase/mkspecs/linux-g++ -o main.o /home/kiosk/WEBKIT/qt-everywhere-opensource-src-5.9.1/qtserialbus/config.tests/socketcan_fd/main.cpp
  1117. > /home/kiosk/WEBKIT/qt-everywhere-opensource-src-5.9.1/qtserialbus/config.tests/socketcan_fd/main.cpp: In function ‘int main()’:
  1118. > /home/kiosk/WEBKIT/qt-everywhere-opensource-src-5.9.1/qtserialbus/config.tests/socketcan_fd/main.cpp:41:17: warning: unused variable ‘frame’ [-Wunused-variable]
  1119. >      canfd_frame frame;
  1120. >                  ^~~~~
  1121. > /home/kiosk/WEBKIT/qt-everywhere-opensource-src-5.9.1/qtserialbus/config.tests/socketcan_fd/main.cpp:42:9: warning: variable ‘fd_payload’ set but not used [-Wunused-but-set-variable]
  1122. >      int fd_payload = CANFD_MAX_DLEN;
  1123. >          ^~~~~~~~~~
  1124. > g++ -Wl,-O1 -fuse-ld=gold -o socketcan_fd main.o    
  1125. test config.serialbus.tests.socketcan_fd succeeded
  1126. executing config test d3d12
  1127. + cd /home/kiosk/WEBKIT/qt-everywhere-opensource-src-5.9.1/build/config.tests/d3d12 && /home/kiosk/WEBKIT/qt-everywhere-opensource-src-5.9.1/build/qtbase/bin/qmake "CONFIG -= qt debug_and_release app_bundle lib_bundle" "CONFIG += shared use_gold_linker console single_arch" /home/kiosk/WEBKIT/qt-everywhere-opensource-src-5.9.1/qtdeclarative/config.tests/d3d12
  1128. + cd /home/kiosk/WEBKIT/qt-everywhere-opensource-src-5.9.1/build/config.tests/d3d12 && MAKEFLAGS= /usr/bin/make
  1129. > g++ -c -pipe -O2 -Wall -W -fPIC  -I/home/kiosk/WEBKIT/qt-everywhere-opensource-src-5.9.1/qtdeclarative/config.tests/d3d12 -I. -I/home/kiosk/WEBKIT/qt-everywhere-opensource-src-5.9.1/qtbase/mkspecs/linux-g++ -o d3d12.o /home/kiosk/WEBKIT/qt-everywhere-opensource-src-5.9.1/qtdeclarative/config.tests/d3d12/d3d12.cpp
  1130. > /home/kiosk/WEBKIT/qt-everywhere-opensource-src-5.9.1/qtdeclarative/config.tests/d3d12/d3d12.cpp:40:19: fatal error: d3d12.h: Нет такого файла или каталога
  1131. >  #include <d3d12.h>
  1132. >                    ^
  1133. > compilation terminated.
  1134. > Makefile:167: ошибка выполнения рецепта для цели «d3d12.o»
  1135. > make: *** [d3d12.o] Ошибка 1
  1136. test config.quick.tests.d3d12 FAILED
  1137. looking for library sdl2
  1138. Trying source 0 (type pkgConfig) of library sdl2 ...
  1139. + /usr/bin/pkg-config --exists --silence-errors sdl2
  1140. pkg-config did not find package.
  1141.   => source produced no result.
  1142. Trying source 1 (type inline) of library sdl2 ...
  1143.   => source failed condition 'config.darwin'.
  1144. Trying source 2 (type inline) of library sdl2 ...
  1145.   => source failed condition 'config.win32'.
  1146. Trying source 3 (type inline) of library sdl2 ...
  1147. + cd /home/kiosk/WEBKIT/qt-everywhere-opensource-src-5.9.1/build/config.tests/sdl && /home/kiosk/WEBKIT/qt-everywhere-opensource-src-5.9.1/build/qtbase/bin/qmake "CONFIG -= qt debug_and_release app_bundle lib_bundle" "CONFIG += shared use_gold_linker console single_arch" 'LIBS += -lSDL2' /home/kiosk/WEBKIT/qt-everywhere-opensource-src-5.9.1/qtgamepad/config.tests/sdl
  1148. + cd /home/kiosk/WEBKIT/qt-everywhere-opensource-src-5.9.1/build/config.tests/sdl && MAKEFLAGS= /usr/bin/make
  1149. > g++ -c -pipe -O2 -Wall -W -fPIC  -I/home/kiosk/WEBKIT/qt-everywhere-opensource-src-5.9.1/qtgamepad/config.tests/sdl -I. -I/home/kiosk/WEBKIT/qt-everywhere-opensource-src-5.9.1/qtbase/mkspecs/linux-g++ -o main.o /home/kiosk/WEBKIT/qt-everywhere-opensource-src-5.9.1/qtgamepad/config.tests/sdl/main.cpp
  1150. > /home/kiosk/WEBKIT/qt-everywhere-opensource-src-5.9.1/qtgamepad/config.tests/sdl/main.cpp:37:17: fatal error: SDL.h: Нет такого файла или каталога
  1151. >  #include <SDL.h>
  1152. >                  ^
  1153. > compilation terminated.
  1154. > Makefile:167: ошибка выполнения рецепта для цели «main.o»
  1155. > make: *** [main.o] Ошибка 1
  1156.  => source failed verification.
  1157. test config.gamepad.libraries.sdl2 FAILED
  1158. looking for library assimp
  1159. Trying source 0 (type pkgConfig) of library assimp ...
  1160. + /usr/bin/pkg-config --exists --silence-errors assimp '>' 3.3.1
  1161. pkg-config did not find package.
  1162.   => source produced no result.
  1163. Trying source 1 (type inline) of library assimp ...
  1164. + cd /home/kiosk/WEBKIT/qt-everywhere-opensource-src-5.9.1/build/config.tests/assimp && /home/kiosk/WEBKIT/qt-everywhere-opensource-src-5.9.1/build/qtbase/bin/qmake "CONFIG -= qt debug_and_release app_bundle lib_bundle" "CONFIG += shared use_gold_linker console single_arch" 'LIBS += -lassimp' /home/kiosk/WEBKIT/qt-everywhere-opensource-src-5.9.1/qt3d/config.tests/assimp
  1165. + cd /home/kiosk/WEBKIT/qt-everywhere-opensource-src-5.9.1/build/config.tests/assimp && MAKEFLAGS= /usr/bin/make
  1166. > g++ -c -pipe -O2 -Wall -W -fPIC  -I/home/kiosk/WEBKIT/qt-everywhere-opensource-src-5.9.1/qt3d/config.tests/assimp -I. -I/home/kiosk/WEBKIT/qt-everywhere-opensource-src-5.9.1/qtbase/mkspecs/linux-g++ -o main.o /home/kiosk/WEBKIT/qt-everywhere-opensource-src-5.9.1/qt3d/config.tests/assimp/main.cpp
  1167. > /home/kiosk/WEBKIT/qt-everywhere-opensource-src-5.9.1/qt3d/config.tests/assimp/main.cpp:29:28: fatal error: assimp/cimport.h: Нет такого файла или каталога
  1168. >  #include <assimp/cimport.h>
  1169. >                             ^
  1170. > compilation terminated.
  1171. > Makefile:167: ошибка выполнения рецепта для цели «main.o»
  1172. > make: *** [main.o] Ошибка 1
  1173.  => source failed verification.
  1174. test config.core.libraries.assimp FAILED
  1175. looking for library fbx
  1176. Trying source 0 (type fbx) of library fbx ...
  1177. + cd /home/kiosk/WEBKIT/qt-everywhere-opensource-src-5.9.1/build/config.tests/fbx && /home/kiosk/WEBKIT/qt-everywhere-opensource-src-5.9.1/build/qtbase/bin/qmake "CONFIG -= qt debug_and_release app_bundle lib_bundle" "CONFIG += shared use_gold_linker console single_arch" 'LIBS += -lfbxsdk -L/usr/local/lib -L/usr/lib' /home/kiosk/WEBKIT/qt-everywhere-opensource-src-5.9.1/qt3d/config.tests/fbx
  1178. + cd /home/kiosk/WEBKIT/qt-everywhere-opensource-src-5.9.1/build/config.tests/fbx && MAKEFLAGS= /usr/bin/make
  1179. > g++ -c -pipe -O2 -Wall -W -fPIC  -I/home/kiosk/WEBKIT/qt-everywhere-opensource-src-5.9.1/qt3d/config.tests/fbx -I. -I/home/kiosk/WEBKIT/qt-everywhere-opensource-src-5.9.1/qtbase/mkspecs/linux-g++ -o main.o /home/kiosk/WEBKIT/qt-everywhere-opensource-src-5.9.1/qt3d/config.tests/fbx/main.cpp
  1180. > /home/kiosk/WEBKIT/qt-everywhere-opensource-src-5.9.1/qt3d/config.tests/fbx/main.cpp:29:20: fatal error: fbxsdk.h: Нет такого файла или каталога
  1181. >  #include <fbxsdk.h>
  1182. >                     ^
  1183. > compilation terminated.
  1184. > Makefile:167: ошибка выполнения рецепта для цели «main.o»
  1185. > make: *** [main.o] Ошибка 1
  1186.  => source failed verification.
  1187. test config.geometryloaders.libraries.fbx FAILED
  1188. looking for library wayland-client
  1189. Trying source 0 (type pkgConfig) of library wayland-client ...
  1190. + /usr/bin/pkg-config --exists --silence-errors wayland-client
  1191. + /usr/bin/pkg-config --modversion wayland-client
  1192. > 1.12.0
  1193. + /usr/bin/pkg-config --libs-only-L wayland-client
  1194. + /usr/bin/pkg-config --libs-only-l wayland-client
  1195. > -lwayland-client
  1196. + /usr/bin/pkg-config --cflags wayland-client
  1197. + cd /home/kiosk/WEBKIT/qt-everywhere-opensource-src-5.9.1/build/config.tests/wayland && /home/kiosk/WEBKIT/qt-everywhere-opensource-src-5.9.1/build/qtbase/bin/qmake "CONFIG -= qt debug_and_release app_bundle lib_bundle" "CONFIG += shared use_gold_linker console single_arch" 'LIBS += -lwayland-client' /home/kiosk/WEBKIT/qt-everywhere-opensource-src-5.9.1/qtwayland/config.tests/wayland
  1198. + cd /home/kiosk/WEBKIT/qt-everywhere-opensource-src-5.9.1/build/config.tests/wayland && MAKEFLAGS= /usr/bin/make
  1199. > g++ -c -pipe -O2 -Wall -W -fPIC  -I/home/kiosk/WEBKIT/qt-everywhere-opensource-src-5.9.1/qtwayland/config.tests/wayland -I. -I/home/kiosk/WEBKIT/qt-everywhere-opensource-src-5.9.1/qtbase/mkspecs/linux-g++ -o main.o /home/kiosk/WEBKIT/qt-everywhere-opensource-src-5.9.1/qtwayland/config.tests/wayland/main.cpp
  1200. > g++ -Wl,-O1 -fuse-ld=gold -o wayland main.o   -lwayland-client
  1201.  => source accepted.
  1202. test config.client.libraries.wayland-client succeeded
  1203. looking for library wayland-cursor
  1204. Trying source 0 (type pkgConfig) of library wayland-cursor ...
  1205. + /usr/bin/pkg-config --exists --silence-errors wayland-cursor
  1206. + /usr/bin/pkg-config --modversion wayland-cursor
  1207. > 1.12.0
  1208. + /usr/bin/pkg-config --libs-only-L wayland-cursor
  1209. + /usr/bin/pkg-config --libs-only-l wayland-cursor
  1210. > -lwayland-cursor
  1211. + /usr/bin/pkg-config --cflags wayland-cursor
  1212. + cd /home/kiosk/WEBKIT/qt-everywhere-opensource-src-5.9.1/build/config.tests/wayland_cursor && /home/kiosk/WEBKIT/qt-everywhere-opensource-src-5.9.1/build/qtbase/bin/qmake "CONFIG -= qt debug_and_release app_bundle lib_bundle" "CONFIG += shared use_gold_linker console single_arch" 'LIBS += -lwayland-cursor' 'LIBS += -lwayland-client' /home/kiosk/WEBKIT/qt-everywhere-opensource-src-5.9.1/qtwayland/config.tests/wayland_cursor
  1213. + cd /home/kiosk/WEBKIT/qt-everywhere-opensource-src-5.9.1/build/config.tests/wayland_cursor && MAKEFLAGS= /usr/bin/make
  1214. > g++ -c -pipe -O2 -Wall -W -fPIC  -I/home/kiosk/WEBKIT/qt-everywhere-opensource-src-5.9.1/qtwayland/config.tests/wayland_cursor -I. -I/home/kiosk/WEBKIT/qt-everywhere-opensource-src-5.9.1/qtbase/mkspecs/linux-g++ -o main.o /home/kiosk/WEBKIT/qt-everywhere-opensource-src-5.9.1/qtwayland/config.tests/wayland_cursor/main.cpp
  1215. > /home/kiosk/WEBKIT/qt-everywhere-opensource-src-5.9.1/qtwayland/config.tests/wayland_cursor/main.cpp: In function ‘int main()’:
  1216. > /home/kiosk/WEBKIT/qt-everywhere-opensource-src-5.9.1/qtwayland/config.tests/wayland_cursor/main.cpp:45:29: warning: unused variable ‘image’ [-Wunused-variable]
  1217. >      struct wl_cursor_image *image = 0;
  1218. >                              ^~~~~
  1219. > g++ -Wl,-O1 -fuse-ld=gold -o wayland_cursor main.o   -lwayland-cursor -lwayland-client
  1220.  => source accepted.
  1221. test config.client.libraries.wayland-cursor succeeded
  1222. executing config test wayland-scanner
  1223. + cd /home/kiosk/WEBKIT/qt-everywhere-opensource-src-5.9.1/build/config.tests/wayland_scanner && /home/kiosk/WEBKIT/qt-everywhere-opensource-src-5.9.1/build/qtbase/bin/qmake "CONFIG -= qt debug_and_release app_bundle lib_bundle" "CONFIG += shared use_gold_linker console single_arch" 'LIBS += -lwayland-client' /home/kiosk/WEBKIT/qt-everywhere-opensource-src-5.9.1/qtwayland/config.tests/wayland_scanner
  1224. + cd /home/kiosk/WEBKIT/qt-everywhere-opensource-src-5.9.1/build/config.tests/wayland_scanner && MAKEFLAGS= /usr/bin/make
  1225. > wayland-scanner client-header < /home/kiosk/WEBKIT/qt-everywhere-opensource-src-5.9.1/qtwayland/config.tests/wayland_scanner/scanner-test.xml > wayland-scanner-test-client-protocol.h
  1226. > g++ -c -pipe -O2 -Wall -W -fPIC  -I/home/kiosk/WEBKIT/qt-everywhere-opensource-src-5.9.1/qtwayland/config.tests/wayland_scanner -I. -I/home/kiosk/WEBKIT/qt-everywhere-opensource-src-5.9.1/qtbase/mkspecs/linux-g++ -o main.o /home/kiosk/WEBKIT/qt-everywhere-opensource-src-5.9.1/qtwayland/config.tests/wayland_scanner/main.cpp
  1227. > g++ -Wl,-O1 -fuse-ld=gold -o wayland_scanner main.o   -lwayland-client
  1228. test config.client.tests.wayland-scanner succeeded
  1229. executing config test drm-egl-server
  1230. + cd /home/kiosk/WEBKIT/qt-everywhere-opensource-src-5.9.1/build/config.tests/drm_egl_server && /home/kiosk/WEBKIT/qt-everywhere-opensource-src-5.9.1/build/qtbase/bin/qmake "CONFIG -= qt debug_and_release app_bundle lib_bundle" "CONFIG += shared use_gold_linker console single_arch" 'LIBS += -lEGL' 'QMAKE_CFLAGS += -I/usr/include/libdrm' 'QMAKE_CXXFLAGS += -I/usr/include/libdrm' /home/kiosk/WEBKIT/qt-everywhere-opensource-src-5.9.1/qtwayland/config.tests/drm_egl_server
  1231. + cd /home/kiosk/WEBKIT/qt-everywhere-opensource-src-5.9.1/build/config.tests/drm_egl_server && MAKEFLAGS= /usr/bin/make
  1232. > g++ -c -pipe -I/usr/include/libdrm -O2 -Wall -W -fPIC  -I/home/kiosk/WEBKIT/qt-everywhere-opensource-src-5.9.1/qtwayland/config.tests/drm_egl_server -I. -I/home/kiosk/WEBKIT/qt-everywhere-opensource-src-5.9.1/qtbase/mkspecs/linux-g++ -o main.o /home/kiosk/WEBKIT/qt-everywhere-opensource-src-5.9.1/qtwayland/config.tests/drm_egl_server/main.cpp
  1233. > g++ -Wl,-O1 -fuse-ld=gold -o drm_egl_server main.o   -lEGL
  1234. test config.client.tests.drm-egl-server succeeded
  1235. executing config test libhybris-egl-server
  1236. + cd /home/kiosk/WEBKIT/qt-everywhere-opensource-src-5.9.1/build/config.tests/libhybris_egl_server && /home/kiosk/WEBKIT/qt-everywhere-opensource-src-5.9.1/build/qtbase/bin/qmake "CONFIG -= qt debug_and_release app_bundle lib_bundle" "CONFIG += shared use_gold_linker console single_arch" 'LIBS += -lEGL' 'QMAKE_CFLAGS += -I/usr/include/libdrm' 'QMAKE_CXXFLAGS += -I/usr/include/libdrm' /home/kiosk/WEBKIT/qt-everywhere-opensource-src-5.9.1/qtwayland/config.tests/libhybris_egl_server
  1237. + cd /home/kiosk/WEBKIT/qt-everywhere-opensource-src-5.9.1/build/config.tests/libhybris_egl_server && MAKEFLAGS= /usr/bin/make
  1238. > g++ -c -pipe -I/usr/include/libdrm -O2 -Wall -W -fPIC  -I/home/kiosk/WEBKIT/qt-everywhere-opensource-src-5.9.1/qtwayland/config.tests/libhybris_egl_server -I. -I/home/kiosk/WEBKIT/qt-everywhere-opensource-src-5.9.1/qtbase/mkspecs/linux-g++ -o main.o /home/kiosk/WEBKIT/qt-everywhere-opensource-src-5.9.1/qtwayland/config.tests/libhybris_egl_server/main.cpp
  1239. > /home/kiosk/WEBKIT/qt-everywhere-opensource-src-5.9.1/qtwayland/config.tests/libhybris_egl_server/main.cpp:43:61: fatal error: hybris/eglplatformcommon/hybris_nativebufferext.h: Нет такого файла или каталога
  1240. >  #include <hybris/eglplatformcommon/hybris_nativebufferext.h>
  1241. >                                                              ^
  1242. > compilation terminated.
  1243. > Makefile:167: ошибка выполнения рецепта для цели «main.o»
  1244. > make: *** [main.o] Ошибка 1
  1245. test config.client.tests.libhybris-egl-server FAILED
  1246. looking for library wayland-egl
  1247. Trying source 0 (type pkgConfig) of library wayland-egl ...
  1248. + /usr/bin/pkg-config --exists --silence-errors wayland-egl
  1249. + /usr/bin/pkg-config --modversion wayland-egl
  1250. > 11.2.0
  1251. + /usr/bin/pkg-config --libs-only-L wayland-egl
  1252. + /usr/bin/pkg-config --libs-only-l wayland-egl
  1253. > -lwayland-egl -lwayland-client
  1254. + /usr/bin/pkg-config --cflags wayland-egl
  1255. + cd /home/kiosk/WEBKIT/qt-everywhere-opensource-src-5.9.1/build/config.tests/wayland_egl && /home/kiosk/WEBKIT/qt-everywhere-opensource-src-5.9.1/build/qtbase/bin/qmake "CONFIG -= qt debug_and_release app_bundle lib_bundle" "CONFIG += shared use_gold_linker console single_arch" 'LIBS += -lwayland-egl -lwayland-client' /home/kiosk/WEBKIT/qt-everywhere-opensource-src-5.9.1/qtwayland/config.tests/wayland_egl
  1256. + cd /home/kiosk/WEBKIT/qt-everywhere-opensource-src-5.9.1/build/config.tests/wayland_egl && MAKEFLAGS= /usr/bin/make
  1257. > g++ -c -pipe -O2 -Wall -W -fPIC  -I/home/kiosk/WEBKIT/qt-everywhere-opensource-src-5.9.1/qtwayland/config.tests/wayland_egl -I. -I/home/kiosk/WEBKIT/qt-everywhere-opensource-src-5.9.1/qtbase/mkspecs/linux-g++ -o main.o /home/kiosk/WEBKIT/qt-everywhere-opensource-src-5.9.1/qtwayland/config.tests/wayland_egl/main.cpp
  1258. > /home/kiosk/WEBKIT/qt-everywhere-opensource-src-5.9.1/qtwayland/config.tests/wayland_egl/main.cpp: In function ‘int main()’:
  1259. > /home/kiosk/WEBKIT/qt-everywhere-opensource-src-5.9.1/qtwayland/config.tests/wayland_egl/main.cpp:45:27: warning: unused variable ‘window’ [-Wunused-variable]
  1260. >      struct wl_egl_window *window = wl_egl_window_create(0,100,100);
  1261. >                            ^~~~~~
  1262. > g++ -Wl,-O1 -fuse-ld=gold -o wayland_egl main.o   -lwayland-egl -lwayland-client
  1263.  => source accepted.
  1264. test config.client.libraries.wayland-egl succeeded
  1265. looking for library xcomposite
  1266. Trying source 0 (type pkgConfig) of library xcomposite ...
  1267. + /usr/bin/pkg-config --exists --silence-errors xcomposite
  1268. + /usr/bin/pkg-config --modversion xcomposite
  1269. > 0.4.4
  1270. + /usr/bin/pkg-config --libs-only-L xcomposite
  1271. + /usr/bin/pkg-config --libs-only-l xcomposite
  1272. > -lXcomposite
  1273. + /usr/bin/pkg-config --cflags xcomposite
  1274. + cd /home/kiosk/WEBKIT/qt-everywhere-opensource-src-5.9.1/build/config.tests/xcomposite && /home/kiosk/WEBKIT/qt-everywhere-opensource-src-5.9.1/build/qtbase/bin/qmake "CONFIG -= qt debug_and_release app_bundle lib_bundle" "CONFIG += shared use_gold_linker console single_arch" 'LIBS += -lXcomposite' /home/kiosk/WEBKIT/qt-everywhere-opensource-src-5.9.1/qtwayland/config.tests/xcomposite
  1275. + cd /home/kiosk/WEBKIT/qt-everywhere-opensource-src-5.9.1/build/config.tests/xcomposite && MAKEFLAGS= /usr/bin/make
  1276. > g++ -c -pipe -O2 -Wall -W -fPIC  -I/home/kiosk/WEBKIT/qt-everywhere-opensource-src-5.9.1/qtwayland/config.tests/xcomposite -I. -I/home/kiosk/WEBKIT/qt-everywhere-opensource-src-5.9.1/qtbase/mkspecs/linux-g++ -o main.o /home/kiosk/WEBKIT/qt-everywhere-opensource-src-5.9.1/qtwayland/config.tests/xcomposite/main.cpp
  1277. > /home/kiosk/WEBKIT/qt-everywhere-opensource-src-5.9.1/qtwayland/config.tests/xcomposite/main.cpp: In function ‘int main(int, char**)’:
  1278. > /home/kiosk/WEBKIT/qt-everywhere-opensource-src-5.9.1/qtwayland/config.tests/xcomposite/main.cpp:43:15: warning: unused parameter ‘argc’ [-Wunused-parameter]
  1279. >  int main (int argc, char **argv)
  1280. >                ^~~~
  1281. > /home/kiosk/WEBKIT/qt-everywhere-opensource-src-5.9.1/qtwayland/config.tests/xcomposite/main.cpp:43:28: warning: unused parameter ‘argv’ [-Wunused-parameter]
  1282. >  int main (int argc, char **argv)
  1283. >                             ^~~~
  1284. > g++ -Wl,-O1 -fuse-ld=gold -o xcomposite main.o   -lXcomposite
  1285.  => source accepted.
  1286. test config.client.libraries.xcomposite succeeded
  1287. looking for library glx
  1288. Trying source 0 (type pkgConfig) of library glx ...
  1289. + /usr/bin/pkg-config --exists --silence-errors x11 gl
  1290. + /usr/bin/pkg-config --modversion x11 gl
  1291. > 1.6.3
  1292. > 11.2.0
  1293. + /usr/bin/pkg-config --libs-only-L x11 gl
  1294. + /usr/bin/pkg-config --libs-only-l x11 gl
  1295. > -lX11 -lGL
  1296. + /usr/bin/pkg-config --cflags x11 gl
  1297. > -I/usr/include/libdrm
  1298. + cd /home/kiosk/WEBKIT/qt-everywhere-opensource-src-5.9.1/build/config.tests/glx && /home/kiosk/WEBKIT/qt-everywhere-opensource-src-5.9.1/build/qtbase/bin/qmake "CONFIG -= qt debug_and_release app_bundle lib_bundle" "CONFIG += shared use_gold_linker console single_arch" 'LIBS += -lX11 -lGL' 'QMAKE_CFLAGS += -I/usr/include/libdrm' 'QMAKE_CXXFLAGS += -I/usr/include/libdrm' /home/kiosk/WEBKIT/qt-everywhere-opensource-src-5.9.1/qtwayland/config.tests/glx
  1299. + cd /home/kiosk/WEBKIT/qt-everywhere-opensource-src-5.9.1/build/config.tests/glx && MAKEFLAGS= /usr/bin/make
  1300. > g++ -c -pipe -I/usr/include/libdrm -O2 -Wall -W -fPIC  -I/home/kiosk/WEBKIT/qt-everywhere-opensource-src-5.9.1/qtwayland/config.tests/glx -I. -I/home/kiosk/WEBKIT/qt-everywhere-opensource-src-5.9.1/qtbase/mkspecs/linux-g++ -o main.o /home/kiosk/WEBKIT/qt-everywhere-opensource-src-5.9.1/qtwayland/config.tests/glx/main.cpp
  1301. > /home/kiosk/WEBKIT/qt-everywhere-opensource-src-5.9.1/qtwayland/config.tests/glx/main.cpp: In function ‘int main(int, char**)’:
  1302. > /home/kiosk/WEBKIT/qt-everywhere-opensource-src-5.9.1/qtwayland/config.tests/glx/main.cpp:48:18: warning: unused variable ‘fbc’ [-Wunused-variable]
  1303. >      GLXFBConfig *fbc = glXChooseFBConfig(dpy, DefaultScreen(dpy), 0 , &items);
  1304. >                   ^~~
  1305. > /home/kiosk/WEBKIT/qt-everywhere-opensource-src-5.9.1/qtwayland/config.tests/glx/main.cpp:43:14: warning: unused parameter ‘argc’ [-Wunused-parameter]
  1306. >  int main(int argc, char **argv)
  1307. >               ^~~~
  1308. > /home/kiosk/WEBKIT/qt-everywhere-opensource-src-5.9.1/qtwayland/config.tests/glx/main.cpp:43:27: warning: unused parameter ‘argv’ [-Wunused-parameter]
  1309. >  int main(int argc, char **argv)
  1310. >                            ^~~~
  1311. > g++ -Wl,-O1 -fuse-ld=gold -o glx main.o   -lX11 -lGL
  1312.  => source accepted.
  1313. test config.client.libraries.glx succeeded
  1314. looking for library wayland-server
  1315. Trying source 0 (type pkgConfig) of library wayland-server ...
  1316. + /usr/bin/pkg-config --exists --silence-errors wayland-server
  1317. + /usr/bin/pkg-config --modversion wayland-server
  1318. > 1.12.0
  1319. + /usr/bin/pkg-config --libs-only-L wayland-server
  1320. + /usr/bin/pkg-config --libs-only-l wayland-server
  1321. > -lwayland-server
  1322. + /usr/bin/pkg-config --cflags wayland-server
  1323. + cd /home/kiosk/WEBKIT/qt-everywhere-opensource-src-5.9.1/build/config.tests/wayland && /home/kiosk/WEBKIT/qt-everywhere-opensource-src-5.9.1/build/qtbase/bin/qmake "CONFIG -= qt debug_and_release app_bundle lib_bundle" "CONFIG += shared use_gold_linker console single_arch" 'LIBS += -lwayland-server' /home/kiosk/WEBKIT/qt-everywhere-opensource-src-5.9.1/qtwayland/config.tests/wayland
  1324. + cd /home/kiosk/WEBKIT/qt-everywhere-opensource-src-5.9.1/build/config.tests/wayland && MAKEFLAGS= /usr/bin/make clean && MAKEFLAGS= /usr/bin/make
  1325. > rm -f main.o
  1326. > rm -f *~ core *.core
  1327. > g++ -c -pipe -O2 -Wall -W -fPIC  -I/home/kiosk/WEBKIT/qt-everywhere-opensource-src-5.9.1/qtwayland/config.tests/wayland -I. -I/home/kiosk/WEBKIT/qt-everywhere-opensource-src-5.9.1/qtbase/mkspecs/linux-g++ -o main.o /home/kiosk/WEBKIT/qt-everywhere-opensource-src-5.9.1/qtwayland/config.tests/wayland/main.cpp
  1328. > g++ -Wl,-O1 -fuse-ld=gold -o wayland main.o   -lwayland-server
  1329.  => source accepted.
  1330. test config.compositor.libraries.wayland-server succeeded
  1331. + cd /home/kiosk/WEBKIT/qt-everywhere-opensource-src-5.9.1/build/config.tests/wayland_scanner && /home/kiosk/WEBKIT/qt-everywhere-opensource-src-5.9.1/build/qtbase/bin/qmake "CONFIG -= qt debug_and_release app_bundle lib_bundle" "CONFIG += shared use_gold_linker console single_arch" 'LIBS += -lwayland-server' /home/kiosk/WEBKIT/qt-everywhere-opensource-src-5.9.1/qtwayland/config.tests/wayland_scanner
  1332. + cd /home/kiosk/WEBKIT/qt-everywhere-opensource-src-5.9.1/build/config.tests/wayland_scanner && MAKEFLAGS= /usr/bin/make clean && MAKEFLAGS= /usr/bin/make
  1333. > rm -f wayland-scanner-test-client-protocol.h
  1334. > rm -f main.o
  1335. > rm -f *~ core *.core
  1336. > wayland-scanner client-header < /home/kiosk/WEBKIT/qt-everywhere-opensource-src-5.9.1/qtwayland/config.tests/wayland_scanner/scanner-test.xml > wayland-scanner-test-client-protocol.h
  1337. > g++ -c -pipe -O2 -Wall -W -fPIC  -I/home/kiosk/WEBKIT/qt-everywhere-opensource-src-5.9.1/qtwayland/config.tests/wayland_scanner -I. -I/home/kiosk/WEBKIT/qt-everywhere-opensource-src-5.9.1/qtbase/mkspecs/linux-g++ -o main.o /home/kiosk/WEBKIT/qt-everywhere-opensource-src-5.9.1/qtwayland/config.tests/wayland_scanner/main.cpp
  1338. > g++ -Wl,-O1 -fuse-ld=gold -o wayland_scanner main.o   -lwayland-server
  1339. + cd /home/kiosk/WEBKIT/qt-everywhere-opensource-src-5.9.1/build/config.tests/drm_egl_server && /home/kiosk/WEBKIT/qt-everywhere-opensource-src-5.9.1/build/qtbase/bin/qmake "CONFIG -= qt debug_and_release app_bundle lib_bundle" "CONFIG += shared use_gold_linker console single_arch" 'LIBS += -lEGL' 'QMAKE_CFLAGS += -I/usr/include/libdrm' 'QMAKE_CXXFLAGS += -I/usr/include/libdrm' /home/kiosk/WEBKIT/qt-everywhere-opensource-src-5.9.1/qtwayland/config.tests/drm_egl_server
  1340. + cd /home/kiosk/WEBKIT/qt-everywhere-opensource-src-5.9.1/build/config.tests/drm_egl_server && MAKEFLAGS= /usr/bin/make clean && MAKEFLAGS= /usr/bin/make
  1341. > rm -f main.o
  1342. > rm -f *~ core *.core
  1343. > g++ -c -pipe -I/usr/include/libdrm -O2 -Wall -W -fPIC  -I/home/kiosk/WEBKIT/qt-everywhere-opensource-src-5.9.1/qtwayland/config.tests/drm_egl_server -I. -I/home/kiosk/WEBKIT/qt-everywhere-opensource-src-5.9.1/qtbase/mkspecs/linux-g++ -o main.o /home/kiosk/WEBKIT/qt-everywhere-opensource-src-5.9.1/qtwayland/config.tests/drm_egl_server/main.cpp
  1344. > g++ -Wl,-O1 -fuse-ld=gold -o drm_egl_server main.o   -lEGL
  1345. + cd /home/kiosk/WEBKIT/qt-everywhere-opensource-src-5.9.1/build/config.tests/libhybris_egl_server && /home/kiosk/WEBKIT/qt-everywhere-opensource-src-5.9.1/build/qtbase/bin/qmake "CONFIG -= qt debug_and_release app_bundle lib_bundle" "CONFIG += shared use_gold_linker console single_arch" 'LIBS += -lEGL' 'QMAKE_CFLAGS += -I/usr/include/libdrm' 'QMAKE_CXXFLAGS += -I/usr/include/libdrm' /home/kiosk/WEBKIT/qt-everywhere-opensource-src-5.9.1/qtwayland/config.tests/libhybris_egl_server
  1346. + cd /home/kiosk/WEBKIT/qt-everywhere-opensource-src-5.9.1/build/config.tests/libhybris_egl_server && MAKEFLAGS= /usr/bin/make clean && MAKEFLAGS= /usr/bin/make
  1347. > rm -f main.o
  1348. > rm -f *~ core *.core
  1349. > g++ -c -pipe -I/usr/include/libdrm -O2 -Wall -W -fPIC  -I/home/kiosk/WEBKIT/qt-everywhere-opensource-src-5.9.1/qtwayland/config.tests/libhybris_egl_server -I. -I/home/kiosk/WEBKIT/qt-everywhere-opensource-src-5.9.1/qtbase/mkspecs/linux-g++ -o main.o /home/kiosk/WEBKIT/qt-everywhere-opensource-src-5.9.1/qtwayland/config.tests/libhybris_egl_server/main.cpp
  1350. > /home/kiosk/WEBKIT/qt-everywhere-opensource-src-5.9.1/qtwayland/config.tests/libhybris_egl_server/main.cpp:43:61: fatal error: hybris/eglplatformcommon/hybris_nativebufferext.h: Нет такого файла или каталога
  1351. >  #include <hybris/eglplatformcommon/hybris_nativebufferext.h>
  1352. >                                                              ^
  1353. > compilation terminated.
  1354. > Makefile:167: ошибка выполнения рецепта для цели «main.o»
  1355. > make: *** [main.o] Ошибка 1
  1356. Trying source 0 (type pkgConfig) of library wayland-egl ...
  1357. + /usr/bin/pkg-config --exists --silence-errors wayland-egl
  1358. + /usr/bin/pkg-config --modversion wayland-egl
  1359. > 11.2.0
  1360. + /usr/bin/pkg-config --libs-only-L wayland-egl
  1361. + /usr/bin/pkg-config --libs-only-l wayland-egl
  1362. > -lwayland-egl -lwayland-client
  1363. + /usr/bin/pkg-config --cflags wayland-egl
  1364. + cd /home/kiosk/WEBKIT/qt-everywhere-opensource-src-5.9.1/build/config.tests/wayland_egl && /home/kiosk/WEBKIT/qt-everywhere-opensource-src-5.9.1/build/qtbase/bin/qmake "CONFIG -= qt debug_and_release app_bundle lib_bundle" "CONFIG += shared use_gold_linker console single_arch" 'LIBS += -lwayland-egl -lwayland-client' /home/kiosk/WEBKIT/qt-everywhere-opensource-src-5.9.1/qtwayland/config.tests/wayland_egl
  1365. + cd /home/kiosk/WEBKIT/qt-everywhere-opensource-src-5.9.1/build/config.tests/wayland_egl && MAKEFLAGS= /usr/bin/make clean && MAKEFLAGS= /usr/bin/make
  1366. > rm -f main.o
  1367. > rm -f *~ core *.core
  1368. > g++ -c -pipe -O2 -Wall -W -fPIC  -I/home/kiosk/WEBKIT/qt-everywhere-opensource-src-5.9.1/qtwayland/config.tests/wayland_egl -I. -I/home/kiosk/WEBKIT/qt-everywhere-opensource-src-5.9.1/qtbase/mkspecs/linux-g++ -o main.o /home/kiosk/WEBKIT/qt-everywhere-opensource-src-5.9.1/qtwayland/config.tests/wayland_egl/main.cpp
  1369. > /home/kiosk/WEBKIT/qt-everywhere-opensource-src-5.9.1/qtwayland/config.tests/wayland_egl/main.cpp: In function ‘int main()’:
  1370. > /home/kiosk/WEBKIT/qt-everywhere-opensource-src-5.9.1/qtwayland/config.tests/wayland_egl/main.cpp:45:27: warning: unused variable ‘window’ [-Wunused-variable]
  1371. >      struct wl_egl_window *window = wl_egl_window_create(0,100,100);
  1372. >                            ^~~~~~
  1373. > g++ -Wl,-O1 -fuse-ld=gold -o wayland_egl main.o   -lwayland-egl -lwayland-client
  1374.  => source accepted.
  1375. Trying source 0 (type pkgConfig) of library xcomposite ...
  1376. + /usr/bin/pkg-config --exists --silence-errors xcomposite
  1377. + /usr/bin/pkg-config --modversion xcomposite
  1378. > 0.4.4
  1379. + /usr/bin/pkg-config --libs-only-L xcomposite
  1380. + /usr/bin/pkg-config --libs-only-l xcomposite
  1381. > -lXcomposite
  1382. + /usr/bin/pkg-config --cflags xcomposite
  1383. + cd /home/kiosk/WEBKIT/qt-everywhere-opensource-src-5.9.1/build/config.tests/xcomposite && /home/kiosk/WEBKIT/qt-everywhere-opensource-src-5.9.1/build/qtbase/bin/qmake "CONFIG -= qt debug_and_release app_bundle lib_bundle" "CONFIG += shared use_gold_linker console single_arch" 'LIBS += -lXcomposite' /home/kiosk/WEBKIT/qt-everywhere-opensource-src-5.9.1/qtwayland/config.tests/xcomposite
  1384. + cd /home/kiosk/WEBKIT/qt-everywhere-opensource-src-5.9.1/build/config.tests/xcomposite && MAKEFLAGS= /usr/bin/make clean && MAKEFLAGS= /usr/bin/make
  1385. > rm -f main.o
  1386. > rm -f *~ core *.core
  1387. > g++ -c -pipe -O2 -Wall -W -fPIC  -I/home/kiosk/WEBKIT/qt-everywhere-opensource-src-5.9.1/qtwayland/config.tests/xcomposite -I. -I/home/kiosk/WEBKIT/qt-everywhere-opensource-src-5.9.1/qtbase/mkspecs/linux-g++ -o main.o /home/kiosk/WEBKIT/qt-everywhere-opensource-src-5.9.1/qtwayland/config.tests/xcomposite/main.cpp
  1388. > /home/kiosk/WEBKIT/qt-everywhere-opensource-src-5.9.1/qtwayland/config.tests/xcomposite/main.cpp: In function ‘int main(int, char**)’:
  1389. > /home/kiosk/WEBKIT/qt-everywhere-opensource-src-5.9.1/qtwayland/config.tests/xcomposite/main.cpp:43:15: warning: unused parameter ‘argc’ [-Wunused-parameter]
  1390. >  int main (int argc, char **argv)
  1391. >                ^~~~
  1392. > /home/kiosk/WEBKIT/qt-everywhere-opensource-src-5.9.1/qtwayland/config.tests/xcomposite/main.cpp:43:28: warning: unused parameter ‘argv’ [-Wunused-parameter]
  1393. >  int main (int argc, char **argv)
  1394. >                             ^~~~
  1395. > g++ -Wl,-O1 -fuse-ld=gold -o xcomposite main.o   -lXcomposite
  1396.  => source accepted.
  1397. Trying source 0 (type pkgConfig) of library glx ...
  1398. + /usr/bin/pkg-config --exists --silence-errors x11 gl
  1399. + /usr/bin/pkg-config --modversion x11 gl
  1400. > 1.6.3
  1401. > 11.2.0
  1402. + /usr/bin/pkg-config --libs-only-L x11 gl
  1403. + /usr/bin/pkg-config --libs-only-l x11 gl
  1404. > -lX11 -lGL
  1405. + /usr/bin/pkg-config --cflags x11 gl
  1406. > -I/usr/include/libdrm
  1407. + cd /home/kiosk/WEBKIT/qt-everywhere-opensource-src-5.9.1/build/config.tests/glx && /home/kiosk/WEBKIT/qt-everywhere-opensource-src-5.9.1/build/qtbase/bin/qmake "CONFIG -= qt debug_and_release app_bundle lib_bundle" "CONFIG += shared use_gold_linker console single_arch" 'LIBS += -lX11 -lGL' 'QMAKE_CFLAGS += -I/usr/include/libdrm' 'QMAKE_CXXFLAGS += -I/usr/include/libdrm' /home/kiosk/WEBKIT/qt-everywhere-opensource-src-5.9.1/qtwayland/config.tests/glx
  1408. + cd /home/kiosk/WEBKIT/qt-everywhere-opensource-src-5.9.1/build/config.tests/glx && MAKEFLAGS= /usr/bin/make clean && MAKEFLAGS= /usr/bin/make
  1409. > rm -f main.o
  1410. > rm -f *~ core *.core
  1411. > g++ -c -pipe -I/usr/include/libdrm -O2 -Wall -W -fPIC  -I/home/kiosk/WEBKIT/qt-everywhere-opensource-src-5.9.1/qtwayland/config.tests/glx -I. -I/home/kiosk/WEBKIT/qt-everywhere-opensource-src-5.9.1/qtbase/mkspecs/linux-g++ -o main.o /home/kiosk/WEBKIT/qt-everywhere-opensource-src-5.9.1/qtwayland/config.tests/glx/main.cpp
  1412. > /home/kiosk/WEBKIT/qt-everywhere-opensource-src-5.9.1/qtwayland/config.tests/glx/main.cpp: In function ‘int main(int, char**)’:
  1413. > /home/kiosk/WEBKIT/qt-everywhere-opensource-src-5.9.1/qtwayland/config.tests/glx/main.cpp:48:18: warning: unused variable ‘fbc’ [-Wunused-variable]
  1414. >      GLXFBConfig *fbc = glXChooseFBConfig(dpy, DefaultScreen(dpy), 0 , &items);
  1415. >                   ^~~
  1416. > /home/kiosk/WEBKIT/qt-everywhere-opensource-src-5.9.1/qtwayland/config.tests/glx/main.cpp:43:14: warning: unused parameter ‘argc’ [-Wunused-parameter]
  1417. >  int main(int argc, char **argv)
  1418. >               ^~~~
  1419. > /home/kiosk/WEBKIT/qt-everywhere-opensource-src-5.9.1/qtwayland/config.tests/glx/main.cpp:43:27: warning: unused parameter ‘argv’ [-Wunused-parameter]
  1420. >  int main(int argc, char **argv)
  1421. >                            ^~~~
  1422. > g++ -Wl,-O1 -fuse-ld=gold -o glx main.o   -lX11 -lGL
  1423.  => source accepted.
  1424. looking for library bluez
  1425. Trying source 0 (type pkgConfig) of library bluez ...
  1426. + /usr/bin/pkg-config --exists --silence-errors bluez
  1427. pkg-config did not find package.
  1428.   => source produced no result.
  1429. Trying source 1 (type inline) of library bluez ...
  1430. + cd /home/kiosk/WEBKIT/qt-everywhere-opensource-src-5.9.1/build/config.tests/bluez && /home/kiosk/WEBKIT/qt-everywhere-opensource-src-5.9.1/build/qtbase/bin/qmake "CONFIG -= qt debug_and_release app_bundle lib_bundle" "CONFIG += shared use_gold_linker console single_arch" 'LIBS += -lbluetooth' /home/kiosk/WEBKIT/qt-everywhere-opensource-src-5.9.1/qtconnectivity/config.tests/bluez
  1431. + cd /home/kiosk/WEBKIT/qt-everywhere-opensource-src-5.9.1/build/config.tests/bluez && MAKEFLAGS= /usr/bin/make
  1432. > g++ -c -pipe -O2 -Wall -W -fPIC  -I/home/kiosk/WEBKIT/qt-everywhere-opensource-src-5.9.1/qtconnectivity/config.tests/bluez -I. -I/home/kiosk/WEBKIT/qt-everywhere-opensource-src-5.9.1/qtbase/mkspecs/linux-g++ -o main.o /home/kiosk/WEBKIT/qt-everywhere-opensource-src-5.9.1/qtconnectivity/config.tests/bluez/main.cpp
  1433. > /home/kiosk/WEBKIT/qt-everywhere-opensource-src-5.9.1/qtconnectivity/config.tests/bluez/main.cpp:29:33: fatal error: bluetooth/bluetooth.h: Нет такого файла или каталога
  1434. >  #include <bluetooth/bluetooth.h>
  1435. >                                  ^
  1436. > compilation terminated.
  1437. > Makefile:167: ошибка выполнения рецепта для цели «main.o»
  1438. > make: *** [main.o] Ошибка 1
  1439.  => source failed verification.
  1440. test config.bluetooth.libraries.bluez FAILED
  1441. looking for library sensorfw
  1442. Trying source 0 (type pkgConfig) of library sensorfw ...
  1443. + /usr/bin/pkg-config --exists --silence-errors sensord-qt5
  1444. pkg-config did not find package.
  1445.   => source produced no result.
  1446. test config.sensors.libraries.sensorfw FAILED
  1447. looking for library alsa
  1448. Trying source 0 (type inline) of library alsa ...
  1449. + cd /home/kiosk/WEBKIT/qt-everywhere-opensource-src-5.9.1/build/config.tests/alsa && /home/kiosk/WEBKIT/qt-everywhere-opensource-src-5.9.1/build/qtbase/bin/qmake "CONFIG -= qt debug_and_release app_bundle lib_bundle" "CONFIG += shared use_gold_linker console single_arch" 'LIBS += -lasound' /home/kiosk/WEBKIT/qt-everywhere-opensource-src-5.9.1/qtmultimedia/config.tests/alsa
  1450. + cd /home/kiosk/WEBKIT/qt-everywhere-opensource-src-5.9.1/build/config.tests/alsa && MAKEFLAGS= /usr/bin/make
  1451. > g++ -c -pipe -O2 -Wall -W -fPIC  -I/home/kiosk/WEBKIT/qt-everywhere-opensource-src-5.9.1/qtmultimedia/config.tests/alsa -I. -I/home/kiosk/WEBKIT/qt-everywhere-opensource-src-5.9.1/qtbase/mkspecs/linux-g++ -o alsatest.o /home/kiosk/WEBKIT/qt-everywhere-opensource-src-5.9.1/qtmultimedia/config.tests/alsa/alsatest.cpp
  1452. > /home/kiosk/WEBKIT/qt-everywhere-opensource-src-5.9.1/qtmultimedia/config.tests/alsa/alsatest.cpp: In function ‘int main(int, char**)’:
  1453. > /home/kiosk/WEBKIT/qt-everywhere-opensource-src-5.9.1/qtmultimedia/config.tests/alsa/alsatest.cpp:34:14: warning: unused parameter ‘argc’ [-Wunused-parameter]
  1454. >  int main(int argc,char **argv)
  1455. >               ^~~~
  1456. > /home/kiosk/WEBKIT/qt-everywhere-opensource-src-5.9.1/qtmultimedia/config.tests/alsa/alsatest.cpp:34:26: warning: unused parameter ‘argv’ [-Wunused-parameter]
  1457. >  int main(int argc,char **argv)
  1458. >                           ^~~~
  1459. > g++ -Wl,-O1 -fuse-ld=gold -o alsa alsatest.o   -lasound
  1460.  => source accepted.
  1461. test config.multimedia.libraries.alsa succeeded
  1462. looking for library gstreamer_1_0
  1463. Trying source 0 (type pkgConfig) of library gstreamer_1_0 ...
  1464. + /usr/bin/pkg-config --exists --silence-errors gstreamer-1.0 gstreamer-base-1.0 gstreamer-audio-1.0 gstreamer-video-1.0 gstreamer-pbutils-1.0
  1465. pkg-config did not find package.
  1466.   => source produced no result.
  1467. test config.multimedia.libraries.gstreamer_1_0 FAILED
  1468. looking for library gstreamer_0_10
  1469. Trying source 0 (type pkgConfig) of library gstreamer_0_10 ...
  1470. + /usr/bin/pkg-config --exists --silence-errors gstreamer-0.10 gstreamer-base-0.10 gstreamer-audio-0.10 gstreamer-video-0.10 gstreamer-pbutils-0.10 gstreamer-interfaces-0.10
  1471. pkg-config did not find package.
  1472.   => source produced no result.
  1473. test config.multimedia.libraries.gstreamer_0_10 FAILED
  1474. executing config test linux_v4l
  1475. + cd /home/kiosk/WEBKIT/qt-everywhere-opensource-src-5.9.1/build/config.tests/linux_v4l && /home/kiosk/WEBKIT/qt-everywhere-opensource-src-5.9.1/build/qtbase/bin/qmake "CONFIG -= qt debug_and_release app_bundle lib_bundle" "CONFIG += shared use_gold_linker console single_arch" /home/kiosk/WEBKIT/qt-everywhere-opensource-src-5.9.1/qtmultimedia/config.tests/linux_v4l
  1476. + cd /home/kiosk/WEBKIT/qt-everywhere-opensource-src-5.9.1/build/config.tests/linux_v4l && MAKEFLAGS= /usr/bin/make
  1477. > g++ -c -pipe -O2 -Wall -W -fPIC  -I/home/kiosk/WEBKIT/qt-everywhere-opensource-src-5.9.1/qtmultimedia/config.tests/linux_v4l -I. -I/home/kiosk/WEBKIT/qt-everywhere-opensource-src-5.9.1/qtbase/mkspecs/linux-g++ -o main.o /home/kiosk/WEBKIT/qt-everywhere-opensource-src-5.9.1/qtmultimedia/config.tests/linux_v4l/main.cpp
  1478. > /home/kiosk/WEBKIT/qt-everywhere-opensource-src-5.9.1/qtmultimedia/config.tests/linux_v4l/main.cpp: In function ‘int main(int, char**)’:
  1479. > /home/kiosk/WEBKIT/qt-everywhere-opensource-src-5.9.1/qtmultimedia/config.tests/linux_v4l/main.cpp:31:14: warning: unused parameter ‘argc’ [-Wunused-parameter]
  1480. >  int main(int argc, char** argv)
  1481. >               ^~~~
  1482. > /home/kiosk/WEBKIT/qt-everywhere-opensource-src-5.9.1/qtmultimedia/config.tests/linux_v4l/main.cpp:31:27: warning: unused parameter ‘argv’ [-Wunused-parameter]
  1483. >  int main(int argc, char** argv)
  1484. >                            ^~~~
  1485. > g++ -Wl,-O1 -fuse-ld=gold -o linux_v4l main.o    
  1486. test config.multimedia.tests.linux_v4l succeeded
  1487. looking for library openal
  1488. Trying source 0 (type pkgConfig) of library openal ...
  1489. + /usr/bin/pkg-config --exists --silence-errors openal
  1490. pkg-config did not find package.
  1491.   => source produced no result.
  1492. Trying source 1 (type inline) of library openal ...
  1493.   => source failed condition 'config.win32'.
  1494. Trying source 2 (type inline) of library openal ...
  1495.   => source failed condition 'config.darwin'.
  1496. Trying source 3 (type inline) of library openal ...
  1497. + cd /home/kiosk/WEBKIT/qt-everywhere-opensource-src-5.9.1/build/config.tests/openal && /home/kiosk/WEBKIT/qt-everywhere-opensource-src-5.9.1/build/qtbase/bin/qmake "CONFIG -= qt debug_and_release app_bundle lib_bundle" "CONFIG += shared use_gold_linker console single_arch" 'LIBS += -lopenal' /home/kiosk/WEBKIT/qt-everywhere-opensource-src-5.9.1/qtmultimedia/config.tests/openal
  1498. + cd /home/kiosk/WEBKIT/qt-everywhere-opensource-src-5.9.1/build/config.tests/openal && MAKEFLAGS= /usr/bin/make
  1499. > g++ -c -pipe -O2 -Wall -W -fPIC  -I/home/kiosk/WEBKIT/qt-everywhere-opensource-src-5.9.1/qtmultimedia/config.tests/openal -I. -I/home/kiosk/WEBKIT/qt-everywhere-opensource-src-5.9.1/qtbase/mkspecs/linux-g++ -o main.o /home/kiosk/WEBKIT/qt-everywhere-opensource-src-5.9.1/qtmultimedia/config.tests/openal/main.cpp
  1500. > /home/kiosk/WEBKIT/qt-everywhere-opensource-src-5.9.1/qtmultimedia/config.tests/openal/main.cpp:32:19: fatal error: AL/al.h: Нет такого файла или каталога
  1501. >  #include <AL/al.h>
  1502. >                    ^
  1503. > compilation terminated.
  1504. > Makefile:167: ошибка выполнения рецепта для цели «main.o»
  1505. > make: *** [main.o] Ошибка 1
  1506.  => source failed verification.
  1507. test config.multimedia.libraries.openal FAILED
  1508. looking for library pulseaudio
  1509. Trying source 0 (type pkgConfig) of library pulseaudio ...
  1510. + /usr/bin/pkg-config --exists --silence-errors libpulse '>=' 0.9.10 libpulse-mainloop-glib
  1511. pkg-config did not find package.
  1512.   => source produced no result.
  1513. test config.multimedia.libraries.pulseaudio FAILED
  1514. looking for library libresourceqt5
  1515. Trying source 0 (type pkgConfig) of library libresourceqt5 ...
  1516. + /usr/bin/pkg-config --exists --silence-errors libresourceqt5
  1517. pkg-config did not find package.
  1518.   => source produced no result.
  1519. test config.multimedia.libraries.libresourceqt5 FAILED
  1520. looking for library gypsy
  1521. Trying source 0 (type pkgConfig) of library gypsy ...
  1522. + /usr/bin/pkg-config --exists --silence-errors gypsy gconf-2.0
  1523. pkg-config did not find package.
  1524.   => source produced no result.
  1525. test config.positioning.libraries.gypsy FAILED
  1526. executing config test winrt_geolocation
  1527. + cd /home/kiosk/WEBKIT/qt-everywhere-opensource-src-5.9.1/build/config.tests/winrt && /home/kiosk/WEBKIT/qt-everywhere-opensource-src-5.9.1/build/qtbase/bin/qmake "CONFIG -= qt debug_and_release app_bundle lib_bundle" "CONFIG += shared use_gold_linker console single_arch" /home/kiosk/WEBKIT/qt-everywhere-opensource-src-5.9.1/qtlocation/config.tests/winrt
  1528. + cd /home/kiosk/WEBKIT/qt-everywhere-opensource-src-5.9.1/build/config.tests/winrt && MAKEFLAGS= /usr/bin/make
  1529. > g++ -c -pipe -O2 -Wall -W -fPIC  -I/home/kiosk/WEBKIT/qt-everywhere-opensource-src-5.9.1/qtlocation/config.tests/winrt -I. -I/home/kiosk/WEBKIT/qt-everywhere-opensource-src-5.9.1/qtbase/mkspecs/linux-g++ -o main.o /home/kiosk/WEBKIT/qt-everywhere-opensource-src-5.9.1/qtlocation/config.tests/winrt/main.cpp
  1530. > /home/kiosk/WEBKIT/qt-everywhere-opensource-src-5.9.1/qtlocation/config.tests/winrt/main.cpp:30:28: fatal error: windows.system.h: Нет такого файла или каталога
  1531. >  #include <windows.system.h>
  1532. >                             ^
  1533. > compilation terminated.
  1534. > Makefile:167: ошибка выполнения рецепта для цели «main.o»
  1535. > make: *** [main.o] Ошибка 1
  1536. test config.positioning.tests.winrt_geolocation FAILED
  1537. looking for library alsa
  1538. Trying source 0 (type inline) of library alsa ...
  1539. + cd /home/kiosk/WEBKIT/qt-everywhere-opensource-src-5.9.1/build/config.tests/alsa && /home/kiosk/WEBKIT/qt-everywhere-opensource-src-5.9.1/build/qtbase/bin/qmake "CONFIG -= qt debug_and_release app_bundle lib_bundle" "CONFIG += shared use_gold_linker console single_arch" 'LIBS += -lasound' /home/kiosk/WEBKIT/qt-everywhere-opensource-src-5.9.1/qtwebengine/config.tests/alsa
  1540. + cd /home/kiosk/WEBKIT/qt-everywhere-opensource-src-5.9.1/build/config.tests/alsa && MAKEFLAGS= /usr/bin/make clean && MAKEFLAGS= /usr/bin/make
  1541. > rm -f alsatest.o
  1542. > rm -f *~ core *.core
  1543. > g++ -c -pipe -O2 -Wall -W -fPIC  -I/home/kiosk/WEBKIT/qt-everywhere-opensource-src-5.9.1/qtwebengine/config.tests/alsa -I. -I/home/kiosk/WEBKIT/qt-everywhere-opensource-src-5.9.1/qtbase/mkspecs/linux-g++ -o alsatest.o /home/kiosk/WEBKIT/qt-everywhere-opensource-src-5.9.1/qtwebengine/config.tests/alsa/alsatest.cpp
  1544. > /home/kiosk/WEBKIT/qt-everywhere-opensource-src-5.9.1/qtwebengine/config.tests/alsa/alsatest.cpp: In function ‘int main(int, char**)’:
  1545. > /home/kiosk/WEBKIT/qt-everywhere-opensource-src-5.9.1/qtwebengine/config.tests/alsa/alsatest.cpp:34:14: warning: unused parameter ‘argc’ [-Wunused-parameter]
  1546. >  int main(int argc,char **argv)
  1547. >               ^~~~
  1548. > /home/kiosk/WEBKIT/qt-everywhere-opensource-src-5.9.1/qtwebengine/config.tests/alsa/alsatest.cpp:34:26: warning: unused parameter ‘argv’ [-Wunused-parameter]
  1549. >  int main(int argc,char **argv)
  1550. >                           ^~~~
  1551. > g++ -Wl,-O1 -fuse-ld=gold -o alsa alsatest.o   -lasound
  1552.  => source accepted.
  1553. test config.qtwebengine.libraries.alsa succeeded
  1554. executing config test embedded
  1555. test config.qtwebengine.tests.embedded FAILED
  1556. looking for library pulseaudio
  1557. Trying source 0 (type pkgConfig) of library pulseaudio ...
  1558. + /usr/bin/pkg-config --exists --silence-errors libpulse '>=' 0.9.10 libpulse-mainloop-glib
  1559. pkg-config did not find package.
  1560.   => source produced no result.
  1561. test config.qtwebengine.libraries.pulseaudio FAILED
  1562. executing config test python2
  1563. test config.qtwebengine.tests.python2 gave result /usr/bin/python2
  1564. executing config test ninja
  1565. Building own ninja
  1566. test config.qtwebengine.tests.ninja FAILED
  1567. looking for library opus
  1568. Trying source 0 (type pkgConfig) of library opus ...
  1569. + /usr/bin/pkg-config --exists --silence-errors opus
  1570. pkg-config did not find package.
  1571.   => source produced no result.
  1572. test config.qtwebengine.libraries.opus FAILED
  1573. looking for library webp
  1574. Trying source 0 (type pkgConfig) of library webp ...
  1575. + /usr/bin/pkg-config --exists --silence-errors libwebp libwebpdemux
  1576. pkg-config did not find package.
  1577.   => source produced no result.
  1578. test config.qtwebengine.libraries.webp FAILED
RAW Paste Data
We use cookies for various purposes including analytics. By continuing to use Pastebin, you agree to our use of cookies as described in the Cookies Policy. OK, I Understand
 
Top