daily pastebin goal
90%
SHARE
TWEET

Untitled

a guest Feb 13th, 2018 55 Never
Not a member of Pastebin yet? Sign Up, it unlocks many cool features!
  1. Makefile:11123: recipe for target 'test-suite.log' failed
  2. make[6]: *** [test-suite.log] Error 1
  3. make[6]: Leaving directory '/home/aleksa/grub2-2.02/obj/grub-pc'
  4. Makefile:11229: recipe for target 'check-TESTS' failed
  5. make[5]: *** [check-TESTS] Error 2
  6. make[5]: Leaving directory '/home/aleksa/grub2-2.02/obj/grub-pc'
  7. Makefile:12020: recipe for target 'check-am' failed
  8. make[4]: *** [check-am] Error 2
  9. make[4]: Leaving directory '/home/aleksa/grub2-2.02/obj/grub-pc'
  10. Makefile:11009: recipe for target 'check-recursive' failed
  11. make[3]: *** [check-recursive] Error 1
  12. make[3]: Leaving directory '/home/aleksa/grub2-2.02/obj/grub-pc'
  13. Makefile:12023: recipe for target 'check' failed
  14. make[2]: *** [check] Error 2
  15. make[2]: Leaving directory '/home/aleksa/grub2-2.02/obj/grub-pc'
  16. dh_auto_test: cd obj/grub-pc && make -j1 check VERBOSE=1 returned exit code 2
  17. debian/rules:220: recipe for target 'debian/stamps/build-grub-pc' failed
  18. make[1]: *** [debian/stamps/build-grub-pc] Error 2
  19. make[1]: Leaving directory '/home/aleksa/grub2-2.02'
  20. debian/rules:117: recipe for target 'build' failed
  21. make: *** [build] Error 2
RAW Paste Data
Top