Guest User

Error Log

a guest
Jan 29th, 2022
96
0
Never
Not a member of Pastebin yet? Sign Up, it unlocks many cool features!
text 42.50 KB | None | 0 0
  1. 12:09:43: Executing task 'runClient'...
  2.  
  3.  
  4. > Configure project :
  5. Java: 16 JVM: 16+36-2231(Oracle Corporation) Arch: amd64
  6.  
  7. > Task :compileJava
  8. > Task :processResources
  9. > Task :classes
  10. > Task :downloadMcpConfig
  11. > Task :extractSrg
  12. > Task :createSrgToMcp
  13. > Task :downloadMCMeta UP-TO-DATE
  14. > Task :downloadAssets UP-TO-DATE
  15. > Task :extractNatives
  16. > Task :makeSrcDirs
  17. > Task :prepareRuns
  18. > Task :prepareRunClient
  19.  
  20. > Task :runClient
  21. 2022-01-29 12:09:46,946 main WARN Advanced terminal features are not available in this environment
  22. [12:09:47] [main/INFO] [cp.mo.mo.Launcher/MODLAUNCHER]: ModLauncher running: args [--gameDir, ., --launchTarget, fmluserdevclient, --fml.mcpVersion, 20200812.004259, --fml.mcVersion, 1.16.2, --fml.forgeGroup, net.minecraftforge, --fml.forgeVersion, 33.0.61, --version, MOD_DEV, --assetIndex, 1.16, --assetsDir, C:\Users\Sammy_HD\.gradle\caches\forge_gradle\assets, --username, Dev, --accessToken, ????????, --userProperties, {}]
  23. [12:09:47] [main/INFO] [cp.mo.mo.Launcher/MODLAUNCHER]: ModLauncher 7.0.1+78+master.e9771d8 starting: java version 1.8.0_311 by Oracle Corporation
  24. [12:09:47] [main/DEBUG] [cp.mo.mo.LaunchServiceHandler/MODLAUNCHER]: Found launch services [minecraft,fmldevdata,fmldevclient,fmldevserver,fmluserdevserver,testharness,fmluserdevdata,fmlclient,fmluserdevclient,fmlserver]
  25. [12:09:47] [main/DEBUG] [cp.mo.mo.NameMappingServiceHandler/MODLAUNCHER]: Found naming services : [srgtomcp]
  26. [12:09:47] [main/DEBUG] [cp.mo.mo.LaunchPluginHandler/MODLAUNCHER]: Found launch plugins: [mixin,eventbus,object_holder_definalize,runtime_enum_extender,accesstransformer,capability_inject_definalize,runtimedistcleaner]
  27. [12:09:47] [main/DEBUG] [cp.mo.mo.TransformationServicesHandler/MODLAUNCHER]: Discovering transformation services
  28. [12:09:47] [main/DEBUG] [cp.mo.mo.TransformationServicesHandler/MODLAUNCHER]: Found additional transformation services from discovery services: []
  29. [12:09:47] [main/DEBUG] [cp.mo.mo.TransformationServicesHandler/MODLAUNCHER]: Found transformer services : [mixin,fml]
  30. [12:09:47] [main/DEBUG] [cp.mo.mo.TransformationServicesHandler/MODLAUNCHER]: Transformation services loading
  31. [12:09:47] [main/DEBUG] [cp.mo.mo.TransformationServiceDecorator/MODLAUNCHER]: Loading service mixin
  32. [12:09:47] [main/DEBUG] [cp.mo.mo.TransformationServiceDecorator/MODLAUNCHER]: Loaded service mixin
  33. [12:09:47] [main/DEBUG] [cp.mo.mo.TransformationServiceDecorator/MODLAUNCHER]: Loading service fml
  34. [12:09:47] [main/DEBUG] [ne.mi.fm.lo.FMLServiceProvider/]: Injecting tracing printstreams for STDOUT/STDERR.
  35. [12:09:47] [main/DEBUG] [ne.mi.fm.lo.LauncherVersion/CORE]: Found FMLLauncher version 33.0
  36. [12:09:47] [main/DEBUG] [ne.mi.fm.lo.FMLLoader/CORE]: FML 33.0 loading
  37. [12:09:47] [main/DEBUG] [ne.mi.fm.lo.FMLLoader/CORE]: FML found ModLauncher version : 7.0.1+78+master.e9771d8
  38. [12:09:47] [main/DEBUG] [ne.mi.fm.lo.FMLLoader/CORE]: Initializing modjar URL handler
  39. [12:09:47] [main/DEBUG] [ne.mi.fm.lo.FMLLoader/CORE]: FML found AccessTransformer version : 2.2.0+57+master.16c1bdb
  40. [12:09:47] [main/DEBUG] [ne.mi.fm.lo.FMLLoader/CORE]: FML found EventBus version : 3.0.3+63+master.b6b4769
  41. [12:09:47] [main/DEBUG] [ne.mi.fm.lo.FMLLoader/CORE]: Found Runtime Dist Cleaner
  42. [12:09:47] [main/DEBUG] [ne.mi.fm.lo.FMLLoader/CORE]: FML found CoreMod version : 3.0.0+9+master.3817658
  43. [12:09:47] [main/DEBUG] [ne.mi.fm.lo.FMLLoader/CORE]: Found ForgeSPI package implementation version 3.1.1+12+master.3ce14ad
  44. [12:09:47] [main/DEBUG] [ne.mi.fm.lo.FMLLoader/CORE]: Found ForgeSPI package specification 3
  45. [12:09:47] [main/INFO] [ne.mi.fm.lo.FixSSL/CORE]: Added Lets Encrypt root certificates as additional trust
  46. [12:09:47] [main/DEBUG] [cp.mo.mo.TransformationServiceDecorator/MODLAUNCHER]: Loaded service fml
  47. [12:09:47] [main/DEBUG] [cp.mo.mo.TransformationServicesHandler/MODLAUNCHER]: Configuring option handling for services
  48. [12:09:47] [main/DEBUG] [cp.mo.mo.TransformationServicesHandler/MODLAUNCHER]: Transformation services initializing
  49. [12:09:47] [main/DEBUG] [cp.mo.mo.TransformationServiceDecorator/MODLAUNCHER]: Initializing transformation service mixin
  50. [12:09:47] [main/DEBUG] [mixin/]: Mixin bootstrap service org.spongepowered.asm.service.mojang.MixinServiceLaunchWrapperBootstrap is not available: LaunchWrapper is not available
  51. [12:09:47] [main/DEBUG] [mixin/]: MixinService [ModLauncher] was successfully booted in sun.misc.Launcher$AppClassLoader@4e25154f
  52. [12:09:47] [main/INFO] [mixin/]: SpongePowered MIXIN Subsystem Version=0.8 Source=file:/C:/Users/Sammy_HD/.gradle/caches/modules-2/files-2.1/org.spongepowered/mixin/0.8/dbe9e5db694a7c3cd644d5bb98f8a21295c75048/mixin-0.8.jar Service=ModLauncher Env=CLIENT
  53. [12:09:47] [main/DEBUG] [mixin/]: Initialising Mixin Platform Manager
  54. [12:09:47] [main/DEBUG] [mixin/]: Adding mixin platform agents for container ModLauncher Root Container(4f56a0a2)
  55. [12:09:47] [main/DEBUG] [mixin/]: Instancing new MixinPlatformAgentMinecraftForge for ModLauncher Root Container(4f56a0a2)
  56. [12:09:47] [main/DEBUG] [mixin/]: MixinPlatformAgentMinecraftForge rejected container ModLauncher Root Container(4f56a0a2)
  57. [12:09:47] [main/DEBUG] [mixin/]: Instancing new MixinPlatformAgentDefault for ModLauncher Root Container(4f56a0a2)
  58. [12:09:47] [main/DEBUG] [mixin/]: MixinPlatformAgentDefault accepted container ModLauncher Root Container(4f56a0a2)
  59. [12:09:47] [main/DEBUG] [cp.mo.mo.TransformationServiceDecorator/MODLAUNCHER]: Initialized transformation service mixin
  60. [12:09:47] [main/DEBUG] [cp.mo.mo.TransformationServiceDecorator/MODLAUNCHER]: Initializing transformation service fml
  61. [12:09:47] [main/DEBUG] [ne.mi.fm.lo.FMLServiceProvider/CORE]: Setting up basic FML game directories
  62. [12:09:47] [main/DEBUG] [ne.mi.fm.lo.FileUtils/CORE]: Found existing GAMEDIR directory : C:\Users\Sammy_HD\Documents\mc_mods\entity_xray\run
  63. [12:09:47] [main/DEBUG] [ne.mi.fm.lo.FMLPaths/CORE]: Path GAMEDIR is C:\Users\Sammy_HD\Documents\mc_mods\entity_xray\run
  64. [12:09:47] [main/DEBUG] [ne.mi.fm.lo.FileUtils/CORE]: Found existing MODSDIR directory : C:\Users\Sammy_HD\Documents\mc_mods\entity_xray\run\mods
  65. [12:09:47] [main/DEBUG] [ne.mi.fm.lo.FMLPaths/CORE]: Path MODSDIR is C:\Users\Sammy_HD\Documents\mc_mods\entity_xray\run\mods
  66. [12:09:47] [main/DEBUG] [ne.mi.fm.lo.FileUtils/CORE]: Found existing CONFIGDIR directory : C:\Users\Sammy_HD\Documents\mc_mods\entity_xray\run\config
  67. [12:09:47] [main/DEBUG] [ne.mi.fm.lo.FMLPaths/CORE]: Path CONFIGDIR is C:\Users\Sammy_HD\Documents\mc_mods\entity_xray\run\config
  68. [12:09:47] [main/DEBUG] [ne.mi.fm.lo.FMLPaths/CORE]: Path FMLCONFIG is C:\Users\Sammy_HD\Documents\mc_mods\entity_xray\run\config\fml.toml
  69. [12:09:47] [main/DEBUG] [ne.mi.fm.lo.FMLServiceProvider/CORE]: Loading configuration
  70. [12:09:47] [main/DEBUG] [ne.mi.fm.lo.FileUtils/CORE]: Found existing default config directory directory : C:\Users\Sammy_HD\Documents\mc_mods\entity_xray\run\defaultconfigs
  71. [12:09:47] [main/DEBUG] [ne.mi.fm.lo.FMLServiceProvider/CORE]: Preparing ModFile
  72. [12:09:47] [main/DEBUG] [ne.mi.fm.lo.FMLServiceProvider/CORE]: Preparing launch handler
  73. [12:09:47] [main/DEBUG] [ne.mi.fm.lo.FMLLoader/CORE]: Using fmluserdevclient as launch service
  74. [12:09:47] [main/DEBUG] [ne.mi.fm.lo.FMLLoader/CORE]: Received command line version data : MC Version: '1.16.2' MCP Version: '20200812.004259' Forge Version: '33.0.61' Forge group: 'net.minecraftforge'
  75. [12:09:47] [main/DEBUG] [ne.mi.fm.lo.LibraryFinder/CORE]: Found JAR forge at path C:\Users\Sammy_HD\.gradle\caches\forge_gradle\minecraft_user_repo\net\minecraftforge\forge\1.16.2-33.0.61_mapped_snapshot_20200514-1.16\forge-1.16.2-33.0.61_mapped_snapshot_20200514-1.16-recomp.jar
  76. [12:09:47] [main/DEBUG] [ne.mi.fm.lo.LibraryFinder/CORE]: Found JAR mcdata at path C:\Users\Sammy_HD\.gradle\caches\forge_gradle\minecraft_repo\versions\1.16.2\client-extra.jar
  77. [12:09:47] [main/DEBUG] [ne.mi.us.FMLUserdevLaunchProvider/CORE]: Injecting maven path C:\Users\Sammy_HD\.gradle\caches\forge_gradle\minecraft_user_repo
  78. [12:09:47] [main/DEBUG] [ne.mi.fm.lo.FMLCommonLaunchHandler/CORE]: Got mod coordinates entity_xray%%C:\Users\Sammy_HD\Documents\mc_mods\entity_xray\build\resources\main;entity_xray%%C:\Users\Sammy_HD\Documents\mc_mods\entity_xray\build\classes\java\main from env
  79. [12:09:47] [main/DEBUG] [ne.mi.fm.lo.FMLCommonLaunchHandler/CORE]: Found supplied mod coordinates [{entity_xray=[C:\Users\Sammy_HD\Documents\mc_mods\entity_xray\build\resources\main, C:\Users\Sammy_HD\Documents\mc_mods\entity_xray\build\classes\java\main]}]
  80. [12:09:48] [main/DEBUG] [ne.mi.fm.lo.LanguageLoadingProvider/CORE]: Found 2 language providers
  81. [12:09:48] [main/DEBUG] [ne.mi.fm.lo.LanguageLoadingProvider/CORE]: Found language provider javafml, version 33.0
  82. [12:09:48] [main/DEBUG] [ne.mi.fm.lo.LanguageLoadingProvider/CORE]: Found language provider minecraft, version 1
  83. [12:09:48] [main/DEBUG] [ne.mi.fm.lo.LanguageLoadingProvider/CORE]: Skipping adding forge jar - javafml is already present
  84. [12:09:48] [main/DEBUG] [cp.mo.mo.TransformationServiceDecorator/MODLAUNCHER]: Initialized transformation service fml
  85. [12:09:48] [main/DEBUG] [cp.mo.mo.NameMappingServiceHandler/MODLAUNCHER]: Current naming domain is 'mcp'
  86. [12:09:48] [main/DEBUG] [cp.mo.mo.NameMappingServiceHandler/MODLAUNCHER]: Identified name mapping providers {srg=srgtomcp:1234}
  87. [12:09:48] [main/DEBUG] [cp.mo.mo.TransformationServicesHandler/MODLAUNCHER]: Transformation services begin scanning
  88. [12:09:48] [main/DEBUG] [cp.mo.mo.TransformationServiceDecorator/MODLAUNCHER]: Beginning scan trigger - transformation service mixin
  89. [12:09:48] [main/DEBUG] [cp.mo.mo.TransformationServiceDecorator/MODLAUNCHER]: End scan trigger - transformation service mixin
  90. [12:09:48] [main/DEBUG] [cp.mo.mo.TransformationServiceDecorator/MODLAUNCHER]: Beginning scan trigger - transformation service fml
  91. [12:09:48] [main/DEBUG] [ne.mi.fm.lo.FMLServiceProvider/CORE]: Initiating mod scan
  92. [12:09:48] [main/DEBUG] [ne.mi.fm.lo.LibraryFinder/CORE]: Found JAR classpath_mod at path C:\Users\Sammy_HD\Documents\mc_mods\entity_xray\build\resources\main
  93. [12:09:48] [main/DEBUG] [ne.mi.fm.lo.LibraryFinder/CORE]: Found JAR classpath_mod at path C:\Users\Sammy_HD\.gradle\caches\forge_gradle\minecraft_user_repo\net\minecraftforge\forge\1.16.2-33.0.61_mapped_snapshot_20200514-1.16\forge-1.16.2-33.0.61_mapped_snapshot_20200514-1.16-recomp.jar
  94. [12:09:48] [main/DEBUG] [ne.mi.us.ClasspathLocator/CORE]: Found classpath mod: C:\Users\Sammy_HD\.gradle\caches\forge_gradle\minecraft_user_repo\net\minecraftforge\forge\1.16.2-33.0.61_mapped_snapshot_20200514-1.16\forge-1.16.2-33.0.61_mapped_snapshot_20200514-1.16-recomp.jar
  95. [12:09:48] [main/DEBUG] [ne.mi.fm.lo.LibraryFinder/CORE]: Found JAR manifest_jar at path C:\Users\Sammy_HD\.gradle\caches\forge_gradle\minecraft_user_repo\net\minecraftforge\forge\1.16.2-33.0.61_mapped_snapshot_20200514-1.16\forge-1.16.2-33.0.61_mapped_snapshot_20200514-1.16-recomp.jar
  96. [12:09:48] [main/DEBUG] [ne.mi.fm.lo.LibraryFinder/CORE]: Found JAR manifest_jar at path C:\Users\Sammy_HD\.gradle\caches\forge_gradle\minecraft_user_repo\net\minecraftforge\forge\1.16.2-33.0.61_mapped_snapshot_20200514-1.16\forge-1.16.2-33.0.61_mapped_snapshot_20200514-1.16-launcher.jar
  97. [12:09:48] [main/DEBUG] [ne.mi.fm.lo.LibraryFinder/CORE]: Found JAR manifest_jar at path C:\Users\Sammy_HD\.gradle\caches\forge_gradle\minecraft_repo\versions\1.16.2\client-extra.jar
  98. [12:09:48] [main/DEBUG] [ne.mi.fm.lo.LibraryFinder/CORE]: Found JAR manifest_jar at path C:\Users\Sammy_HD\.gradle\caches\modules-2\files-2.1\net.minecraftforge\accesstransformers\2.2.0\43c882f4e7e5648acb14c9de8c2eca5f670d2bd\accesstransformers-2.2.0-shadowed.jar
  99. [12:09:48] [main/DEBUG] [ne.mi.fm.lo.LibraryFinder/CORE]: Found JAR manifest_jar at path C:\Users\Sammy_HD\.gradle\caches\modules-2\files-2.1\net.minecraftforge\eventbus\3.0.3\e5dedecd71479bbb4984485553b6fcf36953ef00\eventbus-3.0.3-service.jar
  100. [12:09:48] [main/DEBUG] [ne.mi.fm.lo.LibraryFinder/CORE]: Found JAR manifest_jar at path C:\Users\Sammy_HD\.gradle\caches\modules-2\files-2.1\net.minecraftforge\coremods\3.0.0\fdf3b62a9a1fbd6a0826190d6d9962d9dd4f0340\coremods-3.0.0.jar
  101. [12:09:48] [main/DEBUG] [ne.mi.fm.lo.LibraryFinder/CORE]: Found JAR manifest_jar at path C:\Users\Sammy_HD\.gradle\caches\modules-2\files-2.1\net.minecraftforge\forgespi\3.1.1\f258f875d9252d5ee83d8f0f2d03f71123f37650\forgespi-3.1.1.jar
  102. [12:09:48] [main/DEBUG] [ne.mi.fm.lo.LibraryFinder/CORE]: Found JAR manifest_jar at path C:\Users\Sammy_HD\.gradle\caches\modules-2\files-2.1\cpw.mods\modlauncher\7.0.1\e66e347c2a4c61781198f86be5cc43f19c1dfb92\modlauncher-7.0.1.jar
  103. [12:09:48] [main/DEBUG] [ne.mi.fm.lo.LibraryFinder/CORE]: Found JAR manifest_jar at path C:\Users\Sammy_HD\.gradle\caches\modules-2\files-2.1\cpw.mods\modlauncher\7.0.1\46cf400820b6640e2d3231dd1644d1ee179f16f8\modlauncher-7.0.1-api.jar
  104. [12:09:48] [main/DEBUG] [ne.mi.fm.lo.LibraryFinder/CORE]: Found JAR manifest_jar at path C:\Users\Sammy_HD\.gradle\caches\modules-2\files-2.1\com.google.code.findbugs\jsr305\3.0.2\25ea2e8b0c338a877313bd4672d3fe056ea78f0d\jsr305-3.0.2.jar
  105. [12:09:48] [main/DEBUG] [ne.mi.fm.lo.LibraryFinder/CORE]: Found JAR manifest_jar at path C:\Users\Sammy_HD\.gradle\caches\modules-2\files-2.1\net.minecraftforge\mergetool\1.0.9\d1e1ba354a40b5703340b5cb02fdca489cff3646\mergetool-1.0.9-api.jar
  106. [12:09:48] [main/DEBUG] [ne.mi.fm.lo.LibraryFinder/CORE]: Found JAR manifest_jar at path C:\Users\Sammy_HD\.gradle\caches\modules-2\files-2.1\org.ow2.asm\asm-commons\7.2\ca2954e8d92a05bacc28ff465b25c70e0f512497\asm-commons-7.2.jar
  107. [12:09:48] [main/DEBUG] [ne.mi.fm.lo.LibraryFinder/CORE]: Found JAR manifest_jar at path C:\Users\Sammy_HD\.gradle\caches\modules-2\files-2.1\org.ow2.asm\asm-util\7.2\a3ae34e57fa8a4040e28247291d0cc3d6b8c7bcf\asm-util-7.2.jar
  108. [12:09:48] [main/DEBUG] [ne.mi.fm.lo.LibraryFinder/CORE]: Found JAR manifest_jar at path C:\Users\Sammy_HD\.gradle\caches\modules-2\files-2.1\org.ow2.asm\asm-analysis\7.2\b6e6abe057f23630113f4167c34bda7086691258\asm-analysis-7.2.jar
  109. [12:09:48] [main/DEBUG] [ne.mi.fm.lo.LibraryFinder/CORE]: Found JAR manifest_jar at path C:\Users\Sammy_HD\.gradle\caches\modules-2\files-2.1\org.ow2.asm\asm-tree\7.2\3a23cc36edaf8fc5a89cb100182758ccb5991487\asm-tree-7.2.jar
  110. [12:09:48] [main/DEBUG] [ne.mi.fm.lo.LibraryFinder/CORE]: Found JAR manifest_jar at path C:\Users\Sammy_HD\.gradle\caches\modules-2\files-2.1\org.ow2.asm\asm\7.2\fa637eb67eb7628c915d73762b681ae7ff0b9731\asm-7.2.jar
  111. [12:09:48] [main/DEBUG] [ne.mi.fm.lo.LibraryFinder/CORE]: Found JAR manifest_jar at path C:\Users\Sammy_HD\.gradle\caches\modules-2\files-2.1\cpw.mods\grossjava9hacks\1.3.3\e49222512ea6cabdd8b49761cef1d5a207b1f0d9\grossjava9hacks-1.3.3.jar
  112. [12:09:48] [main/DEBUG] [ne.mi.fm.lo.LibraryFinder/CORE]: Found JAR manifest_jar at path C:\Users\Sammy_HD\.gradle\caches\modules-2\files-2.1\net.minecraftforge\unsafe\0.2.0\54d7a0a5e8fdb71b973025caa46f341ae5904f39\unsafe-0.2.0.jar
  113. [12:09:48] [main/DEBUG] [ne.mi.fm.lo.LibraryFinder/CORE]: Found JAR manifest_jar at path C:\Users\Sammy_HD\.gradle\caches\modules-2\files-2.1\com.electronwill.night-config\toml\3.6.2\3ac4263d06433da39a5eee95e2679f1642d921f0\toml-3.6.2.jar
  114. [12:09:48] [main/DEBUG] [ne.mi.fm.lo.LibraryFinder/CORE]: Found JAR manifest_jar at path C:\Users\Sammy_HD\.gradle\caches\modules-2\files-2.1\com.electronwill.night-config\core\3.6.2\56f6500038861d4a8832072676da7bf7916217d0\core-3.6.2.jar
  115. [12:09:48] [main/DEBUG] [ne.mi.fm.lo.LibraryFinder/CORE]: Found JAR manifest_jar at path C:\Users\Sammy_HD\.gradle\caches\modules-2\files-2.1\org.jline\jline\3.12.1\de2bd909cb9f8eaa741bd03df4a1bd3f6eb593c7\jline-3.12.1.jar
  116. [12:09:48] [main/DEBUG] [ne.mi.fm.lo.LibraryFinder/CORE]: Found JAR manifest_jar at path C:\Users\Sammy_HD\.gradle\caches\modules-2\files-2.1\org.apache.maven\maven-artifact\3.6.3\f8ff8032903882376e8d000c51e3e16d20fc7df7\maven-artifact-3.6.3.jar
  117. [12:09:48] [main/DEBUG] [ne.mi.fm.lo.LibraryFinder/CORE]: Found JAR manifest_jar at path C:\Users\Sammy_HD\.gradle\caches\modules-2\files-2.1\net.jodah\typetools\0.8.3\98f84f353457629e81cc6827224871b1a8faa7af\typetools-0.8.3.jar
  118. [12:09:48] [main/DEBUG] [ne.mi.fm.lo.LibraryFinder/CORE]: Found JAR manifest_jar at path C:\Users\Sammy_HD\.gradle\caches\modules-2\files-2.1\net.minecrell\terminalconsoleappender\1.2.0\96d02cd3b384ff015a8fef4223bcb4ccf1717c95\terminalconsoleappender-1.2.0.jar
  119. [12:09:48] [main/DEBUG] [ne.mi.fm.lo.LibraryFinder/CORE]: Found JAR manifest_jar at path C:\Users\Sammy_HD\.gradle\caches\modules-2\files-2.1\org.apache.logging.log4j\log4j-core\2.11.2\6c2fb3f5b7cd27504726aef1b674b542a0c9cf53\log4j-core-2.11.2.jar
  120. [12:09:48] [main/DEBUG] [ne.mi.fm.lo.LibraryFinder/CORE]: Found JAR manifest_jar at path C:\Users\Sammy_HD\.gradle\caches\modules-2\files-2.1\org.apache.logging.log4j\log4j-api\2.11.2\f5e9a2ffca496057d6891a3de65128efc636e26e\log4j-api-2.11.2.jar
  121. [12:09:48] [main/DEBUG] [ne.mi.fm.lo.LibraryFinder/CORE]: Found JAR manifest_jar at path C:\Users\Sammy_HD\.gradle\caches\modules-2\files-2.1\net.sf.jopt-simple\jopt-simple\5.0.4\4fdac2fbe92dfad86aa6e9301736f6b4342a3f5c\jopt-simple-5.0.4.jar
  122. [12:09:48] [main/DEBUG] [ne.mi.fm.lo.LibraryFinder/CORE]: Found JAR manifest_jar at path C:\Users\Sammy_HD\.gradle\caches\modules-2\files-2.1\org.spongepowered\mixin\0.8\dbe9e5db694a7c3cd644d5bb98f8a21295c75048\mixin-0.8.jar
  123. [12:09:48] [main/DEBUG] [ne.mi.fm.lo.LibraryFinder/CORE]: Found JAR manifest_jar at path C:\Users\Sammy_HD\.gradle\caches\modules-2\files-2.1\com.mojang\patchy\1.3.9\eb8bb7b66fa0e2152b1b40b3856e82f7619439ee\patchy-1.3.9.jar
  124. [12:09:48] [main/DEBUG] [ne.mi.fm.lo.LibraryFinder/CORE]: Found JAR manifest_jar at path C:\Users\Sammy_HD\.gradle\caches\modules-2\files-2.1\oshi-project\oshi-core\1.1\9ddf7b048a8d701be231c0f4f95fd986198fd2d8\oshi-core-1.1.jar
  125. [12:09:48] [main/DEBUG] [ne.mi.fm.lo.LibraryFinder/CORE]: Found JAR manifest_jar at path C:\Users\Sammy_HD\.gradle\caches\modules-2\files-2.1\net.java.dev.jna\jna\4.4.0\cb208278274bf12ebdb56c61bd7407e6f774d65a\jna-4.4.0.jar
  126. [12:09:48] [main/DEBUG] [ne.mi.fm.lo.LibraryFinder/CORE]: Found JAR manifest_jar at path C:\Users\Sammy_HD\.gradle\caches\modules-2\files-2.1\net.java.dev.jna\platform\3.4.0\e3f70017be8100d3d6923f50b3d2ee17714e9c13\platform-3.4.0.jar
  127. [12:09:48] [main/DEBUG] [ne.mi.fm.lo.LibraryFinder/CORE]: Found JAR manifest_jar at path C:\Users\Sammy_HD\.gradle\caches\modules-2\files-2.1\com.ibm.icu\icu4j\66.1\72c7519b6d91f7a1f993bd44a99fe95d67211b27\icu4j-66.1.jar
  128. [12:09:48] [main/DEBUG] [ne.mi.fm.lo.LibraryFinder/CORE]: Found JAR manifest_jar at path C:\Users\Sammy_HD\.gradle\caches\modules-2\files-2.1\com.mojang\javabridge\1.0.22\6aa6453aa99a52a5cd91749da1af6ab70e082ab3\javabridge-1.0.22.jar
  129. [12:09:48] [main/DEBUG] [ne.mi.fm.lo.LibraryFinder/CORE]: Found JAR manifest_jar at path C:\Users\Sammy_HD\.gradle\caches\modules-2\files-2.1\io.netty\netty-all\4.1.25.Final\d0626cd3108294d1d58c05859add27b4ef21f83b\netty-all-4.1.25.Final.jar
  130. [12:09:48] [main/DEBUG] [ne.mi.fm.lo.LibraryFinder/CORE]: Found JAR manifest_jar at path C:\Users\Sammy_HD\.gradle\caches\modules-2\files-2.1\com.google.guava\guava\21.0\3a3d111be1be1b745edfa7d91678a12d7ed38709\guava-21.0.jar
  131. [12:09:48] [main/DEBUG] [ne.mi.fm.lo.LibraryFinder/CORE]: Found JAR manifest_jar at path C:\Users\Sammy_HD\.gradle\caches\modules-2\files-2.1\org.apache.commons\commons-lang3\3.8.1\6505a72a097d9270f7a9e7bf42c4238283247755\commons-lang3-3.8.1.jar
  132. [12:09:48] [main/DEBUG] [ne.mi.fm.lo.LibraryFinder/CORE]: Found JAR manifest_jar at path C:\Users\Sammy_HD\.gradle\caches\modules-2\files-2.1\commons-io\commons-io\2.5\2852e6e05fbb95076fc091f6d1780f1f8fe35e0f\commons-io-2.5.jar
  133. [12:09:48] [main/DEBUG] [ne.mi.fm.lo.LibraryFinder/CORE]: Found JAR manifest_jar at path C:\Users\Sammy_HD\.gradle\caches\modules-2\files-2.1\org.apache.httpcomponents\httpclient\4.3.3\18f4247ff4572a074444572cee34647c43e7c9c7\httpclient-4.3.3.jar
  134. [12:09:48] [main/DEBUG] [ne.mi.fm.lo.LibraryFinder/CORE]: Found JAR manifest_jar at path C:\Users\Sammy_HD\.gradle\caches\modules-2\files-2.1\commons-codec\commons-codec\1.10\4b95f4897fa13f2cd904aee711aeafc0c5295cd8\commons-codec-1.10.jar
  135. [12:09:48] [main/DEBUG] [ne.mi.fm.lo.LibraryFinder/CORE]: Found JAR manifest_jar at path C:\Users\Sammy_HD\.gradle\caches\modules-2\files-2.1\net.java.jinput\jinput\2.0.5\39c7796b469a600f72380316f6b1f11db6c2c7c4\jinput-2.0.5.jar
  136. [12:09:48] [main/DEBUG] [ne.mi.fm.lo.LibraryFinder/CORE]: Found JAR manifest_jar at path C:\Users\Sammy_HD\.gradle\caches\modules-2\files-2.1\net.java.jutils\jutils\1.0.0\e12fe1fda814bd348c1579329c86943d2cd3c6a6\jutils-1.0.0.jar
  137. [12:09:48] [main/DEBUG] [ne.mi.fm.lo.LibraryFinder/CORE]: Found JAR manifest_jar at path C:\Users\Sammy_HD\.gradle\caches\modules-2\files-2.1\com.mojang\brigadier\1.0.17\c6b7dc51dd44379cc751b7504816006e9be4b1e6\brigadier-1.0.17.jar
  138. [12:09:48] [main/DEBUG] [ne.mi.fm.lo.LibraryFinder/CORE]: Found JAR manifest_jar at path C:\Users\Sammy_HD\.gradle\caches\modules-2\files-2.1\com.mojang\datafixerupper\4.0.26\ebd6690f33871ccee9b6132c6480668ee2e35020\datafixerupper-4.0.26.jar
  139. [12:09:48] [main/DEBUG] [ne.mi.fm.lo.LibraryFinder/CORE]: Found JAR manifest_jar at path C:\Users\Sammy_HD\.gradle\caches\modules-2\files-2.1\com.google.code.gson\gson\2.8.0\c4ba5371a29ac9b2ad6129b1d39ea38750043eff\gson-2.8.0.jar
  140. [12:09:48] [main/DEBUG] [ne.mi.fm.lo.LibraryFinder/CORE]: Found JAR manifest_jar at path C:\Users\Sammy_HD\.gradle\caches\modules-2\files-2.1\com.mojang\authlib\1.6.25\5bd0ce00c1e1f483641f85bccb02d1956dd77ec0\authlib-1.6.25.jar
  141. [12:09:48] [main/DEBUG] [ne.mi.fm.lo.LibraryFinder/CORE]: Found JAR manifest_jar at path C:\Users\Sammy_HD\.gradle\caches\modules-2\files-2.1\org.apache.commons\commons-compress\1.8.1\a698750c16740fd5b3871425f4cb3bbaa87f529d\commons-compress-1.8.1.jar
  142. [12:09:48] [main/DEBUG] [ne.mi.fm.lo.LibraryFinder/CORE]: Found JAR manifest_jar at path C:\Users\Sammy_HD\.gradle\caches\modules-2\files-2.1\commons-logging\commons-logging\1.1.3\f6f66e966c70a83ffbdb6f17a0919eaf7c8aca7f\commons-logging-1.1.3.jar
  143. [12:09:48] [main/DEBUG] [ne.mi.fm.lo.LibraryFinder/CORE]: Found JAR manifest_jar at path C:\Users\Sammy_HD\.gradle\caches\modules-2\files-2.1\org.apache.httpcomponents\httpcore\4.3.2\31fbbff1ddbf98f3aa7377c94d33b0447c646b6e\httpcore-4.3.2.jar
  144. [12:09:48] [main/DEBUG] [ne.mi.fm.lo.LibraryFinder/CORE]: Found JAR manifest_jar at path C:\Users\Sammy_HD\.gradle\caches\modules-2\files-2.1\it.unimi.dsi\fastutil\8.2.1\5ad88f325e424f8dbc2be5459e21ea5cab3864e9\fastutil-8.2.1.jar
  145. [12:09:48] [main/DEBUG] [ne.mi.fm.lo.LibraryFinder/CORE]: Found JAR manifest_jar at path C:\Users\Sammy_HD\.gradle\caches\modules-2\files-2.1\org.lwjgl\lwjgl-jemalloc\3.2.2\ee8e57a79300f78294576d87c4a587f8c99402e2\lwjgl-jemalloc-3.2.2.jar
  146. [12:09:48] [main/DEBUG] [ne.mi.fm.lo.LibraryFinder/CORE]: Found JAR manifest_jar at path C:\Users\Sammy_HD\.gradle\caches\modules-2\files-2.1\org.lwjgl\lwjgl-jemalloc\3.2.2\338b25b99da3ba5f441f6492f2ce2a9c608860ed\lwjgl-jemalloc-3.2.2-natives-windows.jar
  147. [12:09:48] [main/DEBUG] [ne.mi.fm.lo.LibraryFinder/CORE]: Found JAR manifest_jar at path C:\Users\Sammy_HD\.gradle\caches\modules-2\files-2.1\org.lwjgl\lwjgl-openal\3.2.2\2b772a102b0a11ee5f2109a5b136f4dc7c630827\lwjgl-openal-3.2.2.jar
  148. [12:09:48] [main/DEBUG] [ne.mi.fm.lo.LibraryFinder/CORE]: Found JAR manifest_jar at path C:\Users\Sammy_HD\.gradle\caches\modules-2\files-2.1\org.lwjgl\lwjgl-openal\3.2.2\ec20a7d42a2438528fca87e60b1705f1e2339ddb\lwjgl-openal-3.2.2-natives-windows.jar
  149. [12:09:48] [main/DEBUG] [ne.mi.fm.lo.LibraryFinder/CORE]: Found JAR manifest_jar at path C:\Users\Sammy_HD\.gradle\caches\modules-2\files-2.1\org.lwjgl\lwjgl-opengl\3.2.2\6ac5bb88b44c43ea195a570aab059f63da004cd8\lwjgl-opengl-3.2.2.jar
  150. [12:09:48] [main/DEBUG] [ne.mi.fm.lo.LibraryFinder/CORE]: Found JAR manifest_jar at path C:\Users\Sammy_HD\.gradle\caches\modules-2\files-2.1\org.lwjgl\lwjgl-opengl\3.2.2\d8dcdc91066cae2d2d8279cb4a9f9f05d9525826\lwjgl-opengl-3.2.2-natives-windows.jar
  151. [12:09:48] [main/DEBUG] [ne.mi.fm.lo.LibraryFinder/CORE]: Found JAR manifest_jar at path C:\Users\Sammy_HD\.gradle\caches\modules-2\files-2.1\org.lwjgl\lwjgl-glfw\3.2.2\d3ad4df38e400b8afba1de63f84338809399df5b\lwjgl-glfw-3.2.2.jar
  152. [12:09:48] [main/DEBUG] [ne.mi.fm.lo.LibraryFinder/CORE]: Found JAR manifest_jar at path C:\Users\Sammy_HD\.gradle\caches\modules-2\files-2.1\org.lwjgl\lwjgl-glfw\3.2.2\dc6826d636bf796b33a49038c354210e661bfc17\lwjgl-glfw-3.2.2-natives-windows.jar
  153. [12:09:48] [main/DEBUG] [ne.mi.fm.lo.LibraryFinder/CORE]: Found JAR manifest_jar at path C:\Users\Sammy_HD\.gradle\caches\modules-2\files-2.1\org.lwjgl\lwjgl-stb\3.2.2\3b8e6ebc5851dd3d17e37e5cadce2eff2a429f0f\lwjgl-stb-3.2.2.jar
  154. [12:09:48] [main/DEBUG] [ne.mi.fm.lo.LibraryFinder/CORE]: Found JAR manifest_jar at path C:\Users\Sammy_HD\.gradle\caches\modules-2\files-2.1\org.lwjgl\lwjgl-stb\3.2.2\811f705cbb29e8ae8d60bdf8fdd38c0c123ad3ef\lwjgl-stb-3.2.2-natives-windows.jar
  155. [12:09:48] [main/DEBUG] [ne.mi.fm.lo.LibraryFinder/CORE]: Found JAR manifest_jar at path C:\Users\Sammy_HD\.gradle\caches\modules-2\files-2.1\org.lwjgl\lwjgl-tinyfd\3.2.2\fcbe606c8f8da6f8f9a05e2c540eb1ee8632b0e9\lwjgl-tinyfd-3.2.2.jar
  156. [12:09:48] [main/DEBUG] [ne.mi.fm.lo.LibraryFinder/CORE]: Found JAR manifest_jar at path C:\Users\Sammy_HD\.gradle\caches\modules-2\files-2.1\org.lwjgl\lwjgl-tinyfd\3.2.2\e9115958773644e863332a6a06488d26f9e1fc9f\lwjgl-tinyfd-3.2.2-natives-windows.jar
  157. [12:09:48] [main/DEBUG] [ne.mi.fm.lo.LibraryFinder/CORE]: Found JAR manifest_jar at path C:\Users\Sammy_HD\.gradle\caches\modules-2\files-2.1\org.lwjgl\lwjgl\3.2.2\8ad6294407e15780b43e84929c40e4c5e997972e\lwjgl-3.2.2.jar
  158. [12:09:48] [main/DEBUG] [ne.mi.fm.lo.LibraryFinder/CORE]: Found JAR manifest_jar at path C:\Users\Sammy_HD\.gradle\caches\modules-2\files-2.1\org.lwjgl\lwjgl\3.2.2\5359f3aa50d36352815fc662ea73e1c00d22170\lwjgl-3.2.2-natives-windows.jar
  159. [12:09:48] [main/DEBUG] [ne.mi.fm.lo.LibraryFinder/CORE]: Found JAR manifest_jar at path C:\Users\Sammy_HD\.gradle\caches\modules-2\files-2.1\com.mojang\text2speech\1.11.3\f378f889797edd7df8d32272c06ca80a1b6b0f58\text2speech-1.11.3.jar
  160. [12:09:48] [main/DEBUG] [ne.mi.fm.lo.LibraryFinder/CORE]: Found JAR manifest_jar at path C:\Users\Sammy_HD\.gradle\caches\modules-2\files-2.1\com.mojang\text2speech\1.11.3\c0b242c0091be5acbf303263c7eeeaedd70544c7\text2speech-1.11.3-natives-windows.jar
  161. [12:09:48] [main/DEBUG] [ne.mi.fm.lo.LibraryFinder/CORE]: Found JAR manifest_jar at path C:\Users\Sammy_HD\.gradle\caches\modules-2\files-2.1\org.antlr\antlr4-runtime\4.7.2\e27d8ab4f984f9d186f54da984a6ab1cccac755e\antlr4-runtime-4.7.2.jar
  162. [12:09:48] [main/DEBUG] [ne.mi.fm.lo.LibraryFinder/CORE]: Found JAR manifest_jar at path C:\Users\Sammy_HD\.gradle\caches\modules-2\files-2.1\org.jline\jline-reader\3.12.1\4382ab1382c7b6f379377ed5f665dc2f6e1218bc\jline-reader-3.12.1.jar
  163. [12:09:48] [main/DEBUG] [ne.mi.fm.lo.LibraryFinder/CORE]: Found JAR manifest_jar at path C:\Users\Sammy_HD\.gradle\caches\modules-2\files-2.1\org.codehaus.plexus\plexus-utils\3.2.1\13b015768e0d04849d2794e4c47eb02d01a0de32\plexus-utils-3.2.1.jar
  164. [12:09:48] [main/DEBUG] [ne.mi.fm.lo.LibraryFinder/CORE]: Found JAR manifest_jar at path C:\Users\Sammy_HD\.gradle\caches\modules-2\files-2.1\org.jline\jline-terminal\3.12.1\c777448314e050d980a6b697c140f3bfe9eb7416\jline-terminal-3.12.1.jar
  165. [12:09:48] [main/DEBUG] [ne.mi.fm.lo.mo.ModListHandler/CORE]: Found mod coordinates from lists: []
  166. [12:09:48] [main/DEBUG] [ne.mi.fm.lo.mo.ModDiscoverer/CORE]: Found Mod Locators : (userdev classpath:null),(mods folder:null),(maven libs:null),(exploded directory:null),(minecraft:null)
  167. [12:09:48] [main/DEBUG] [ne.mi.fm.lo.mo.ExplodedDirectoryLocator/LOADING]: Found exploded directory mod manifest at C:\Users\Sammy_HD\Documents\mc_mods\entity_xray\build\resources\main\META-INF\mods.toml
  168. [12:09:48] [main/DEBUG] [ne.mi.fm.lo.mo.ModFileParser/LOADING]: Considering mod file candidate C:\Users\Sammy_HD\.gradle\caches\forge_gradle\minecraft_user_repo\net\minecraftforge\forge\1.16.2-33.0.61_mapped_snapshot_20200514-1.16\forge-1.16.2-33.0.61_mapped_snapshot_20200514-1.16-recomp.jar
  169. [12:09:48] [main/DEBUG] [ne.mi.fm.lo.mo.ModFileInfo/LOADING]: Found valid mod file forge-1.16.2-33.0.61_mapped_snapshot_20200514-1.16-recomp.jar with {forge} mods - versions {33.0.61}
  170. [12:09:48] [main/DEBUG] [ne.mi.fm.lo.mo.ModFile/LOADING]: Loading mod file C:\Users\Sammy_HD\.gradle\caches\forge_gradle\minecraft_user_repo\net\minecraftforge\forge\1.16.2-33.0.61_mapped_snapshot_20200514-1.16\forge-1.16.2-33.0.61_mapped_snapshot_20200514-1.16-recomp.jar with language javafml
  171. [12:09:48] [main/DEBUG] [ne.mi.fm.lo.mo.ModFileParser/LOADING]: Found coremod fieldtomethodtransformers with Javascript path META-INF/fieldtomethodtransformers.js
  172. [12:09:48] [main/DEBUG] [ne.mi.fm.lo.mo.ModFile/LOADING]: Found coremod META-INF/fieldtomethodtransformers.js
  173. [12:09:48] [main/DEBUG] [ne.mi.fm.lo.mo.ModFileParser/LOADING]: Considering mod file candidate C:\Users\Sammy_HD\Documents\mc_mods\entity_xray\build\resources\main
  174. [12:09:48] [main/FATAL] [ne.mi.fo.la.MavenVersionAdapter/]: Failed to parse version spec [33,36}
  175. org.apache.maven.artifact.versioning.InvalidVersionSpecificationException: Unbounded range: [33,36}
  176. at org.apache.maven.artifact.versioning.VersionRange.createFromVersionSpec(VersionRange.java:142) ~[maven-artifact-3.6.3.jar:3.6.3] {}
  177. at net.minecraftforge.forgespi.language.MavenVersionAdapter.createFromVersionSpec(MavenVersionAdapter.java:33) ~[forgespi-3.1.1.jar:?] {}
  178. at java.util.Optional.map(Optional.java:215) ~[?:1.8.0_311] {}
  179. at net.minecraftforge.fml.loading.moddiscovery.ModInfo$ModVersion.<init>(ModInfo.java:194) ~[forge-1.16.2-33.0.61_mapped_snapshot_20200514-1.16-launcher.jar:?] {}
  180. at net.minecraftforge.fml.loading.moddiscovery.ModInfo.lambda$null$6(ModInfo.java:94) ~[forge-1.16.2-33.0.61_mapped_snapshot_20200514-1.16-launcher.jar:?] {}
  181. at java.util.stream.ReferencePipeline$3$1.accept(ReferencePipeline.java:193) ~[?:1.8.0_311] {}
  182. at java.util.ArrayList$ArrayListSpliterator.forEachRemaining(ArrayList.java:1384) ~[?:1.8.0_311] {}
  183. at java.util.stream.AbstractPipeline.copyInto(AbstractPipeline.java:482) ~[?:1.8.0_311] {}
  184. at java.util.stream.AbstractPipeline.wrapAndCopyInto(AbstractPipeline.java:472) ~[?:1.8.0_311] {}
  185. at java.util.stream.ReduceOps$ReduceOp.evaluateSequential(ReduceOps.java:708) ~[?:1.8.0_311] {}
  186. at java.util.stream.AbstractPipeline.evaluate(AbstractPipeline.java:234) ~[?:1.8.0_311] {}
  187. at java.util.stream.ReferencePipeline.collect(ReferencePipeline.java:499) ~[?:1.8.0_311] {}
  188. at net.minecraftforge.fml.loading.moddiscovery.ModInfo.lambda$new$7(ModInfo.java:95) ~[forge-1.16.2-33.0.61_mapped_snapshot_20200514-1.16-launcher.jar:?] {}
  189. at java.util.Optional.map(Optional.java:215) ~[?:1.8.0_311] {}
  190. at net.minecraftforge.fml.loading.moddiscovery.ModInfo.<init>(ModInfo.java:92) ~[forge-1.16.2-33.0.61_mapped_snapshot_20200514-1.16-launcher.jar:?] {}
  191. at net.minecraftforge.fml.loading.moddiscovery.ModFileInfo.lambda$new$3(ModFileInfo.java:82) ~[forge-1.16.2-33.0.61_mapped_snapshot_20200514-1.16-launcher.jar:?] {}
  192. at java.util.stream.ReferencePipeline$3$1.accept(ReferencePipeline.java:193) ~[?:1.8.0_311] {}
  193. at java.util.ArrayList$ArrayListSpliterator.forEachRemaining(ArrayList.java:1384) ~[?:1.8.0_311] {}
  194. at java.util.stream.AbstractPipeline.copyInto(AbstractPipeline.java:482) ~[?:1.8.0_311] {}
  195. at java.util.stream.AbstractPipeline.wrapAndCopyInto(AbstractPipeline.java:472) ~[?:1.8.0_311] {}
  196. at java.util.stream.ReduceOps$ReduceOp.evaluateSequential(ReduceOps.java:708) ~[?:1.8.0_311] {}
  197. at java.util.stream.AbstractPipeline.evaluate(AbstractPipeline.java:234) ~[?:1.8.0_311] {}
  198. at java.util.stream.ReferencePipeline.collect(ReferencePipeline.java:499) ~[?:1.8.0_311] {}
  199. at net.minecraftforge.fml.loading.moddiscovery.ModFileInfo.<init>(ModFileInfo.java:83) ~[forge-1.16.2-33.0.61_mapped_snapshot_20200514-1.16-launcher.jar:?] {}
  200. at net.minecraftforge.fml.loading.moddiscovery.ModFileParser.modsTomlParser(ModFileParser.java:62) ~[forge-1.16.2-33.0.61_mapped_snapshot_20200514-1.16-launcher.jar:?] {}
  201. at net.minecraftforge.fml.loading.moddiscovery.ModFileParser.readModList(ModFileParser.java:46) ~[forge-1.16.2-33.0.61_mapped_snapshot_20200514-1.16-launcher.jar:?] {}
  202. at net.minecraftforge.fml.loading.moddiscovery.ModFile.identifyMods(ModFile.java:114) ~[forge-1.16.2-33.0.61_mapped_snapshot_20200514-1.16-launcher.jar:?] {}
  203. at net.minecraftforge.fml.loading.moddiscovery.ModDiscoverer.discoverMods(ModDiscoverer.java:116) ~[forge-1.16.2-33.0.61_mapped_snapshot_20200514-1.16-launcher.jar:?] {}
  204. at net.minecraftforge.fml.loading.FMLLoader.beginModScan(FMLLoader.java:213) ~[forge-1.16.2-33.0.61_mapped_snapshot_20200514-1.16-launcher.jar:33.0] {}
  205. at net.minecraftforge.fml.loading.FMLServiceProvider.runScan(FMLServiceProvider.java:107) ~[forge-1.16.2-33.0.61_mapped_snapshot_20200514-1.16-launcher.jar:33.0] {}
  206. at cpw.mods.modlauncher.TransformationServiceDecorator.runScan(TransformationServiceDecorator.java:114) ~[modlauncher-7.0.1.jar:?] {}
  207. at cpw.mods.modlauncher.TransformationServicesHandler.lambda$runScanningTransformationServices$8(TransformationServicesHandler.java:115) ~[modlauncher-7.0.1.jar:?] {}
  208. at java.util.stream.ReferencePipeline$7$1.accept(ReferencePipeline.java:267) [?:1.8.0_311] {}
  209. at java.util.HashMap$ValueSpliterator.forEachRemaining(HashMap.java:1656) [?:1.8.0_311] {}
  210. at java.util.stream.AbstractPipeline.copyInto(AbstractPipeline.java:482) [?:1.8.0_311] {}
  211. at java.util.stream.AbstractPipeline.wrapAndCopyInto(AbstractPipeline.java:472) [?:1.8.0_311] {}
  212. at java.util.stream.ReduceOps$ReduceOp.evaluateSequential(ReduceOps.java:708) [?:1.8.0_311] {}
  213. at java.util.stream.AbstractPipeline.evaluate(AbstractPipeline.java:234) [?:1.8.0_311] {}
  214. at java.util.stream.ReferencePipeline.collect(ReferencePipeline.java:499) [?:1.8.0_311] {}
  215. at cpw.mods.modlauncher.TransformationServicesHandler.runScanningTransformationServices(TransformationServicesHandler.java:116) [modlauncher-7.0.1.jar:?] {}
  216. at cpw.mods.modlauncher.TransformationServicesHandler.initializeTransformationServices(TransformationServicesHandler.java:63) [modlauncher-7.0.1.jar:?] {}
  217. at cpw.mods.modlauncher.Launcher.run(Launcher.java:75) [modlauncher-7.0.1.jar:?] {}
  218. at cpw.mods.modlauncher.Launcher.main(Launcher.java:65) [modlauncher-7.0.1.jar:?] {}
  219. at net.minecraftforge.userdev.LaunchTesting.main(LaunchTesting.java:105) [forge-1.16.2-33.0.61_mapped_snapshot_20200514-1.16-recomp.jar:?] {}
  220. [12:09:48] [main/INFO] [STDERR/]: [java.lang.ThreadGroup:uncaughtException:1052]: java.lang.RuntimeException: Failed to parse spec
  221. [12:09:48] [main/INFO] [STDERR/]: [java.lang.ThreadGroup:uncaughtException:1052]: at net.minecraftforge.forgespi.language.MavenVersionAdapter.createFromVersionSpec(MavenVersionAdapter.java:36)
  222. [12:09:48] [main/INFO] [STDERR/]: [java.lang.ThreadGroup:uncaughtException:1052]: at java.util.Optional.map(Optional.java:215)
  223. [12:09:48] [main/INFO] [STDERR/]: [java.lang.ThreadGroup:uncaughtException:1052]: at net.minecraftforge.fml.loading.moddiscovery.ModInfo$ModVersion.<init>(ModInfo.java:194)
  224. [12:09:48] [main/INFO] [STDERR/]: [java.lang.ThreadGroup:uncaughtException:1052]: at net.minecraftforge.fml.loading.moddiscovery.ModInfo.lambda$null$6(ModInfo.java:94)
  225. [12:09:48] [main/INFO] [STDERR/]: [java.lang.ThreadGroup:uncaughtException:1052]: at java.util.stream.ReferencePipeline$3$1.accept(ReferencePipeline.java:193)
  226. [12:09:48] [main/INFO] [STDERR/]: [java.lang.ThreadGroup:uncaughtException:1052]: at java.util.ArrayList$ArrayListSpliterator.forEachRemaining(ArrayList.java:1384)
  227. [12:09:48] [main/INFO] [STDERR/]: [java.lang.ThreadGroup:uncaughtException:1052]: at java.util.stream.AbstractPipeline.copyInto(AbstractPipeline.java:482)
  228. [12:09:48] [main/INFO] [STDERR/]: [java.lang.ThreadGroup:uncaughtException:1052]: at java.util.stream.AbstractPipeline.wrapAndCopyInto(AbstractPipeline.java:472)
  229. [12:09:48] [main/INFO] [STDERR/]: [java.lang.ThreadGroup:uncaughtException:1052]: at java.util.stream.ReduceOps$ReduceOp.evaluateSequential(ReduceOps.java:708)
  230. [12:09:48] [main/INFO] [STDERR/]: [java.lang.ThreadGroup:uncaughtException:1052]: at java.util.stream.AbstractPipeline.evaluate(AbstractPipeline.java:234)
  231. [12:09:48] [main/INFO] [STDERR/]: [java.lang.ThreadGroup:uncaughtException:1052]: at java.util.stream.ReferencePipeline.collect(ReferencePipeline.java:499)
  232. [12:09:48] [main/INFO] [STDERR/]: [java.lang.ThreadGroup:uncaughtException:1052]: at net.minecraftforge.fml.loading.moddiscovery.ModInfo.lambda$new$7(ModInfo.java:95)
  233. [12:09:48] [main/INFO] [STDERR/]: [java.lang.ThreadGroup:uncaughtException:1052]: at java.util.Optional.map(Optional.java:215)
  234. [12:09:48] [main/INFO] [STDERR/]: [java.lang.ThreadGroup:uncaughtException:1052]: at net.minecraftforge.fml.loading.moddiscovery.ModInfo.<init>(ModInfo.java:92)
  235. [12:09:48] [main/INFO] [STDERR/]: [java.lang.ThreadGroup:uncaughtException:1052]: at net.minecraftforge.fml.loading.moddiscovery.ModFileInfo.lambda$new$3(ModFileInfo.java:82)
  236. [12:09:48] [main/INFO] [STDERR/]: [java.lang.ThreadGroup:uncaughtException:1052]: at java.util.stream.ReferencePipeline$3$1.accept(ReferencePipeline.java:193)
  237. [12:09:48] [main/INFO] [STDERR/]: [java.lang.ThreadGroup:uncaughtException:1052]: at java.util.ArrayList$ArrayListSpliterator.forEachRemaining(ArrayList.java:1384)
  238. [12:09:48] [main/INFO] [STDERR/]: [java.lang.ThreadGroup:uncaughtException:1052]: at java.util.stream.AbstractPipeline.copyInto(AbstractPipeline.java:482)
  239. [12:09:48] [main/INFO] [STDERR/]: [java.lang.ThreadGroup:uncaughtException:1052]: at java.util.stream.AbstractPipeline.wrapAndCopyInto(AbstractPipeline.java:472)
  240. [12:09:48] [main/INFO] [STDERR/]: [java.lang.ThreadGroup:uncaughtException:1052]: at java.util.stream.ReduceOps$ReduceOp.evaluateSequential(ReduceOps.java:708)
  241. [12:09:48] [main/INFO] [STDERR/]: [java.lang.ThreadGroup:uncaughtException:1052]: at java.util.stream.AbstractPipeline.evaluate(AbstractPipeline.java:234)
  242. [12:09:48] [main/INFO] [STDERR/]: [java.lang.ThreadGroup:uncaughtException:1052]: at java.util.stream.ReferencePipeline.collect(ReferencePipeline.java:499)
  243. [12:09:48] [main/INFO] [STDERR/]: [java.lang.ThreadGroup:uncaughtException:1052]: at net.minecraftforge.fml.loading.moddiscovery.ModFileInfo.<init>(ModFileInfo.java:83)
  244. [12:09:48] [main/INFO] [STDERR/]: [java.lang.ThreadGroup:uncaughtException:1052]: at net.minecraftforge.fml.loading.moddiscovery.ModFileParser.modsTomlParser(ModFileParser.java:62)
  245. [12:09:48] [main/INFO] [STDERR/]: [java.lang.ThreadGroup:uncaughtException:1052]: at net.minecraftforge.fml.loading.moddiscovery.ModFileParser.readModList(ModFileParser.java:46)
  246. [12:09:48] [main/INFO] [STDERR/]: [java.lang.ThreadGroup:uncaughtException:1052]: at net.minecraftforge.fml.loading.moddiscovery.ModFile.identifyMods(ModFile.java:114)
  247. [12:09:48] [main/INFO] [STDERR/]: [java.lang.ThreadGroup:uncaughtException:1052]: at net.minecraftforge.fml.loading.moddiscovery.ModDiscoverer.discoverMods(ModDiscoverer.java:116)
  248. [12:09:48] [main/INFO] [STDERR/]: [java.lang.ThreadGroup:uncaughtException:1052]: at net.minecraftforge.fml.loading.FMLLoader.beginModScan(FMLLoader.java:213)
  249. [12:09:48] [main/INFO] [STDERR/]: [java.lang.ThreadGroup:uncaughtException:1052]: at net.minecraftforge.fml.loading.FMLServiceProvider.runScan(FMLServiceProvider.java:107)
  250. [12:09:48] [main/INFO] [STDERR/]: [java.lang.ThreadGroup:uncaughtException:1052]: at cpw.mods.modlauncher.TransformationServiceDecorator.runScan(TransformationServiceDecorator.java:114)
  251. [12:09:48] [main/INFO] [STDERR/]: [java.lang.ThreadGroup:uncaughtException:1052]: at cpw.mods.modlauncher.TransformationServicesHandler.lambda$runScanningTransformationServices$8(TransformationServicesHandler.java:115)
  252. [12:09:48] [main/INFO] [STDERR/]: [java.lang.ThreadGroup:uncaughtException:1052]: at java.util.stream.ReferencePipeline$7$1.accept(ReferencePipeline.java:267)
  253. [12:09:48] [main/INFO] [STDERR/]: [java.lang.ThreadGroup:uncaughtException:1052]: at java.util.HashMap$ValueSpliterator.forEachRemaining(HashMap.java:1656)
  254. [12:09:48] [main/INFO] [STDERR/]: [java.lang.ThreadGroup:uncaughtException:1052]: at java.util.stream.AbstractPipeline.copyInto(AbstractPipeline.java:482)
  255. [12:09:48] [main/INFO] [STDERR/]: [java.lang.ThreadGroup:uncaughtException:1052]: at java.util.stream.AbstractPipeline.wrapAndCopyInto(AbstractPipeline.java:472)
  256. [12:09:48] [main/INFO] [STDERR/]: [java.lang.ThreadGroup:uncaughtException:1052]: at java.util.stream.ReduceOps$ReduceOp.evaluateSequential(ReduceOps.java:708)
  257. [12:09:48] [main/INFO] [STDERR/]: [java.lang.ThreadGroup:uncaughtException:1052]: at java.util.stream.AbstractPipeline.evaluate(AbstractPipeline.java:234)
  258. [12:09:48] [main/INFO] [STDERR/]: [java.lang.ThreadGroup:uncaughtException:1052]: at java.util.stream.ReferencePipeline.collect(ReferencePipeline.java:499)
  259. [12:09:48] [main/INFO] [STDERR/]: [java.lang.ThreadGroup:uncaughtException:1052]: at cpw.mods.modlauncher.TransformationServicesHandler.runScanningTransformationServices(TransformationServicesHandler.java:116)
  260. [12:09:48] [main/INFO] [STDERR/]: [java.lang.ThreadGroup:uncaughtException:1052]: at cpw.mods.modlauncher.TransformationServicesHandler.initializeTransformationServices(TransformationServicesHandler.java:63)
  261. [12:09:48] [main/INFO] [STDERR/]: [java.lang.ThreadGroup:uncaughtException:1052]: at cpw.mods.modlauncher.Launcher.run(Launcher.java:75)
  262. [12:09:48] [main/INFO] [STDERR/]: [java.lang.ThreadGroup:uncaughtException:1052]: at cpw.mods.modlauncher.Launcher.main(Launcher.java:65)
  263. [12:09:48] [main/INFO] [STDERR/]: [java.lang.ThreadGroup:uncaughtException:1052]: at net.minecraftforge.userdev.LaunchTesting.main(LaunchTesting.java:105)
  264. [12:09:48] [main/INFO] [STDERR/]: [java.lang.ThreadGroup:uncaughtException:1061]: Caused by: org.apache.maven.artifact.versioning.InvalidVersionSpecificationException: Unbounded range: [33,36}
  265. [12:09:48] [main/INFO] [STDERR/]: [java.lang.ThreadGroup:uncaughtException:1061]: at org.apache.maven.artifact.versioning.VersionRange.createFromVersionSpec(VersionRange.java:142)
  266. [12:09:48] [main/INFO] [STDERR/]: [java.lang.ThreadGroup:uncaughtException:1061]: at net.minecraftforge.forgespi.language.MavenVersionAdapter.createFromVersionSpec(MavenVersionAdapter.java:33)
  267. [12:09:48] [main/INFO] [STDERR/]: [java.lang.ThreadGroup:uncaughtException:1061]: ... 42 more
  268. Exception in thread "main"
  269.  
  270. > Task :runClient FAILED
  271.  
  272. Deprecated Gradle features were used in this build, making it incompatible with Gradle 8.0.
  273.  
  274. You can use '--warning-mode all' to show the individual deprecation warnings and determine if they come from your own scripts or plugins.
  275.  
  276. See https://docs.gradle.org/7.1.1/userguide/command_line_interface.html#sec:command_line_warnings
  277. 10 actionable tasks: 8 executed, 2 up-to-date
  278. FAILURE: Build failed with an exception.
  279.  
  280. * What went wrong:
  281. Execution failed for task ':runClient'.
  282. > Process 'command 'C:\Program Files\Java\jdk1.8.0_311\bin\java.exe'' finished with non-zero exit value 1
  283.  
  284. * Try:
  285. Run with --stacktrace option to get the stack trace. Run with --info or --debug option to get more log output. Run with --scan to get full insights.
  286.  
  287. * Get more help at https://help.gradle.org
  288.  
  289. BUILD FAILED in 5s
  290. 12:09:48: Task execution finished 'runClient'.
  291.  
Advertisement
Add Comment
Please, Sign In to add comment