pixel_dev

make package errors

Apr 6th, 2019
346
Never
Not a member of Pastebin yet? Sign Up, it unlocks many cool features!
  1. $ make package
  2. > Making all for tweak respingmessage…
  3. ==> Preprocessing Tweak.xm…
  4. Tweak.xm:2: error: %orig does not make sense outside a method
  5. make[3]: *** [/opt/theos/makefiles/instance/rules.mk:265: /home/pixeljellyfish/respingmessage/.theos/obj/debug/arm64/Tweak.xm.mm] Error 255
  6. rm /home/pixeljellyfish/respingmessage/.theos/obj/debug/arm64/Tweak.xm.mm
  7. make[2]: *** [/opt/theos/makefiles/instance/library.mk:33: /home/pixeljellyfish/respingmessage/.theos/obj/debug/arm64/respingmessage.dylib] Error 2
  8. make[2]: *** Waiting for unfinished jobs....
  9. ==> Preprocessing Tweak.xm…
  10. Tweak.xm:2: error: %orig does not make sense outside a method
  11. make[3]: *** [/opt/theos/makefiles/instance/rules.mk:265: /home/pixeljellyfish/respingmessage/.theos/obj/debug/armv7/Tweak.xm.mm] Error 255
  12. rm /home/pixeljellyfish/respingmessage/.theos/obj/debug/armv7/Tweak.xm.mm
  13. make[2]: *** [/opt/theos/makefiles/instance/library.mk:33: /home/pixeljellyfish/respingmessage/.theos/obj/debug/armv7/respingmessage.dylib] Error 2
  14. make[1]: *** [/opt/theos/makefiles/instance/library.mk:24: internal-library-all_] Error 2
  15. make: *** [/opt/theos/makefiles/master/rules.mk:123: respingmessage.all.tweak.variables] Error 2
RAW Paste Data