daily pastebin goal
27%
SHARE
TWEET

VENUE STATIC FAILED!

a guest Dec 16th, 2018 73 Never
Not a member of Pastebin yet? Sign Up, it unlocks many cool features!
  1. [ 73%] Building CXX object src/cryptonote_basic/CMakeFiles/obj_cryptonote_basic.dir/cryptonote_basic_impl.cpp.o
  2. /home/venue/venue-static/src/cryptonote_basic/cryptonote_basic_impl.cpp: In function ‘bool cryptonote::get_block_reward(size_t, size_t, uint64_t, uint64_t&, uint8_t, uint64_t)’:
  3. /home/venue/venue-static/src/cryptonote_basic/cryptonote_basic_impl.cpp:99:9: error: init-statement in selection statements only available with -std=c++1z or -std=gnu++1z [-Werror]
  4.      if (height == PREMINE_BLOCK_HEIGHT && already_generated_coins < PREMINE_BLOCK_REWARD)
  5.          ^~~~~~
  6. /home/venue/venue-static/src/cryptonote_basic/cryptonote_basic_impl.cpp:100:5: error: expected ‘;’ before ‘{’ token
  7.      {
  8.      ^
  9. /home/venue/venue-static/src/cryptonote_basic/cryptonote_basic_impl.cpp:99:40: error: statement has no effect [-Werror=unused-value]
  10.      if (height == PREMINE_BLOCK_HEIGHT && already_generated_coins < PREMINE_BLOCK_REWARD)
  11.          ~~~~~~~~~~~~~~~~~~~~~~~~~~~~~~~^~~~~~~~~~~~~~~~~~~~~~~~~~~~~~~~~~~~~~~~~~~~~~~~~~
  12. /home/venue/venue-static/src/cryptonote_basic/cryptonote_basic_impl.cpp:103:5: error: expected primary-expression before ‘else
  13.      else
  14.      ^~~~
  15. /home/venue/venue-static/src/cryptonote_basic/cryptonote_basic_impl.cpp:103:5: error: expected ‘)’ before ‘else
  16. /home/venue/venue-static/src/cryptonote_basic/cryptonote_basic_impl.cpp:113:62: error: suggest braces around empty body in an ‘if’ statement [-Werror=empty-body]
  17.      uint64_t full_reward_zone = get_min_block_weight(version);
  18.                                                               ^
  19. /home/venue/venue-static/src/cryptonote_basic/cryptonote_basic_impl.cpp:116:25: error: ‘full_reward_zone’ was not declared in this scope
  20.      if (median_weight < full_reward_zone) {
  21.                          ^~~~~~~~~~~~~~~~
  22. cc1plus: all warnings being treated as errors
  23. src/cryptonote_basic/CMakeFiles/obj_cryptonote_basic.dir/build.make:75: recipe for target 'src/cryptonote_basic/CMakeFiles/obj_cryptonote_basic.dir/cryptonote_basic_impl.cpp.o' failed
  24. make[3]: *** [src/cryptonote_basic/CMakeFiles/obj_cryptonote_basic.dir/cryptonote_basic_impl.cpp.o] Error 1
  25. make[3]: Leaving directory '/home/venue/venue-static/build/release'
  26. CMakeFiles/Makefile2:1272: recipe for target 'src/cryptonote_basic/CMakeFiles/obj_cryptonote_basic.dir/all' failed
  27. make[2]: *** [src/cryptonote_basic/CMakeFiles/obj_cryptonote_basic.dir/all] Error 2
  28. make[2]: Leaving directory '/home/venue/venue-static/build/release'
  29. Makefile:140: recipe for target 'all' failed
  30. make[1]: *** [all] Error 2
  31. make[1]: Leaving directory '/home/venue/venue-static/build/release'
  32. Makefile:68: recipe for target 'release-static' failed
  33. make: *** [release-static] Error 2
  34. venue@sandbox:~/venue-static$
RAW Paste Data
We use cookies for various purposes including analytics. By continuing to use Pastebin, you agree to our use of cookies as described in the Cookies Policy. OK, I Understand
 
Top