Advertisement
Guest User

Untitled

a guest
Dec 21st, 2011
69
0
Never
Not a member of Pastebin yet? Sign Up, it unlocks many cool features!
text 6.70 KB | None | 0 0
  1. [INFO] ------------------------------------------------------------------------
  2. [INFO] BUILD FAILURE
  3. [INFO] ------------------------------------------------------------------------
  4. [INFO] Total time: 7.242s
  5. [INFO] Finished at: Wed Dec 21 16:03:16 CST 2011
  6. [INFO] Final Memory: 11M/81M
  7. [INFO] ------------------------------------------------------------------------
  8. [ERROR] Failed to execute goal com.rackspace.cloud.api:clouddocs-maven-plugin:1.0.9-SNAPSHOT:generate-pdf (default) on project cloud-example-docs: Execution default of goal com.rackspace.cloud.api:clouddocs-maven-plugin:1.0.9-SNAPSHOT:generate-pdf failed: XProc error err:XD0011: I/O error reported by XML parser processing file:/Users/sbrayman/.m2/repository/com/rackspace/cloud/api/clouddocs-maven-plugin/1.0.9-SNAPSHOT/clouddocs-maven-plugin-1.0.9-SNAPSHOT.jar!/test.xpl: /Users/sbrayman/.m2/repository/com/rackspace/cloud/api/clouddocs-maven-plugin/1.0.9-SNAPSHOT/clouddocs-maven-plugin-1.0.9-SNAPSHOT.jar!/test.xpl (No such file or directory) -> [Help 1]
  9. org.apache.maven.lifecycle.LifecycleExecutionException: Failed to execute goal com.rackspace.cloud.api:clouddocs-maven-plugin:1.0.9-SNAPSHOT:generate-pdf (default) on project cloud-example-docs: Execution default of goal com.rackspace.cloud.api:clouddocs-maven-plugin:1.0.9-SNAPSHOT:generate-pdf failed: XProc error err:XD0011
  10. at org.apache.maven.lifecycle.internal.MojoExecutor.execute(MojoExecutor.java:225)
  11. at org.apache.maven.lifecycle.internal.MojoExecutor.execute(MojoExecutor.java:153)
  12. at org.apache.maven.lifecycle.internal.MojoExecutor.execute(MojoExecutor.java:145)
  13. at org.apache.maven.lifecycle.internal.LifecycleModuleBuilder.buildProject(LifecycleModuleBuilder.java:84)
  14. at org.apache.maven.lifecycle.internal.LifecycleModuleBuilder.buildProject(LifecycleModuleBuilder.java:59)
  15. at org.apache.maven.lifecycle.internal.LifecycleStarter.singleThreadedBuild(LifecycleStarter.java:183)
  16. at org.apache.maven.lifecycle.internal.LifecycleStarter.execute(LifecycleStarter.java:161)
  17. at org.apache.maven.DefaultMaven.doExecute(DefaultMaven.java:319)
  18. at org.apache.maven.DefaultMaven.execute(DefaultMaven.java:156)
  19. at org.apache.maven.cli.MavenCli.execute(MavenCli.java:537)
  20. at org.apache.maven.cli.MavenCli.doMain(MavenCli.java:196)
  21. at org.apache.maven.cli.MavenCli.main(MavenCli.java:141)
  22. at sun.reflect.NativeMethodAccessorImpl.invoke0(Native Method)
  23. at sun.reflect.NativeMethodAccessorImpl.invoke(NativeMethodAccessorImpl.java:39)
  24. at sun.reflect.DelegatingMethodAccessorImpl.invoke(DelegatingMethodAccessorImpl.java:25)
  25. at java.lang.reflect.Method.invoke(Method.java:597)
  26. at org.codehaus.plexus.classworlds.launcher.Launcher.launchEnhanced(Launcher.java:290)
  27. at org.codehaus.plexus.classworlds.launcher.Launcher.launch(Launcher.java:230)
  28. at org.codehaus.plexus.classworlds.launcher.Launcher.mainWithExitCode(Launcher.java:409)
  29. at org.codehaus.plexus.classworlds.launcher.Launcher.main(Launcher.java:352)
  30. Caused by: org.apache.maven.plugin.PluginExecutionException: Execution default of goal com.rackspace.cloud.api:clouddocs-maven-plugin:1.0.9-SNAPSHOT:generate-pdf failed: XProc error err:XD0011
  31. at org.apache.maven.plugin.DefaultBuildPluginManager.executeMojo(DefaultBuildPluginManager.java:110)
  32. at org.apache.maven.lifecycle.internal.MojoExecutor.execute(MojoExecutor.java:209)
  33. ... 19 more
  34. Caused by: com.xmlcalabash.core.XProcException: XProc error err:XD0011
  35. at com.xmlcalabash.core.XProcException.dynamicError(XProcException.java:176)
  36. at com.xmlcalabash.util.XProcURIResolver.parse(XProcURIResolver.java:164)
  37. at com.xmlcalabash.core.XProcRuntime.parse(XProcRuntime.java:538)
  38. at com.xmlcalabash.core.XProcRuntime.parse(XProcRuntime.java:534)
  39. at com.xmlcalabash.model.Parser.loadPipeline(Parser.java:69)
  40. at com.xmlcalabash.core.XProcRuntime._load(XProcRuntime.java:411)
  41. at com.xmlcalabash.core.XProcRuntime.load(XProcRuntime.java:398)
  42. at com.rackspace.papi.components.translation.xproc.calabash.CalabashPipelineBuilder.build(CalabashPipelineBuilder.java:36)
  43. at com.rackspace.cloud.api.docs.CalabashHelper.run(CalabashHelper.java:19)
  44. at com.rackspace.cloud.api.docs.CalabashHelper.createSource(CalabashHelper.java:43)
  45. at com.rackspace.cloud.api.docs.PDFMojo.createSource(PDFMojo.java:327)
  46. at com.agilejava.docbkx.maven.AbstractTransformerMojo.execute(AbstractTransformerMojo.java:154)
  47. at org.apache.maven.plugin.DefaultBuildPluginManager.executeMojo(DefaultBuildPluginManager.java:101)
  48. ... 20 more
  49. Caused by: net.sf.saxon.s9api.SaxonApiException: I/O error reported by XML parser processing file:/Users/sbrayman/.m2/repository/com/rackspace/cloud/api/clouddocs-maven-plugin/1.0.9-SNAPSHOT/clouddocs-maven-plugin-1.0.9-SNAPSHOT.jar!/test.xpl: /Users/sbrayman/.m2/repository/com/rackspace/cloud/api/clouddocs-maven-plugin/1.0.9-SNAPSHOT/clouddocs-maven-plugin-1.0.9-SNAPSHOT.jar!/test.xpl (No such file or directory)
  50. at net.sf.saxon.s9api.DocumentBuilder.build(DocumentBuilder.java:402)
  51. at com.xmlcalabash.util.XProcURIResolver.parse(XProcURIResolver.java:156)
  52. ... 31 more
  53. Caused by: net.sf.saxon.trans.XPathException: I/O error reported by XML parser processing file:/Users/sbrayman/.m2/repository/com/rackspace/cloud/api/clouddocs-maven-plugin/1.0.9-SNAPSHOT/clouddocs-maven-plugin-1.0.9-SNAPSHOT.jar!/test.xpl: /Users/sbrayman/.m2/repository/com/rackspace/cloud/api/clouddocs-maven-plugin/1.0.9-SNAPSHOT/clouddocs-maven-plugin-1.0.9-SNAPSHOT.jar!/test.xpl (No such file or directory)
  54. at net.sf.saxon.event.Sender.sendSAXSource(Sender.java:427)
  55. at net.sf.saxon.event.Sender.send(Sender.java:154)
  56. at net.sf.saxon.Configuration.buildDocument(Configuration.java:3326)
  57. at net.sf.saxon.s9api.DocumentBuilder.build(DocumentBuilder.java:399)
  58. ... 32 more
  59. Caused by: java.io.FileNotFoundException: /Users/sbrayman/.m2/repository/com/rackspace/cloud/api/clouddocs-maven-plugin/1.0.9-SNAPSHOT/clouddocs-maven-plugin-1.0.9-SNAPSHOT.jar!/test.xpl (No such file or directory)
  60. at java.io.FileInputStream.open(Native Method)
  61. at java.io.FileInputStream.<init>(FileInputStream.java:120)
  62. at java.io.FileInputStream.<init>(FileInputStream.java:79)
  63. at sun.net.www.protocol.file.FileURLConnection.connect(FileURLConnection.java:70)
  64. at sun.net.www.protocol.file.FileURLConnection.getInputStream(FileURLConnection.java:161)
  65. at org.apache.xerces.impl.XMLEntityManager.setupCurrentEntity(Unknown Source)
  66. at org.apache.xerces.impl.XMLVersionDetector.determineDocVersion(Unknown Source)
  67. at org.apache.xerces.parsers.XML11Configuration.parse(Unknown Source)
  68. at org.apache.xerces.parsers.XML11Configuration.parse(Unknown Source)
  69. at org.apache.xerces.parsers.XMLParser.parse(Unknown Source)
  70. at org.apache.xerces.parsers.AbstractSAXParser.parse(Unknown Source)
  71. at net.sf.saxon.event.Sender.sendSAXSource(Sender.java:400)
  72. ... 35 more
Advertisement
Add Comment
Please, Sign In to add comment
Advertisement