Guest User

Untitled

a guest
Sep 7th, 2021
23
Never
Not a member of Pastebin yet? Sign Up, it unlocks many cool features!
  1. 10:21:25 AM: Build ready to start
  2. 10:21:27 AM: build-image version: fa439ad1ab9393b2c0d449d8d7c033927683f4b0
  3. 10:21:27 AM: build-image tag: v4.3.0
  4. 10:21:27 AM: buildbot version: 95d3b7a0c6ab391660cf43194e4a771ec6d12c7f
  5. 10:21:27 AM: Fetching cached dependencies
  6. 10:21:27 AM: Failed to fetch cache, continuing with build
  7. 10:21:27 AM: Starting to prepare the repo for build
  8. 10:21:27 AM: No cached dependencies found. Cloning fresh repo
  9. 10:21:27 AM: git clone https://github.com/davbrican/twincode-front-pre
  10. 10:21:29 AM: Preparing Git Reference refs/heads/main
  11. 10:21:29 AM: Parsing package.json dependencies
  12. 10:21:30 AM: Different build dir detected, going to use the one specified in the Netlify configuration file: '' versus '/' in the Netlify UI
  13. 10:21:30 AM: Starting build script
  14. 10:21:30 AM: Installing dependencies
  15. 10:21:30 AM: Python version set to 2.7
  16. 10:21:31 AM: Downloading and installing node v16.8.0...
  17. 10:21:31 AM: Downloading https://nodejs.org/dist/v16.8.0/node-v16.8.0-linux-x64.tar.xz...
  18. 10:21:31 AM: Computing checksum with sha256sum
  19. 10:21:31 AM: Checksums matched!
  20. 10:21:34 AM: Now using node v16.8.0 (npm v7.21.0)
  21. 10:21:34 AM: Started restoring cached build plugins
  22. 10:21:34 AM: Finished restoring cached build plugins
  23. 10:21:34 AM: Attempting ruby version 2.7.2, read from environment
  24. 10:21:36 AM: Using ruby version 2.7.2
  25. 10:21:36 AM: Using PHP version 8.0
  26. 10:21:36 AM: Started restoring cached node modules
  27. 10:21:36 AM: Finished restoring cached node modules
  28. 10:21:36 AM: Installing NPM modules using NPM version 7.21.0
  29. 10:21:39 AM: npm WARN old lockfile
  30. 10:21:39 AM: npm WARN old lockfile The package-lock.json file was created with an old version of npm,
  31. 10:21:39 AM: npm WARN old lockfile so supplemental metadata must be fetched from the registry.
  32. 10:21:39 AM: npm WARN old lockfile
  33. 10:21:39 AM: npm WARN old lockfile This is a one-time fix-up, please be patient...
  34. 10:21:39 AM: npm WARN old lockfile
  35. 10:22:04 AM: npm WARN deprecated flatten@1.0.3: flatten is deprecated in favor of utility frameworks such as lodash.
  36. 10:22:04 AM: npm WARN deprecated urix@0.1.0: Please see https://github.com/lydell/urix#deprecated
  37. 10:22:05 AM: npm WARN deprecated resolve-url@0.2.1: https://github.com/lydell/resolve-url#deprecated
  38. 10:22:06 AM: npm WARN deprecated uuid@3.4.0: Please upgrade to version 7 or higher. Older versions may use Math.random() in certain circumstances, which is known to be problematic. See https://v8.dev/blog/math-random for details.
  39. 10:22:07 AM: npm WARN deprecated request@2.88.2: request has been deprecated, see https://github.com/request/request/issues/3142
  40. 10:22:07 AM: npm WARN deprecated request-promise-native@1.0.8: request-promise-native has been deprecated because it extends the now deprecated request package, see https://github.com/request/request/issues/3142
  41. 10:22:08 AM: npm WARN deprecated querystring@0.2.0: The querystring API is considered Legacy. new code should use the URLSearchParams API instead.
  42. 10:22:11 AM: npm WARN deprecated ini@1.3.5: Please update to ini >=1.3.6 to avoid a prototype pollution issue
  43. 10:22:11 AM: npm WARN deprecated har-validator@5.1.3: this library is no longer supported
  44. 10:22:12 AM: npm WARN deprecated eslint-loader@2.2.1: This loader has been deprecated. Please use eslint-webpack-plugin
  45. 10:22:13 AM: npm WARN deprecated html-webpack-plugin@3.2.0: 3.x is no longer supported
  46. 10:22:14 AM: npm WARN deprecated extract-text-webpack-plugin@3.0.2: Deprecated. Please use https://github.com/webpack-contrib/mini-css-extract-plugin
  47. 10:22:15 AM: npm WARN deprecated debug@4.1.1: Debug versions >=3.2.0 <3.2.7 || >=4 <4.3.1 have a low-severity ReDos regression when used in a Node.js environment. It is recommended you upgrade to 3.2.7 or 4.3.1. (https://github.com/visionmedia/debug/issues/797)
  48. 10:22:15 AM: npm WARN deprecated chokidar@2.1.8: Chokidar 2 will break on node v14+. Upgrade to chokidar 3 with 15x less dependencies.
  49. 10:22:16 AM: npm WARN deprecated @hapi/topo@3.1.6: This version has been deprecated and is no longer supported or maintained
  50. 10:22:16 AM: npm WARN deprecated @hapi/bourne@1.3.2: This version has been deprecated and is no longer supported or maintained
  51. 10:22:17 AM: npm WARN deprecated @hapi/address@2.1.4: Moved to 'npm install @sideway/address'
  52. 10:22:17 AM: npm WARN deprecated babel-eslint@10.1.0: babel-eslint is now @babel/eslint-parser. This package will no longer receive updates.
  53. 10:22:18 AM: npm WARN deprecated @hapi/hoek@8.5.1: This version has been deprecated and is no longer supported or maintained
  54. 10:22:20 AM: npm WARN deprecated debug@3.2.6: Debug versions >=3.2.0 <3.2.7 || >=4 <4.3.1 have a low-severity ReDos regression when used in a Node.js environment. It is recommended you upgrade to 3.2.7 or 4.3.1. (https://github.com/visionmedia/debug/issues/797)
  55. 10:22:22 AM: npm WARN deprecated browserslist@1.7.7: Browserslist 2 could fail on reading Browserslist >3.0 config used in other tools.
  56. 10:22:22 AM: npm WARN deprecated debug@3.2.6: Debug versions >=3.2.0 <3.2.7 || >=4 <4.3.1 have a low-severity ReDos regression when used in a Node.js environment. It is recommended you upgrade to 3.2.7 or 4.3.1. (https://github.com/visionmedia/debug/issues/797)
  57. 10:22:22 AM: npm WARN deprecated debug@3.2.6: Debug versions >=3.2.0 <3.2.7 || >=4 <4.3.1 have a low-severity ReDos regression when used in a Node.js environment. It is recommended you upgrade to 3.2.7 or 4.3.1. (https://github.com/visionmedia/debug/issues/797)
  58. 10:22:23 AM: npm WARN deprecated @hapi/joi@15.1.1: Switch to 'npm install joi'
  59. 10:22:23 AM: npm WARN deprecated browserslist@1.7.7: Browserslist 2 could fail on reading Browserslist >3.0 config used in other tools.
  60. 10:22:23 AM: npm WARN deprecated browserslist@1.7.7: Browserslist 2 could fail on reading Browserslist >3.0 config used in other tools.
  61. 10:22:23 AM: npm WARN deprecated browserslist@2.11.3: Browserslist 2 could fail on reading Browserslist >3.0 config used in other tools.
  62. 10:22:24 AM: npm WARN deprecated debug@3.2.6: Debug versions >=3.2.0 <3.2.7 || >=4 <4.3.1 have a low-severity ReDos regression when used in a Node.js environment. It is recommended you upgrade to 3.2.7 or 4.3.1. (https://github.com/visionmedia/debug/issues/797)
  63. 10:22:25 AM: npm WARN deprecated uglify-es@3.3.9: support for ECMAScript is superseded by `uglify-js` as of v3.13.0
  64. 10:22:25 AM: npm WARN deprecated debug@3.2.6: Debug versions >=3.2.0 <3.2.7 || >=4 <4.3.1 have a low-severity ReDos regression when used in a Node.js environment. It is recommended you upgrade to 3.2.7 or 4.3.1. (https://github.com/visionmedia/debug/issues/797)
  65. 10:22:25 AM: npm WARN deprecated tar@2.2.2: This version of tar is no longer supported, and will not receive security updates. Please upgrade asap.
  66. 10:22:28 AM: npm WARN deprecated highlight.js@9.18.1: Version no longer supported. Upgrade to @latest
  67. 10:22:31 AM: npm WARN deprecated core-js@2.6.11: core-js@<3.3 is no longer maintained and not recommended for usage due to the number of issues. Because of the V8 engine whims, feature detection in old core-js versions could cause a slowdown up to 100x even if nothing is polyfilled. Please, upgrade your dependencies to the actual version of core-js.
  68. 10:22:31 AM: npm WARN deprecated core-js@2.6.11: core-js@<3.3 is no longer maintained and not recommended for usage due to the number of issues. Because of the V8 engine whims, feature detection in old core-js versions could cause a slowdown up to 100x even if nothing is polyfilled. Please, upgrade your dependencies to the actual version of core-js.
  69. 10:24:44 AM: npm ERR! code 1
  70. 10:24:44 AM: npm ERR! path /opt/build/repo/node_modules/node-sass
  71. 10:24:44 AM: npm ERR! command failed
  72. 10:24:44 AM: npm ERR! command sh -c node scripts/build.js
  73. 10:24:44 AM: npm ERR! Building: /opt/buildhome/.nvm/versions/node/v16.8.0/bin/node /opt/build/repo/node_modules/node-gyp/bin/node-gyp.js rebuild --verbose --libsass_ext= --libsass_cflags= --libsass_ldflags= --libsass_library=
  74. 10:24:44 AM: npm ERR! make: Entering directory '/opt/build/repo/node_modules/node-sass/build'
  75. 10:24:44 AM: npm ERR! g++ '-DNODE_GYP_MODULE_NAME=libsass' '-DUSING_UV_SHARED=1' '-DUSING_V8_SHARED=1' '-DV8_DEPRECATION_WARNINGS=1' '-DV8_DEPRECATION_WARNINGS' '-DV8_IMMINENT_DEPRECATION_WARNINGS' '-D_GLIBCXX_USE_CXX11_ABI=1' '-D_LARGEFILE_SOURCE' '-D_FILE_OFFSET_BITS=64' '-D__STDC_FORMAT_MACROS' '-DOPENSSL_NO_PINSHARED' '-DOPENSSL_THREADS' '-DLIBSASS_VERSION="3.5.5"' -I/opt/buildhome/.node-gyp/16.8.0/include/node -I/opt/buildhome/.node-gyp/16.8.0/src -I/opt/buildhome/.node-gyp/16.8.0/deps/openssl/config -I/opt/buildhome/.node-gyp/16.8.0/deps/openssl/openssl/include -I/opt/buildhome/.node-gyp/16.8.0/deps/uv/include -I/opt/buildhome/.node-gyp/16.8.0/deps/zlib -I/opt/buildhome/.node-gyp/16.8.0/deps/v8/include -I../src/libsass/include -fPIC -pthread -Wall -Wextra -Wno-unused-parameter -m64 -O3 -fno-omit-frame-pointer -std=gnu++14 -std=c++0x -fexceptions -frtti -MMD -MF ./Release/.deps/Release/obj.target/libsass/src/libsass/src/ast.o.d.raw -c -o Release/obj.target/libsass/src/libsass/src/ast.o ../src/libsass/src/ast.cpp
  76. 10:24:44 AM: npm ERR! g++ '-DNODE_GYP_MODULE_NAME=libsass' '-DUSING_UV_SHARED=1' '-DUSING_V8_SHARED=1' '-DV8_DEPRECATION_WARNINGS=1' '-DV8_DEPRECATION_WARNINGS' '-DV8_IMMINENT_DEPRECATION_WARNINGS' '-D_GLIBCXX_USE_CXX11_ABI=1' '-D_LARGEFILE_SOURCE' '-D_FILE_OFFSET_BITS=64' '-D__STDC_FORMAT_MACROS' '-DOPENSSL_NO_PINSHARED' '-DOPENSSL_THREADS' '-DLIBSASS_VERSION="3.5.5"' -I/opt/buildhome/.node-gyp/16.8.0/include/node -I/opt/buildhome/.node-gyp/16.8.0/src -I/opt/buildhome/.node-gyp/16.8.0/deps/openssl/config -I/opt/buildhome/.node-gyp/16.8.0/deps/openssl/openssl/include -I/opt/buildhome/.node-gyp/16.8.0/deps/uv/include -I/opt/buildhome/.node-gyp/16.8.0/deps/zlib -I/opt/buildhome/.node-gyp/16.8.0/deps/v8/include -I../src/libsass/include -fPIC -pthread -Wall -Wextra -Wno-unused-parameter -m64 -O3 -fno-omit-frame-pointer -std=gnu++14 -std=c++0x -fexceptions -frtti -MMD -MF ./Release/.deps/Release/obj.target/libsass/src/libsass/src/ast_fwd_decl.o.d.raw -c -o Release/obj.target/libsass/src/libsass/src/ast_fwd_decl.o ../src/libsass/src/ast_fwd_decl.cpp
  77. 10:24:44 AM: npm ERR! g++ '-DNODE_GYP_MODULE_NAME=libsass' '-DUSING_UV_SHARED=1' '-DUSING_V8_SHARED=1' '-DV8_DEPRECATION_WARNINGS=1' '-DV8_DEPRECATION_WARNINGS' '-DV8_IMMINENT_DEPRECATION_WARNINGS' '-D_GLIBCXX_USE_CXX11_ABI=1' '-D_LARGEFILE_SOURCE' '-D_FILE_OFFSET_BITS=64' '-D__STDC_FORMAT_MACROS' '-DOPENSSL_NO_PINSHARED' '-DOPENSSL_THREADS' '-DLIBSASS_VERSION="3.5.5"' -I/opt/buildhome/.node-gyp/16.8.0/include/node -I/opt/buildhome/.node-gyp/16.8.0/src -I/opt/buildhome/.node-gyp/16.8.0/deps/openssl/config -I/opt/buildhome/.node-gyp/16.8.0/deps/openssl/openssl/include -I/opt/buildhome/.node-gyp/16.8.0/deps/uv/include -I/opt/buildhome/.node-gyp/16.8.0/deps/zlib -I/opt/buildhome/.node-gyp/16.8.0/deps/v8/include -I../src/libsass/include -fPIC -pthread -Wall -Wextra -Wno-unused-parameter -m64 -O3 -fno-omit-frame-pointer -std=gnu++14 -std=c++0x -fexceptions -frtti -MMD -MF ./Release/.deps/Release/obj.target/libsass/src/libsass/src/backtrace.o.d.raw -c -o Release/obj.target/libsass/src/libsass/src/backtrace.o ../src/libsass/src/backtrace.cpp
  78. 10:24:44 AM: npm ERR! g++ '-DNODE_GYP_MODULE_NAME=libsass' '-DUSING_UV_SHARED=1' '-DUSING_V8_SHARED=1' '-DV8_DEPRECATION_WARNINGS=1' '-DV8_DEPRECATION_WARNINGS' '-DV8_IMMINENT_DEPRECATION_WARNINGS' '-D_GLIBCXX_USE_CXX11_ABI=1' '-D_LARGEFILE_SOURCE' '-D_FILE_OFFSET_BITS=64' '-D__STDC_FORMAT_MACROS' '-DOPENSSL_NO_PINSHARED' '-DOPENSSL_THREADS' '-DLIBSASS_VERSION="3.5.5"' -I/opt/buildhome/.node-gyp/16.8.0/include/node -I/opt/buildhome/.node-gyp/16.8.0/src -I/opt/buildhome/.node-gyp/16.8.0/deps/openssl/config -I/opt/buildhome/.node-gyp/16.8.0/deps/openssl/openssl/include -I/opt/buildhome/.node-gyp/16.8.0/deps/uv/include -I/opt/buildhome/.node-gyp/16.8.0/deps/zlib -I/opt/buildhome/.node-gyp/16.8.0/deps/v8/include -I../src/libsass/include -fPIC -pthread -Wall -Wextra -Wno-unused-parameter -m64 -O3 -fno-omit-frame-pointer -std=gnu++14 -std=c++0x -fexceptions -frtti -MMD -MF ./Release/.deps/Release/obj.target/libsass/src/libsass/src/base64vlq.o.d.raw -c -o Release/obj.target/libsass/src/libsass/src/base64vlq.o ../src/libsass/src/base64vlq.cpp
  79. 10:24:44 AM: npm ERR! g++ '-DNODE_GYP_MODULE_NAME=libsass' '-DUSING_UV_SHARED=1' '-DUSING_V8_SHARED=1' '-DV8_DEPRECATION_WARNINGS=1' '-DV8_DEPRECATION_WARNINGS' '-DV8_IMMINENT_DEPRECATION_WARNINGS' '-D_GLIBCXX_USE_CXX11_ABI=1' '-D_LARGEFILE_SOURCE' '-D_FILE_OFFSET_BITS=64' '-D__STDC_FORMAT_MACROS' '-DOPENSSL_NO_PINSHARED' '-DOPENSSL_THREADS' '-DLIBSASS_VERSION="3.5.5"' -I/opt/buildhome/.node-gyp/16.8.0/include/node -I/opt/buildhome/.node-gyp/16.8.0/src -I/opt/buildhome/.node-gyp/16.8.0/deps/openssl/config -I/opt/buildhome/.node-gyp/16.8.0/deps/openssl/openssl/include -I/opt/buildhome/.node-gyp/16.8.0/deps/uv/include -I/opt/buildhome/.node-gyp/16.8.0/deps/zlib -I/opt/buildhome/.node-gyp/16.8.0/deps/v8/include -I../src/libsass/include -fPIC -pthread -Wall -Wextra -Wno-unused-parameter -m64 -O3 -fno-omit-frame-pointer -std=gnu++14 -std=c++0x -fexceptions -frtti -MMD -MF ./Release/.deps/Release/obj.target/libsass/src/libsass/src/bind.o.d.raw -c -o Release/obj.target/libsass/src/libsass/src/bind.o ../src/libsass/src/bind.cpp
  80. 10:24:44 AM: npm ERR! cc '-DNODE_GYP_MODULE_NAME=libsass' '-DUSING_UV_SHARED=1' '-DUSING_V8_SHARED=1' '-DV8_DEPRECATION_WARNINGS=1' '-DV8_DEPRECATION_WARNINGS' '-DV8_IMMINENT_DEPRECATION_WARNINGS' '-D_GLIBCXX_USE_CXX11_ABI=1' '-D_LARGEFILE_SOURCE' '-D_FILE_OFFSET_BITS=64' '-D__STDC_FORMAT_MACROS' '-DOPENSSL_NO_PINSHARED' '-DOPENSSL_THREADS' '-DLIBSASS_VERSION="3.5.5"' -I/opt/buildhome/.node-gyp/16.8.0/include/node -I/opt/buildhome/.node-gyp/16.8.0/src -I/opt/buildhome/.node-gyp/16.8.0/deps/openssl/config -I/opt/buildhome/.node-gyp/16.8.0/deps/openssl/openssl/include -I/opt/buildhome/.node-gyp/16.8.0/deps/uv/include -I/opt/buildhome/.node-gyp/16.8.0/deps/zlib -I/opt/buildhome/.node-gyp/16.8.0/deps/v8/include -I../src/libsass/include -fPIC -pthread -Wall -Wextra -Wno-unused-parameter -m64 -O3 -fno-omit-frame-pointer -MMD -MF ./Release/.deps/Release/obj.target/libsass/src/libsass/src/cencode.o.d.raw -c -o Release/obj.target/libsass/src/libsass/src/cencode.o ../src/libsass/src/cencode.c
  81. 10:24:44 AM: npm ERR! g++ '-DNODE_GYP_MODULE_NAME=libsass' '-DUSING_UV_SHARED=1' '-DUSING_V8_SHARED=1' '-DV8_DEPRECATION_WARNINGS=1' '-DV8_DEPRECATION_WARNINGS' '-DV8_IMMINENT_DEPRECATION_WARNINGS' '-D_GLIBCXX_USE_CXX11_ABI=1' '-D_LARGEFILE_SOURCE' '-D_FILE_OFFSET_BITS=64' '-D__STDC_FORMAT_MACROS' '-DOPENSSL_NO_PINSHARED' '-DOPENSSL_THREADS' '-DLIBSASS_VERSION="3.5.5"' -I/opt/buildhome/.node-gyp/16.8.0/include/node -I/opt/buildhome/.node-gyp/16.8.0/src -I/opt/buildhome/.node-gyp/16.8.0/deps/openssl/config -I/opt/buildhome/.node-gyp/16.8.0/deps/openssl/openssl/include -I/opt/buildhome/.node-gyp/16.8.0/deps/uv/include -I/opt/buildhome/.node-gyp/16.8.0/deps/zlib -I/opt/buildhome/.node-gyp/16.8.0/deps/v8/include -I../src/libsass/include -fPIC -pthread -Wall -Wextra -Wno-unused-parameter -m64 -O3 -fno-omit-frame-pointer -std=gnu++14 -std=c++0x -fexceptions -frtti -MMD -MF ./Release/.deps/Release/obj.target/libsass/src/libsass/src/check_nesting.o.d.raw -c -o Release/obj.target/libsass/src/libsass/src/check_nesting.o ../src/libsass/src/check_nesting.cpp
  82. 10:24:44 AM: npm ERR! g++ '-DNODE_GYP_MODULE_NAME=libsass' '-DUSING_UV_SHARED=1' '-DUSING_V8_SHARED=1' '-DV8_DEPRECATION_WARNINGS=1' '-DV8_DEPRECATION_WARNINGS' '-DV8_IMMINENT_DEPRECATION_WARNINGS' '-D_GLIBCXX_USE_CXX11_ABI=1' '-D_LARGEFILE_SOURCE' '-D_FILE_OFFSET_BITS=64' '-D__STDC_FORMAT_MACROS' '-DOPENSSL_NO_PINSHARED' '-DOPENSSL_THREADS' '-DLIBSASS_VERSION="3.5.5"' -I/opt/buildhome/.node-gyp/16.8.0/include/node -I/opt/buildhome/.node-gyp/16.8.0/src -I/opt/buildhome/.node-gyp/16.8.0/deps/openssl/config -I/opt/buildhome/.node-gyp/16.8.0/deps/openssl/openssl/include -I/opt/buildhome/.node-gyp/16.8.0/deps/uv/include -I/opt/buildhome/.node-gyp/16.8.0/deps/zlib -I/opt/buildhome/.node-gyp/16.8.0/deps/v8/include -I../src/libsass/include -fPIC -pthread -Wall -Wextra -Wno-unused-parameter -m64 -O3 -fno-omit-frame-pointer -std=gnu++14 -std=c++0x -fexceptions -frtti -MMD -MF ./Release/.deps/Release/obj.target/libsass/src/libsass/src/color_maps.o.d.raw -c -o Release/obj.target/libsass/src/libsass/src/color_maps.o ../src/libsass/src/color_maps.cpp
  83. 10:24:44 AM: npm ERR! g++ '-DNODE_GYP_MODULE_NAME=libsass' '-DUSING_UV_SHARED=1' '-DUSING_V8_SHARED=1' '-DV8_DEPRECATION_WARNINGS=1' '-DV8_DEPRECATION_WARNINGS' '-DV8_IMMINENT_DEPRECATION_WARNINGS' '-D_GLIBCXX_USE_CXX11_ABI=1' '-D_LARGEFILE_SOURCE' '-D_FILE_OFFSET_BITS=64' '-D__STDC_FORMAT_MACROS' '-DOPENSSL_NO_PINSHARED' '-DOPENSSL_THREADS' '-DLIBSASS_VERSION="3.5.5"' -I/opt/buildhome/.node-gyp/16.8.0/include/node -I/opt/buildhome/.node-gyp/16.8.0/src -I/opt/buildhome/.node-gyp/16.8.0/deps/openssl/config -I/opt/buildhome/.node-gyp/16.8.0/deps/openssl/openssl/include -I/opt/buildhome/.node-gyp/16.8.0/deps/uv/include -I/opt/buildhome/.node-gyp/16.8.0/deps/zlib -I/opt/buildhome/.node-gyp/16.8.0/deps/v8/include -I../src/libsass/include -fPIC -pthread -Wall -Wextra -Wno-unused-parameter -m64 -O3 -fno-omit-frame-pointer -std=gnu++14 -std=c++0x -fexceptions -frtti -MMD -MF ./Release/.deps/Release/obj.target/libsass/src/libsass/src/constants.o.d.raw -c -o Release/obj.target/libsass/src/libsass/src/constants.o ../src/libsass/src/constants.cpp
  84. 10:24:44 AM: npm ERR! g++ '-DNODE_GYP_MODULE_NAME=libsass' '-DUSING_UV_SHARED=1' '-DUSING_V8_SHARED=1' '-DV8_DEPRECATION_WARNINGS=1' '-DV8_DEPRECATION_WARNINGS' '-DV8_IMMINENT_DEPRECATION_WARNINGS' '-D_GLIBCXX_USE_CXX11_ABI=1' '-D_LARGEFILE_SOURCE' '-D_FILE_OFFSET_BITS=64' '-D__STDC_FORMAT_MACROS' '-DOPENSSL_NO_PINSHARED' '-DOPENSSL_THREADS' '-DLIBSASS_VERSION="3.5.5"' -I/opt/buildhome/.node-gyp/16.8.0/include/node -I/opt/buildhome/.node-gyp/16.8.0/src -I/opt/buildhome/.node-gyp/16.8.0/deps/openssl/config -I/opt/buildhome/.node-gyp/16.8.0/deps/openssl/openssl/include -I/opt/buildhome/.node-gyp/16.8.0/deps/uv/include -I/opt/buildhome/.node-gyp/16.8.0/deps/zlib -I/opt/buildhome/.node-gyp/16.8.0/deps/v8/include -I../src/libsass/include -fPIC -pthread -Wall -Wextra -Wno-unused-parameter -m64 -O3 -fno-omit-frame-pointer -std=gnu++14 -std=c++0x -fexceptions -frtti -MMD -MF ./Release/.deps/Release/obj.target/libsass/src/libsass/src/context.o.d.raw -c -o Release/obj.target/libsass/src/libsass/src/context.o ../src/libsass/src/context.cpp
  85. 10:24:44 AM: npm ERR! g++ '-DNODE_GYP_MODULE_NAME=libsass' '-DUSING_UV_SHARED=1' '-DUSING_V8_SHARED=1' '-DV8_DEPRECATION_WARNINGS=1' '-DV8_DEPRECATION_WARNINGS' '-DV8_IMMINENT_DEPRECATION_WARNINGS' '-D_GLIBCXX_USE_CXX11_ABI=1' '-D_LARGEFILE_SOURCE' '-D_FILE_OFFSET_BITS=64' '-D__STDC_FORMAT_MACROS' '-DOPENSSL_NO_PINSHARED' '-DOPENSSL_THREADS' '-DLIBSASS_VERSION="3.5.5"' -I/opt/buildhome/.node-gyp/16.8.0/include/node -I/opt/buildhome/.node-gyp/16.8.0/src -I/opt/buildhome/.node-gyp/16.8.0/deps/openssl/config -I/opt/buildhome/.node-gyp/16.8.0/deps/openssl/openssl/include -I/opt/buildhome/.node-gyp/16.8.0/deps/uv/include -I/opt/buildhome/.node-gyp/16.8.0/deps/zlib -I/opt/buildhome/.node-gyp/16.8.0/deps/v8/include -I../src/libsass/include -fPIC -pthread -Wall -Wextra -Wno-unused-parameter -m64 -O3 -fno-omit-frame-pointer -std=gnu++14 -std=c++0x -fexceptions -frtti -MMD -MF ./Release/.deps/Release/obj.target/libsass/src/libsass/src/cssize.o.d.raw -c -o Release/obj.target/libsass/src/libsass/src/cssize.o ../src/libsass/src/cssize.cpp
  86. 10:24:44 AM: npm ERR! g++ '-DNODE_GYP_MODULE_NAME=libsass' '-DUSING_UV_SHARED=1' '-DUSING_V8_SHARED=1' '-DV8_DEPRECATION_WARNINGS=1' '-DV8_DEPRECATION_WARNINGS' '-DV8_IMMINENT_DEPRECATION_WARNINGS' '-D_GLIBCXX_USE_CXX11_ABI=1' '-D_LARGEFILE_SOURCE' '-D_FILE_OFFSET_BITS=64' '-D__STDC_FORMAT_MACROS' '-DOPENSSL_NO_PINSHARED' '-DOPENSSL_THREADS' '-DLIBSASS_VERSION="3.5.5"' -I/opt/buildhome/.node-gyp/16.8.0/include/node -I/opt/buildhome/.node-gyp/16.8.0/src -I/opt/buildhome/.node-gyp/16.8.0/deps/openssl/config -I/opt/buildhome/.node-gyp/16.8.0/deps/openssl/openssl/include -I/opt/buildhome/.node-gyp/16.8.0/deps/uv/include -I/opt/buildhome/.node-gyp/16.8.0/deps/zlib -I/opt/buildhome/.node-gyp/16.8.0/deps/v8/include -I../src/libsass/include -fPIC -pthread -Wall -Wextra -Wno-unused-parameter -m64 -O3 -fno-omit-frame-pointer -std=gnu++14 -std=c++0x -fexceptions -frtti -MMD -MF ./Release/.deps/Release/obj.target/libsass/src/libsass/src/emitter.o.d.raw -c -o Release/obj.target/libsass/src/libsass/src/emitter.o ../src/libsass/src/emitter.cpp
  87. 10:24:44 AM: npm ERR! g++ '-DNODE_GYP_MODULE_NAME=libsass' '-DUSING_UV_SHARED=1' '-DUSING_V8_SHARED=1' '-DV8_DEPRECATION_WARNINGS=1' '-DV8_DEPRECATION_WARNINGS' '-DV8_IMMINENT_DEPRECATION_WARNINGS' '-D_GLIBCXX_USE_CXX11_ABI=1' '-D_LARGEFILE_SOURCE' '-D_FILE_OFFSET_BITS=64' '-D__STDC_FORMAT_MACROS' '-DOPENSSL_NO_PINSHARED' '-DOPENSSL_THREADS' '-DLIBSASS_VERSION="3.5.5"' -I/opt/buildhome/.node-gyp/16.8.0/include/node -I/opt/buildhome/.node-gyp/16.8.0/src -I/opt/buildhome/.node-gyp/16.8.0/deps/openssl/config -I/opt/buildhome/.node-gyp/16.8.0/deps/openssl/openssl/include -I/opt/buildhome/.node-gyp/16.8.0/deps/uv/include -I/opt/buildhome/.node-gyp/16.8.0/deps/zlib -I/opt/buildhome/.node-gyp/16.8.0/deps/v8/include -I../src/libsass/include -fPIC -pthread -Wall -Wextra -Wno-unused-parameter -m64 -O3 -fno-omit-frame-pointer -std=gnu++14 -std=c++0x -fexceptions -frtti -MMD -MF ./Release/.deps/Release/obj.target/libsass/src/libsass/src/environment.o.d.raw -c -o Release/obj.target/libsass/src/libsass/src/environment.o ../src/libsass/src/environment.cpp
  88. 10:24:44 AM: npm ERR! g++ '-DNODE_GYP_MODULE_NAME=libsass' '-DUSING_UV_SHARED=1' '-DUSING_V8_SHARED=1' '-DV8_DEPRECATION_WARNINGS=1' '-DV8_DEPRECATION_WARNINGS' '-DV8_IMMINENT_DEPRECATION_WARNINGS' '-D_GLIBCXX_USE_CXX11_ABI=1' '-D_LARGEFILE_SOURCE' '-D_FILE_OFFSET_BITS=64' '-D__STDC_FORMAT_MACROS' '-DOPENSSL_NO_PINSHARED' '-DOPENSSL_THREADS' '-DLIBSASS_VERSION="3.5.5"' -I/opt/buildhome/.node-gyp/16.8.0/include/node -I/opt/buildhome/.node-gyp/16.8.0/src -I/opt/buildhome/.node-gyp/16.8.0/deps/openssl/config -I/opt/buildhome/.node-gyp/16.8.0/deps/openssl/openssl/include -I/opt/buildhome/.node-gyp/16.8.0/deps/uv/include -I/opt/buildhome/.node-gyp/16.8.0/deps/zlib -I/opt/buildhome/.node-gyp/16.8.0/deps/v8/include -I../src/libsass/include -fPIC -pthread -Wall -Wextra -Wno-unused-parameter -m64 -O3 -fno-omit-frame-pointer -std=gnu++14 -std=c++0x -fexceptions -frtti -MMD -MF ./Release/.deps/Release/obj.target/libsass/src/libsass/src/error_handling.o.d.raw -c -o Release/obj.target/libsass/src/libsass/src/error_handling.o ../src/libsass/src/error_handling.cpp
  89. 10:24:44 AM: npm ERR! g++ '-DNODE_GYP_MODULE_NAME=libsass' '-DUSING_UV_SHARED=1' '-DUSING_V8_SHARED=1' '-DV8_DEPRECATION_WARNINGS=1' '-DV8_DEPRECATION_WARNINGS' '-DV8_IMMINENT_DEPRECATION_WARNINGS' '-D_GLIBCXX_USE_CXX11_ABI=1' '-D_LARGEFILE_SOURCE' '-D_FILE_OFFSET_BITS=64' '-D__STDC_FORMAT_MACROS' '-DOPENSSL_NO_PINSHARED' '-DOPENSSL_THREADS' '-DLIBSASS_VERSION="3.5.5"' -I/opt/buildhome/.node-gyp/16.8.0/include/node -I/opt/buildhome/.node-gyp/16.8.0/src -I/opt/buildhome/.node-gyp/16.8.0/deps/openssl/config -I/opt/buildhome/.node-gyp/16.8.0/deps/openssl/openssl/include -I/opt/buildhome/.node-gyp/16.8.0/deps/uv/include -I/opt/buildhome/.node-gyp/16.8.0/deps/zlib -I/opt/buildhome/.node-gyp/16.8.0/deps/v8/include -I../src/libsass/include -fPIC -pthread -Wall -Wextra -Wno-unused-parameter -m64 -O3 -fno-omit-frame-pointer -std=gnu++14 -std=c++0x -fexceptions -frtti -MMD -MF ./Release/.deps/Release/obj.target/libsass/src/libsass/src/eval.o.d.raw -c -o Release/obj.target/libsass/src/libsass/src/eval.o ../src/libsass/src/eval.cpp
  90. 10:24:44 AM: npm ERR! g++ '-DNODE_GYP_MODULE_NAME=libsass' '-DUSING_UV_SHARED=1' '-DUSING_V8_SHARED=1' '-DV8_DEPRECATION_WARNINGS=1' '-DV8_DEPRECATION_WARNINGS' '-DV8_IMMINENT_DEPRECATION_WARNINGS' '-D_GLIBCXX_USE_CXX11_ABI=1' '-D_LARGEFILE_SOURCE' '-D_FILE_OFFSET_BITS=64' '-D__STDC_FORMAT_MACROS' '-DOPENSSL_NO_PINSHARED' '-DOPENSSL_THREADS' '-DLIBSASS_VERSION="3.5.5"' -I/opt/buildhome/.node-gyp/16.8.0/include/node -I/opt/buildhome/.node-gyp/16.8.0/src -I/opt/buildhome/.node-gyp/16.8.0/deps/openssl/config -I/opt/buildhome/.node-gyp/16.8.0/deps/openssl/openssl/include -I/opt/buildhome/.node-gyp/16.8.0/deps/uv/include -I/opt/buildhome/.node-gyp/16.8.0/deps/zlib -I/opt/buildhome/.node-gyp/16.8.0/deps/v8/include -I../src/libsass/include -fPIC -pthread -Wall -Wextra -Wno-unused-parameter -m64 -O3 -fno-omit-frame-pointer -std=gnu++14 -std=c++0x -fexceptions -frtti -MMD -MF ./Release/.deps/Release/obj.target/libsass/src/libsass/src/expand.o.d.raw -c -o Release/obj.target/libsass/src/libsass/src/expand.o ../src/libsass/src/expand.cpp
  91. 10:24:44 AM: npm ERR! g++ '-DNODE_GYP_MODULE_NAME=libsass' '-DUSING_UV_SHARED=1' '-DUSING_V8_SHARED=1' '-DV8_DEPRECATION_WARNINGS=1' '-DV8_DEPRECATION_WARNINGS' '-DV8_IMMINENT_DEPRECATION_WARNINGS' '-D_GLIBCXX_USE_CXX11_ABI=1' '-D_LARGEFILE_SOURCE' '-D_FILE_OFFSET_BITS=64' '-D__STDC_FORMAT_MACROS' '-DOPENSSL_NO_PINSHARED' '-DOPENSSL_THREADS' '-DLIBSASS_VERSION="3.5.5"' -I/opt/buildhome/.node-gyp/16.8.0/include/node -I/opt/buildhome/.node-gyp/16.8.0/src -I/opt/buildhome/.node-gyp/16.8.0/deps/openssl/config -I/opt/buildhome/.node-gyp/16.8.0/deps/openssl/openssl/include -I/opt/buildhome/.node-gyp/16.8.0/deps/uv/include -I/opt/buildhome/.node-gyp/16.8.0/deps/zlib -I/opt/buildhome/.node-gyp/16.8.0/deps/v8/include -I../src/libsass/include -fPIC -pthread -Wall -Wextra -Wno-unused-parameter -m64 -O3 -fno-omit-frame-pointer -std=gnu++14 -std=c++0x -fexceptions -frtti -MMD -MF ./Release/.deps/Release/obj.target/libsass/src/libsass/src/extend.o.d.raw -c -o Release/obj.target/libsass/src/libsass/src/extend.o ../src/libsass/src/extend.cpp
  92. 10:24:44 AM: npm ERR! g++ '-DNODE_GYP_MODULE_NAME=libsass' '-DUSING_UV_SHARED=1' '-DUSING_V8_SHARED=1' '-DV8_DEPRECATION_WARNINGS=1' '-DV8_DEPRECATION_WARNINGS' '-DV8_IMMINENT_DEPRECATION_WARNINGS' '-D_GLIBCXX_USE_CXX11_ABI=1' '-D_LARGEFILE_SOURCE' '-D_FILE_OFFSET_BITS=64' '-D__STDC_FORMAT_MACROS' '-DOPENSSL_NO_PINSHARED' '-DOPENSSL_THREADS' '-DLIBSASS_VERSION="3.5.5"' -I/opt/buildhome/.node-gyp/16.8.0/include/node -I/opt/buildhome/.node-gyp/16.8.0/src -I/opt/buildhome/.node-gyp/16.8.0/deps/openssl/config -I/opt/buildhome/.node-gyp/16.8.0/deps/openssl/openssl/include -I/opt/buildhome/.node-gyp/16.8.0/deps/uv/include -I/opt/buildhome/.node-gyp/16.8.0/deps/zlib -I/opt/buildhome/.node-gyp/16.8.0/deps/v8/include -I../src/libsass/include -fPIC -pthread -Wall -Wextra -Wno-unused-parameter -m64 -O3 -fno-omit-frame-pointer -std=gnu++14 -std=c++0x -fexceptions -frtti -MMD -MF ./Release/.deps/Release/obj.target/libsass/src/libsass/src/file.o.d.raw -c -o Release/obj.target/libsass/src/libsass/src/file.o ../src/libsass/src/file.cpp
  93. 10:24:44 AM: npm ERR! g++ '-DNODE_GYP_MODULE_NAME=libsass' '-DUSING_UV_SHARED=1' '-DUSING_V8_SHARED=1' '-DV8_DEPRECATION_WARNINGS=1' '-DV8_DEPRECATION_WARNINGS' '-DV8_IMMINENT_DEPRECATION_WARNINGS' '-D_GLIBCXX_USE_CXX11_ABI=1' '-D_LARGEFILE_SOURCE' '-D_FILE_OFFSET_BITS=64' '-D__STDC_FORMAT_MACROS' '-DOPENSSL_NO_PINSHARED' '-DOPENSSL_THREADS' '-DLIBSASS_VERSION="3.5.5"' -I/opt/buildhome/.node-gyp/16.8.0/include/node -I/opt/buildhome/.node-gyp/16.8.0/src -I/opt/buildhome/.node-gyp/16.8.0/deps/openssl/config -I/opt/buildhome/.node-gyp/16.8.0/deps/openssl/openssl/include -I/opt/buildhome/.node-gyp/16.8.0/deps/uv/include -I/opt/buildhome/.node-gyp/16.8.0/deps/zlib -I/opt/buildhome/.node-gyp/16.8.0/deps/v8/include -I../src/libsass/include -fPIC -pthread -Wall -Wextra -Wno-unused-parameter -m64 -O3 -fno-omit-frame-pointer -std=gnu++14 -std=c++0x -fexceptions -frtti -MMD -MF ./Release/.deps/Release/obj.target/libsass/src/libsass/src/functions.o.d.raw -c -o Release/obj.target/libsass/src/libsass/src/functions.o ../src/libsass/src/functions.cpp
  94. 10:24:44 AM: npm ERR! g++ '-DNODE_GYP_MODULE_NAME=libsass' '-DUSING_UV_SHARED=1' '-DUSING_V8_SHARED=1' '-DV8_DEPRECATION_WARNINGS=1' '-DV8_DEPRECATION_WARNINGS' '-DV8_IMMINENT_DEPRECATION_WARNINGS' '-D_GLIBCXX_USE_CXX11_ABI=1' '-D_LARGEFILE_SOURCE' '-D_FILE_OFFSET_BITS=64' '-D__STDC_FORMAT_MACROS' '-DOPENSSL_NO_PINSHARED' '-DOPENSSL_THREADS' '-DLIBSASS_VERSION="3.5.5"' -I/opt/buildhome/.node-gyp/16.8.0/include/node -I/opt/buildhome/.node-gyp/16.8.0/src -I/opt/buildhome/.node-gyp/16.8.0/deps/openssl/config -I/opt/buildhome/.node-gyp/16.8.0/deps/openssl/openssl/include -I/opt/buildhome/.node-gyp/16.8.0/deps/uv/include -I/opt/buildhome/.node-gyp/16.8.0/deps/zlib -I/opt/buildhome/.node-gyp/16.8.0/deps/v8/include -I../src/libsass/include -fPIC -pthread -Wall -Wextra -Wno-unused-parameter -m64 -O3 -fno-omit-frame-pointer -std=gnu++14 -std=c++0x -fexceptions -frtti -MMD -MF ./Release/.deps/Release/obj.target/libsass/src/libsass/src/inspect.o.d.raw -c -o Release/obj.target/libsass/src/libsass/src/inspect.o ../src/libsass/src/inspect.cpp
  95. 10:24:44 AM: npm ERR! g++ '-DNODE_GYP_MODULE_NAME=libsass' '-DUSING_UV_SHARED=1' '-DUSING_V8_SHARED=1' '-DV8_DEPRECATION_WARNINGS=1' '-DV8_DEPRECATION_WARNINGS' '-DV8_IMMINENT_DEPRECATION_WARNINGS' '-D_GLIBCXX_USE_CXX11_ABI=1' '-D_LARGEFILE_SOURCE' '-D_FILE_OFFSET_BITS=64' '-D__STDC_FORMAT_MACROS' '-DOPENSSL_NO_PINSHARED' '-DOPENSSL_THREADS' '-DLIBSASS_VERSION="3.5.5"' -I/opt/buildhome/.node-gyp/16.8.0/include/node -I/opt/buildhome/.node-gyp/16.8.0/src -I/opt/buildhome/.node-gyp/16.8.0/deps/openssl/config -I/opt/buildhome/.node-gyp/16.8.0/deps/openssl/openssl/include -I/opt/buildhome/.node-gyp/16.8.0/deps/uv/include -I/opt/buildhome/.node-gyp/16.8.0/deps/zlib -I/opt/buildhome/.node-gyp/16.8.0/deps/v8/include -I../src/libsass/include -fPIC -pthread -Wall -Wextra -Wno-unused-parameter -m64 -O3 -fno-omit-frame-pointer -std=gnu++14 -std=c++0x -fexceptions -frtti -MMD -MF ./Release/.deps/Release/obj.target/libsass/src/libsass/src/json.o.d.raw -c -o Release/obj.target/libsass/src/libsass/src/json.o ../src/libsass/src/json.cpp
  96. 10:24:44 AM: npm ERR! g++ '-DNODE_GYP_MODULE_NAME=libsass' '-DUSING_UV_SHARED=1' '-DUSING_V8_SHARED=1' '-DV8_DEPRECATION_WARNINGS=1' '-DV8_DEPRECATION_WARNINGS' '-DV8_IMMINENT_DEPRECATION_WARNINGS' '-D_GLIBCXX_USE_CXX11_ABI=1' '-D_LARGEFILE_SOURCE' '-D_FILE_OFFSET_BITS=64' '-D__STDC_FORMAT_MACROS' '-DOPENSSL_NO_PINSHARED' '-DOPENSSL_THREADS' '-DLIBSASS_VERSION="3.5.5"' -I/opt/buildhome/.node-gyp/16.8.0/include/node -I/opt/buildhome/.node-gyp/16.8.0/src -I/opt/buildhome/.node-gyp/16.8.0/deps/openssl/config -I/opt/buildhome/.node-gyp/16.8.0/deps/openssl/openssl/include -I/opt/buildhome/.node-gyp/16.8.0/deps/uv/include -I/opt/buildhome/.node-gyp/16.8.0/deps/zlib -I/opt/buildhome/.node-gyp/16.8.0/deps/v8/include -I../src/libsass/include -fPIC -pthread -Wall -Wextra -Wno-unused-parameter -m64 -O3 -fno-omit-frame-pointer -std=gnu++14 -std=c++0x -fexceptions -frtti -MMD -MF ./Release/.deps/Release/obj.target/libsass/src/libsass/src/lexer.o.d.raw -c -o Release/obj.target/libsass/src/libsass/src/lexer.o ../src/libsass/src/lexer.cpp
  97. 10:24:44 AM: npm ERR! g++ '-DNODE_GYP_MODULE_NAME=libsass' '-DUSING_UV_SHARED=1' '-DUSING_V8_SHARED=1' '-DV8_DEPRECATION_WARNINGS=1' '-DV8_DEPRECATION_WARNINGS' '-DV8_IMMINENT_DEPRECATION_WARNINGS' '-D_GLIBCXX_USE_CXX11_ABI=1' '-D_LARGEFILE_SOURCE' '-D_FILE_OFFSET_BITS=64' '-D__STDC_FORMAT_MACROS' '-DOPENSSL_NO_PINSHARED' '-DOPENSSL_THREADS' '-DLIBSASS_VERSION="3.5.5"' -I/opt/buildhome/.node-gyp/16.8.0/include/node -I/opt/buildhome/.node-gyp/16.8.0/src -I/opt/buildhome/.node-gyp/16.8.0/deps/openssl/config -I/opt/buildhome/.node-gyp/16.8.0/deps/openssl/openssl/include -I/opt/buildhome/.node-gyp/16.8.0/deps/uv/include -I/opt/buildhome/.node-gyp/16.8.0/deps/zlib -I/opt/buildhome/.node-gyp/16.8.0/deps/v8/include -I../src/libsass/include -fPIC -pthread -Wall -Wextra -Wno-unused-parameter -m64 -O3 -fno-omit-frame-pointer -std=gnu++14 -std=c++0x -fexceptions -frtti -MMD -MF ./Release/.deps/Release/obj.target/libsass/src/libsass/src/listize.o.d.raw -c -o Release/obj.target/libsass/src/libsass/src/listize.o ../src/libsass/src/listize.cpp
  98. 10:24:44 AM: npm ERR! g++ '-DNODE_GYP_MODULE_NAME=libsass' '-DUSING_UV_SHARED=1' '-DUSING_V8_SHARED=1' '-DV8_DEPRECATION_WARNINGS=1' '-DV8_DEPRECATION_WARNINGS' '-DV8_IMMINENT_DEPRECATION_WARNINGS' '-D_GLIBCXX_USE_CXX11_ABI=1' '-D_LARGEFILE_SOURCE' '-D_FILE_OFFSET_BITS=64' '-D__STDC_FORMAT_MACROS' '-DOPENSSL_NO_PINSHARED' '-DOPENSSL_THREADS' '-DLIBSASS_VERSION="3.5.5"' -I/opt/buildhome/.node-gyp/16.8.0/include/node -I/opt/buildhome/.node-gyp/16.8.0/src -I/opt/buildhome/.node-gyp/16.8.0/deps/openssl/config -I/opt/buildhome/.node-gyp/16.8.0/deps/openssl/openssl/include -I/opt/buildhome/.node-gyp/16.8.0/deps/uv/include -I/opt/buildhome/.node-gyp/16.8.0/deps/zlib -I/opt/buildhome/.node-gyp/16.8.0/deps/v8/include -I../src/libsass/include -fPIC -pthread -Wall -Wextra -Wno-unused-parameter -m64 -O3 -fno-omit-frame-pointer -std=gnu++14 -std=c++0x -fexceptions -frtti -MMD -MF ./Release/.deps/Release/obj.target/libsass/src/libsass/src/memory/SharedPtr.o.d.raw -c -o Release/obj.target/libsass/src/libsass/src/memory/SharedPtr.o ../src/libsass/src/memory/SharedPtr.cpp
  99. 10:24:44 AM: npm ERR! g++ '-DNODE_GYP_MODULE_NAME=libsass' '-DUSING_UV_SHARED=1' '-DUSING_V8_SHARED=1' '-DV8_DEPRECATION_WARNINGS=1' '-DV8_DEPRECATION_WARNINGS' '-DV8_IMMINENT_DEPRECATION_WARNINGS' '-D_GLIBCXX_USE_CXX11_ABI=1' '-D_LARGEFILE_SOURCE' '-D_FILE_OFFSET_BITS=64' '-D__STDC_FORMAT_MACROS' '-DOPENSSL_NO_PINSHARED' '-DOPENSSL_THREADS' '-DLIBSASS_VERSION="3.5.5"' -I/opt/buildhome/.node-gyp/16.8.0/include/node -I/opt/buildhome/.node-gyp/16.8.0/src -I/opt/buildhome/.node-gyp/16.8.0/deps/openssl/config -I/opt/buildhome/.node-gyp/16.8.0/deps/openssl/openssl/include -I/opt/buildhome/.node-gyp/16.8.0/deps/uv/include -I/opt/buildhome/.node-gyp/16.8.0/deps/zlib -I/opt/buildhome/.node-gyp/16.8.0/deps/v8/include -I../src/libsass/include -fPIC -pthread -Wall -Wextra -Wno-unused-parameter -m64 -O3 -fno-omit-frame-pointer -std=gnu++14 -std=c++0x -fexceptions -frtti -MMD -MF ./Release/.deps/Release/obj.target/libsass/src/libsass/src/node.o.d.raw -c -o Release/obj.target/libsass/src/libsass/src/node.o ../src/libsass/src/node.cpp
  100. 10:24:44 AM: npm ERR! g++ '-DNODE_GYP_MODULE_NAME=libsass' '-DUSING_UV_SHARED=1' '-DUSING_V8_SHARED=1' '-DV8_DEPRECATION_WARNINGS=1' '-DV8_DEPRECATION_WARNINGS' '-DV8_IMMINENT_DEPRECATION_WARNINGS' '-D_GLIBCXX_USE_CXX11_ABI=1' '-D_LARGEFILE_SOURCE' '-D_FILE_OFFSET_BITS=64' '-D__STDC_FORMAT_MACROS' '-DOPENSSL_NO_PINSHARED' '-DOPENSSL_THREADS' '-DLIBSASS_VERSION="3.5.5"' -I/opt/buildhome/.node-gyp/16.8.0/include/node -I/opt/buildhome/.node-gyp/16.8.0/src -I/opt/buildhome/.node-gyp/16.8.0/deps/openssl/config -I/opt/buildhome/.node-gyp/16.8.0/deps/openssl/openssl/include -I/opt/buildhome/.node-gyp/16.8.0/deps/uv/include -I/opt/buildhome/.node-gyp/16.8.0/deps/zlib -I/opt/buildhome/.node-gyp/16.8.0/deps/v8/include -I../src/libsass/include -fPIC -pthread -Wall -Wextra -Wno-unused-parameter -m64 -O3 -fno-omit-frame-pointer -std=gnu++14 -std=c++0x -fexceptions -frtti -MMD -MF ./Release/.deps/Release/obj.target/libsass/src/libsass/src/operators.o.d.raw -c -o Release/obj.target/libsass/src/libsass/src/operators.o ../src/libsass/src/operators.cpp
  101. 10:24:44 AM: npm ERR! g++ '-DNODE_GYP_MODULE_NAME=libsass' '-DUSING_UV_SHARED=1' '-DUSING_V8_SHARED=1' '-DV8_DEPRECATION_WARNINGS=1' '-DV8_DEPRECATION_WARNINGS' '-DV8_IMMINENT_DEPRECATION_WARNINGS' '-D_GLIBCXX_USE_CXX11_ABI=1' '-D_LARGEFILE_SOURCE' '-D_FILE_OFFSET_BITS=64' '-D__STDC_FORMAT_MACROS' '-DOPENSSL_NO_PINSHARED' '-DOPENSSL_THREADS' '-DLIBSASS_VERSION="3.5.5"' -I/opt/buildhome/.node-gyp/16.8.0/include/node -I/opt/buildhome/.node-gyp/16.8.0/src -I/opt/buildhome/.node-gyp/16.8.0/deps/openssl/config -I/opt/buildhome/.node-gyp/16.8.0/deps/openssl/openssl/include -I/opt/buildhome/.node-gyp/16.8.0/deps/uv/include -I/opt/buildhome/.node-gyp/16.8.0/deps/zlib -I/opt/buildhome/.node-gyp/16.8.0/deps/v8/include -I../src/libsass/include -fPIC -pthread -Wall -Wextra -Wno-unused-parameter -m64 -O3 -fno-omit-frame-pointer -std=gnu++14 -std=c++0x -fexceptions -frtti -MMD -MF ./Release/.deps/Release/obj.target/libsass/src/libsass/src/output.o.d.raw -c -o Release/obj.target/libsass/src/libsass/src/output.o ../src/libsass/src/output.cpp
  102. 10:24:44 AM: npm ERR! g++ '-DNODE_GYP_MODULE_NAME=libsass' '-DUSING_UV_SHARED=1' '-DUSING_V8_SHARED=1' '-DV8_DEPRECATION_WARNINGS=1' '-DV8_DEPRECATION_WARNINGS' '-DV8_IMMINENT_DEPRECATION_WARNINGS' '-D_GLIBCXX_USE_CXX11_ABI=1' '-D_LARGEFILE_SOURCE' '-D_FILE_OFFSET_BITS=64' '-D__STDC_FORMAT_MACROS' '-DOPENSSL_NO_PINSHARED' '-DOPENSSL_THREADS' '-DLIBSASS_VERSION="3.5.5"' -I/opt/buildhome/.node-gyp/16.8.0/include/node -I/opt/buildhome/.node-gyp/16.8.0/src -I/opt/buildhome/.node-gyp/16.8.0/deps/openssl/config -I/opt/buildhome/.node-gyp/16.8.0/deps/openssl/openssl/include -I/opt/buildhome/.node-gyp/16.8.0/deps/uv/include -I/opt/buildhome/.node-gyp/16.8.0/deps/zlib -I/opt/buildhome/.node-gyp/16.8.0/deps/v8/include -I../src/libsass/include -fPIC -pthread -Wall -Wextra -Wno-unused-parameter -m64 -O3 -fno-omit-frame-pointer -std=gnu++14 -std=c++0x -fexceptions -frtti -MMD -MF ./Release/.deps/Release/obj.target/libsass/src/libsass/src/parser.o.d.raw -c -o Release/obj.target/libsass/src/libsass/src/parser.o ../src/libsass/src/parser.cpp
  103. 10:24:44 AM: npm ERR! g++ '-DNODE_GYP_MODULE_NAME=libsass' '-DUSING_UV_SHARED=1' '-DUSING_V8_SHARED=1' '-DV8_DEPRECATION_WARNINGS=1' '-DV8_DEPRECATION_WARNINGS' '-DV8_IMMINENT_DEPRECATION_WARNINGS' '-D_GLIBCXX_USE_CXX11_ABI=1' '-D_LARGEFILE_SOURCE' '-D_FILE_OFFSET_BITS=64' '-D__STDC_FORMAT_MACROS' '-DOPENSSL_NO_PINSHARED' '-DOPENSSL_THREADS' '-DLIBSASS_VERSION="3.5.5"' -I/opt/buildhome/.node-gyp/16.8.0/include/node -I/opt/buildhome/.node-gyp/16.8.0/src -I/opt/buildhome/.node-gyp/16.8.0/deps/openssl/config -I/opt/buildhome/.node-gyp/16.8.0/deps/openssl/openssl/include -I/opt/buildhome/.node-gyp/16.8.0/deps/uv/include -I/opt/buildhome/.node-gyp/16.8.0/deps/zlib -I/opt/buildhome/.node-gyp/16.8.0/deps/v8/include -I../src/libsass/include -fPIC -pthread -Wall -Wextra -Wno-unused-parameter -m64 -O3 -fno-omit-frame-pointer -std=gnu++14 -std=c++0x -fexceptions -frtti -MMD -MF ./Release/.deps/Release/obj.target/libsass/src/libsass/src/plugins.o.d.raw -c -o Release/obj.target/libsass/src/libsass/src/plugins.o ../src/libsass/src/plugins.cpp
  104. 10:24:44 AM: npm ERR! g++ '-DNODE_GYP_MODULE_NAME=libsass' '-DUSING_UV_SHARED=1' '-DUSING_V8_SHARED=1' '-DV8_DEPRECATION_WARNINGS=1' '-DV8_DEPRECATION_WARNINGS' '-DV8_IMMINENT_DEPRECATION_WARNINGS' '-D_GLIBCXX_USE_CXX11_ABI=1' '-D_LARGEFILE_SOURCE' '-D_FILE_OFFSET_BITS=64' '-D__STDC_FORMAT_MACROS' '-DOPENSSL_NO_PINSHARED' '-DOPENSSL_THREADS' '-DLIBSASS_VERSION="3.5.5"' -I/opt/buildhome/.node-gyp/16.8.0/include/node -I/opt/buildhome/.node-gyp/16.8.0/src -I/opt/buildhome/.node-gyp/16.8.0/deps/openssl/config -I/opt/buildhome/.node-gyp/16.8.0/deps/openssl/openssl/include -I/opt/buildhome/.node-gyp/16.8.0/deps/uv/include -I/opt/buildhome/.node-gyp/16.8.0/deps/zlib -I/opt/buildhome/.node-gyp/16.8.0/deps/v8/include -I../src/libsass/include -fPIC -pthread -Wall -Wextra -Wno-unused-parameter -m64 -O3 -fno-omit-frame-pointer -std=gnu++14 -std=c++0x -fexceptions -frtti -MMD -MF ./Release/.deps/Release/obj.target/libsass/src/libsass/src/position.o.d.raw -c -o Release/obj.target/libsass/src/libsass/src/position.o ../src/libsass/src/position.cpp
  105. 10:24:44 AM: npm ERR! g++ '-DNODE_GYP_MODULE_NAME=libsass' '-DUSING_UV_SHARED=1' '-DUSING_V8_SHARED=1' '-DV8_DEPRECATION_WARNINGS=1' '-DV8_DEPRECATION_WARNINGS' '-DV8_IMMINENT_DEPRECATION_WARNINGS' '-D_GLIBCXX_USE_CXX11_ABI=1' '-D_LARGEFILE_SOURCE' '-D_FILE_OFFSET_BITS=64' '-D__STDC_FORMAT_MACROS' '-DOPENSSL_NO_PINSHARED' '-DOPENSSL_THREADS' '-DLIBSASS_VERSION="3.5.5"' -I/opt/buildhome/.node-gyp/16.8.0/include/node -I/opt/buildhome/.node-gyp/16.8.0/src -I/opt/buildhome/.node-gyp/16.8.0/deps/openssl/config -I/opt/buildhome/.node-gyp/16.8.0/deps/openssl/openssl/include -I/opt/buildhome/.node-gyp/16.8.0/deps/uv/include -I/opt/buildhome/.node-gyp/16.8.0/deps/zlib -I/opt/buildhome/.node-gyp/16.8.0/deps/v8/include -I../src/libsass/include -fPIC -pthread -Wall -Wextra -Wno-unused-parameter -m64 -O3 -fno-omit-frame-pointer -std=gnu++14 -std=c++0x -fexceptions -frtti -MMD -MF ./Release/.deps/Release/obj.target/libsass/src/libsass/src/prelexer.o.d.raw -c -o Release/obj.target/libsass/src/libsass/src/prelexer.o ../src/libsass/src/prelexer.cpp
  106. 10:24:44 AM: npm ERR! g++ '-DNODE_GYP_MODULE_NAME=libsass' '-DUSING_UV_SHARED=1' '-DUSING_V8_SHARED=1' '-DV8_DEPRECATION_WARNINGS=1' '-DV8_DEPRECATION_WARNINGS' '-DV8_IMMINENT_DEPRECATION_WARNINGS' '-D_GLIBCXX_USE_CXX11_ABI=1' '-D_LARGEFILE_SOURCE' '-D_FILE_OFFSET_BITS=64' '-D__STDC_FORMAT_MACROS' '-DOPENSSL_NO_PINSHARED' '-DOPENSSL_THREADS' '-DLIBSASS_VERSION="3.5.5"' -I/opt/buildhome/.node-gyp/16.8.0/include/node -I/opt/buildhome/.node-gyp/16.8.0/src -I/opt/buildhome/.node-gyp/16.8.0/deps/openssl/config -I/opt/buildhome/.node-gyp/16.8.0/deps/openssl/openssl/include -I/opt/buildhome/.node-gyp/16.8.0/deps/uv/include -I/opt/buildhome/.node-gyp/16.8.0/deps/zlib -I/opt/buildhome/.node-gyp/16.8.0/deps/v8/include -I../src/libsass/include -fPIC -pthread -Wall -Wextra -Wno-unused-parameter -m64 -O3 -fno-omit-frame-pointer -std=gnu++14 -std=c++0x -fexceptions -frtti -MMD -MF ./Release/.deps/Release/obj.target/libsass/src/libsass/src/remove_placeholders.o.d.raw -c -o Release/obj.target/libsass/src/libsass/src/remove_placeholders.o ../src/libsass/src/remove_placeholders.cpp
  107. 10:24:44 AM: npm ERR! g++ '-DNODE_GYP_MODULE_NAME=libsass' '-DUSING_UV_SHARED=1' '-DUSING_V8_SHARED=1' '-DV8_DEPRECATION_WARNINGS=1' '-DV8_DEPRECATION_WARNINGS' '-DV8_IMMINENT_DEPRECATION_WARNINGS' '-D_GLIBCXX_USE_CXX11_ABI=1' '-D_LARGEFILE_SOURCE' '-D_FILE_OFFSET_BITS=64' '-D__STDC_FORMAT_MACROS' '-DOPENSSL_NO_PINSHARED' '-DOPENSSL_THREADS' '-DLIBSASS_VERSION="3.5.5"' -I/opt/buildhome/.node-gyp/16.8.0/include/node -I/opt/buildhome/.node-gyp/16.8.0/src -I/opt/buildhome/.node-gyp/16.8.0/deps/openssl/config -I/opt/buildhome/.node-gyp/16.8.0/deps/openssl/openssl/include -I/opt/buildhome/.node-gyp/16.8.0/deps/uv/include -I/opt/buildhome/.node-gyp/16.8.0/deps/zlib -I/opt/buildhome/.node-gyp/16.8.0/deps/v8/include -I../src/libsass/include -fPIC -pthread -Wall -Wextra -Wno-unused-parameter -m64 -O3 -fno-omit-frame-pointer -std=gnu++14 -std=c++0x -fexceptions -frtti -MMD -MF ./Release/.deps/Release/obj.target/libsass/src/libsass/src/sass.o.d.raw -c -o Release/obj.target/libsass/src/libsass/src/sass.o ../src/libsass/src/sass.cpp
  108. 10:24:44 AM: npm ERR! g++ '-DNODE_GYP_MODULE_NAME=libsass' '-DUSING_UV_SHARED=1' '-DUSING_V8_SHARED=1' '-DV8_DEPRECATION_WARNINGS=1' '-DV8_DEPRECATION_WARNINGS' '-DV8_IMMINENT_DEPRECATION_WARNINGS' '-D_GLIBCXX_USE_CXX11_ABI=1' '-D_LARGEFILE_SOURCE' '-D_FILE_OFFSET_BITS=64' '-D__STDC_FORMAT_MACROS' '-DOPENSSL_NO_PINSHARED' '-DOPENSSL_THREADS' '-DLIBSASS_VERSION="3.5.5"' -I/opt/buildhome/.node-gyp/16.8.0/include/node -I/opt/buildhome/.node-gyp/16.8.0/src -I/opt/buildhome/.node-gyp/16.8.0/deps/openssl/config -I/opt/buildhome/.node-gyp/16.8.0/deps/openssl/openssl/include -I/opt/buildhome/.node-gyp/16.8.0/deps/uv/include -I/opt/buildhome/.node-gyp/16.8.0/deps/zlib -I/opt/buildhome/.node-gyp/16.8.0/deps/v8/include -I../src/libsass/include -fPIC -pthread -Wall -Wextra -Wno-unused-parameter -m64 -O3 -fno-omit-frame-pointer -std=gnu++14 -std=c++0x -fexceptions -frtti -MMD -MF ./Release/.deps/Release/obj.target/libsass/src/libsass/src/sass2scss.o.d.raw -c -o Release/obj.target/libsass/src/libsass/src/sass2scss.o ../src/libsass/src/sass2scss.cpp
  109. 10:24:44 AM: npm ERR! g++ '-DNODE_GYP_MODULE_NAME=libsass' '-DUSING_UV_SHARED=1' '-DUSING_V8_SHARED=1' '-DV8_DEPRECATION_WARNINGS=1' '-DV8_DEPRECATION_WARNINGS' '-DV8_IMMINENT_DEPRECATION_WARNINGS' '-D_GLIBCXX_USE_CXX11_ABI=1' '-D_LARGEFILE_SOURCE' '-D_FILE_OFFSET_BITS=64' '-D__STDC_FORMAT_MACROS' '-DOPENSSL_NO_PINSHARED' '-DOPENSSL_THREADS' '-DLIBSASS_VERSION="3.5.5"' -I/opt/buildhome/.node-gyp/16.8.0/include/node -I/opt/buildhome/.node-gyp/16.8.0/src -I/opt/buildhome/.node-gyp/16.8.0/deps/openssl/config -I/opt/buildhome/.node-gyp/16.8.0/deps/openssl/openssl/include -I/opt/buildhome/.node-gyp/16.8.0/deps/uv/include -I/opt/buildhome/.node-gyp/16.8.0/deps/zlib -I/opt/buildhome/.node-gyp/16.8.0/deps/v8/include -I../src/libsass/include -fPIC -pthread -Wall -Wextra -Wno-unused-parameter -m64 -O3 -fno-omit-frame-pointer -std=gnu++14 -std=c++0x -fexceptions -frtti -MMD -MF ./Release/.deps/Release/obj.target/libsass/src/libsass/src/sass_context.o.d.raw -c -o Release/obj.target/libsass/src/libsass/src/sass_context.o ../src/libsass/src/sass_context.cpp
  110. 10:24:44 AM: npm ERR! g++ '-DNODE_GYP_MODULE_NAME=libsass' '-DUSING_UV_SHARED=1' '-DUSING_V8_SHARED=1' '-DV8_DEPRECATION_WARNINGS=1' '-DV8_DEPRECATION_WARNINGS' '-DV8_IMMINENT_DEPRECATION_WARNINGS' '-D_GLIBCXX_USE_CXX11_ABI=1' '-D_LARGEFILE_SOURCE' '-D_FILE_OFFSET_BITS=64' '-D__STDC_FORMAT_MACROS' '-DOPENSSL_NO_PINSHARED' '-DOPENSSL_THREADS' '-DLIBSASS_VERSION="3.5.5"' -I/opt/buildhome/.node-gyp/16.8.0/include/node -I/opt/buildhome/.node-gyp/16.8.0/src -I/opt/buildhome/.node-gyp/16.8.0/deps/openssl/config -I/opt/buildhome/.node-gyp/16.8.0/deps/openssl/openssl/include -I/opt/buildhome/.node-gyp/16.8.0/deps/uv/include -I/opt/buildhome/.node-gyp/16.8.0/deps/zlib -I/opt/buildhome/.node-gyp/16.8.0/deps/v8/include -I../src/libsass/include -fPIC -pthread -Wall -Wextra -Wno-unused-parameter -m64 -O3 -fno-omit-frame-pointer -std=gnu++14 -std=c++0x -fexceptions -frtti -MMD -MF ./Release/.deps/Release/obj.target/libsass/src/libsass/src/sass_functions.o.d.raw -c -o Release/obj.target/libsass/src/libsass/src/sass_functions.o ../src/libsass/src/sass_functions.cpp
  111. 10:24:44 AM: npm ERR! g++ '-DNODE_GYP_MODULE_NAME=libsass' '-DUSING_UV_SHARED=1' '-DUSING_V8_SHARED=1' '-DV8_DEPRECATION_WARNINGS=1' '-DV8_DEPRECATION_WARNINGS' '-DV8_IMMINENT_DEPRECATION_WARNINGS' '-D_GLIBCXX_USE_CXX11_ABI=1' '-D_LARGEFILE_SOURCE' '-D_FILE_OFFSET_BITS=64' '-D__STDC_FORMAT_MACROS' '-DOPENSSL_NO_PINSHARED' '-DOPENSSL_THREADS' '-DLIBSASS_VERSION="3.5.5"' -I/opt/buildhome/.node-gyp/16.8.0/include/node -I/opt/buildhome/.node-gyp/16.8.0/src -I/opt/buildhome/.node-gyp/16.8.0/deps/openssl/config -I/opt/buildhome/.node-gyp/16.8.0/deps/openssl/openssl/include -I/opt/buildhome/.node-gyp/16.8.0/deps/uv/include -I/opt/buildhome/.node-gyp/16.8.0/deps/zlib -I/opt/buildhome/.node-gyp/16.8.0/deps/v8/include -I../src/libsass/include -fPIC -pthread -Wall -Wextra -Wno-unused-parameter -m64 -O3 -fno-omit-frame-pointer -std=gnu++14 -std=c++0x -fexceptions -frtti -MMD -MF ./Release/.deps/Release/obj.target/libsass/src/libsass/src/sass_util.o.d.raw -c -o Release/obj.target/libsass/src/libsass/src/sass_util.o ../src/libsass/src/sass_util.cpp
  112. 10:24:44 AM: npm ERR! g++ '-DNODE_GYP_MODULE_NAME=libsass' '-DUSING_UV_SHARED=1' '-DUSING_V8_SHARED=1' '-DV8_DEPRECATION_WARNINGS=1' '-DV8_DEPRECATION_WARNINGS' '-DV8_IMMINENT_DEPRECATION_WARNINGS' '-D_GLIBCXX_USE_CXX11_ABI=1' '-D_LARGEFILE_SOURCE' '-D_FILE_OFFSET_BITS=64' '-D__STDC_FORMAT_MACROS' '-DOPENSSL_NO_PINSHARED' '-DOPENSSL_THREADS' '-DLIBSASS_VERSION="3.5.5"' -I/opt/buildhome/.node-gyp/16.8.0/include/node -I/opt/buildhome/.node-gyp/16.8.0/src -I/opt/buildhome/.node-gyp/16.8.0/deps/openssl/config -I/opt/buildhome/.node-gyp/16.8.0/deps/openssl/openssl/include -I/opt/buildhome/.node-gyp/16.8.0/deps/uv/include -I/opt/buildhome/.node-gyp/16.8.0/deps/zlib -I/opt/buildhome/.node-gyp/16.8.0/deps/v8/include -I../src/libsass/include -fPIC -pthread -Wall -Wextra -Wno-unused-parameter -m64 -O3 -fno-omit-frame-pointer -std=gnu++14 -std=c++0x -fexceptions -frtti -MMD -MF ./Release/.deps/Release/obj.target/libsass/src/libsass/src/sass_values.o.d.raw -c -o Release/obj.target/libsass/src/libsass/src/sass_values.o ../src/libsass/src/sass_values.cpp
  113. 10:24:44 AM: npm ERR! g++ '-DNODE_GYP_MODULE_NAME=libsass' '-DUSING_UV_SHARED=1' '-DUSING_V8_SHARED=1' '-DV8_DEPRECATION_WARNINGS=1' '-DV8_DEPRECATION_WARNINGS' '-DV8_IMMINENT_DEPRECATION_WARNINGS' '-D_GLIBCXX_USE_CXX11_ABI=1' '-D_LARGEFILE_SOURCE' '-D_FILE_OFFSET_BITS=64' '-D__STDC_FORMAT_MACROS' '-DOPENSSL_NO_PINSHARED' '-DOPENSSL_THREADS' '-DLIBSASS_VERSION="3.5.5"' -I/opt/buildhome/.node-gyp/16.8.0/include/node -I/opt/buildhome/.node-gyp/16.8.0/src -I/opt/buildhome/.node-gyp/16.8.0/deps/openssl/config -I/opt/buildhome/.node-gyp/16.8.0/deps/openssl/openssl/include -I/opt/buildhome/.node-gyp/16.8.0/deps/uv/include -I/opt/buildhome/.node-gyp/16.8.0/deps/zlib -I/opt/buildhome/.node-gyp/16.8.0/deps/v8/include -I../src/libsass/include -fPIC -pthread -Wall -Wextra -Wno-unused-parameter -m64 -O3 -fno-omit-frame-pointer -std=gnu++14 -std=c++0x -fexceptions -frtti -MMD -MF ./Release/.deps/Release/obj.target/libsass/src/libsass/src/source_map.o.d.raw -c -o Release/obj.target/libsass/src/libsass/src/source_map.o ../src/libsass/src/source_map.cpp
  114. 10:24:44 AM: Creating deploy upload records
  115. 10:24:44 AM: npm ERR! g++ '-DNODE_GYP_MODULE_NAME=libsass' '-DUSING_UV_SHARED=1' '-DUSING_V8_SHARED=1' '-DV8_DEPRECATION_WARNINGS=1' '-DV8_DEPRECATION_WARNINGS' '-DV8_IMMINENT_DEPRECATION_WARNINGS' '-D_GLIBCXX_USE_CXX11_ABI=1' '-D_LARGEFILE_SOURCE' '-D_FILE_OFFSET_BITS=64' '-D__STDC_FORMAT_MACROS' '-DOPENSSL_NO_PINSHARED' '-DOPENSSL_THREADS' '-DLIBSASS_VERSION="3.5.5"' -I/opt/buildhome/.node-gyp/16.8.0/include/node -I/opt/buildhome/.node-gyp/16.8.0/src -I/opt/buildhome/.node-gyp/16.8.0/deps/openssl/config -I/opt/buildhome/.node-gyp/16.8.0/deps/openssl/openssl/include -I/opt/buildhome/.node-gyp/16.8.0/deps/uv/include -I/opt/buildhome/.node-gyp/16.8.0/deps/zlib -I/opt/buildhome/.node-gyp/16.8.0/deps/v8/include -I../src/libsass/include -fPIC -pthread -Wall -Wextra -Wno-unused-parameter -m64 -O3 -fno-omit-frame-pointer -std=gnu++14 -std=c++0x -fexceptions -frtti -MMD -MF ./Release/.deps/Release/obj.target/libsass/src/libsass/src/subset_map.o.d.raw -c -o Release/obj.target/libsass/src/libsass/src/subset_map.o ../src/libsass/src/subset_map.cpp
  116. 10:24:44 AM: npm ERR! g++ '-DNODE_GYP_MODULE_NAME=libsass' '-DUSING_UV_SHARED=1' '-DUSING_V8_SHARED=1' '-DV8_DEPRECATION_WARNINGS=1' '-DV8_DEPRECATION_WARNINGS' '-DV8_IMMINENT_DEPRECATION_WARNINGS' '-D_GLIBCXX_USE_CXX11_ABI=1' '-D_LARGEFILE_SOURCE' '-D_FILE_OFFSET_BITS=64' '-D__STDC_FORMAT_MACROS' '-DOPENSSL_NO_PINSHARED' '-DOPENSSL_THREADS' '-DLIBSASS_VERSION="3.5.5"' -I/opt/buildhome/.node-gyp/16.8.0/include/node -I/opt/buildhome/.node-gyp/16.8.0/src -I/opt/buildhome/.node-gyp/16.8.0/deps/openssl/config -I/opt/buildhome/.node-gyp/16.8.0/deps/openssl/openssl/include -I/opt/buildhome/.node-gyp/16.8.0/deps/uv/include -I/opt/buildhome/.node-gyp/16.8.0/deps/zlib -I/opt/buildhome/.node-gyp/16.8.0/deps/v8/include -I../src/libsass/include -fPIC -pthread -Wall -Wextra -Wno-unused-parameter -m64 -O3 -fno-omit-frame-pointer -std=gnu++14 -std=c++0x -fexceptions -frtti -MMD -MF ./Release/.deps/Release/obj.target/libsass/src/libsass/src/to_c.o.d.raw -c -o Release/obj.target/libsass/src/libsass/src/to_c.o ../src/libsass/src/to_c.cpp
  117. 10:24:44 AM: npm ERR! g++ '-DNODE_GYP_MODULE_NAME=libsass' '-DUSING_UV_SHARED=1' '-DUSING_V8_SHARED=1' '-DV8_DEPRECATION_WARNINGS=1' '-DV8_DEPRECATION_WARNINGS' '-DV8_IMMINENT_DEPRECATION_WARNINGS' '-D_GLIBCXX_USE_CXX11_ABI=1' '-D_LARGEFILE_SOURCE' '-D_FILE_OFFSET_BITS=64' '-D__STDC_FORMAT_MACROS' '-DOPENSSL_NO_PINSHARED' '-DOPENSSL_THREADS' '-DLIBSASS_VERSION="3.5.5"' -I/opt/buildhome/.node-gyp/16.8.0/include/node -I/opt/buildhome/.node-gyp/16.8.0/src -I/opt/buildhome/.node-gyp/16.8.0/deps/openssl/config -I/opt/buildhome/.node-gyp/16.8.0/deps/openssl/openssl/include -I/opt/buildhome/.node-gyp/16.8.0/deps/uv/include -I/opt/buildhome/.node-gyp/16.8.0/deps/zlib -I/opt/buildhome/.node-gyp/16.8.0/deps/v8/include -I../src/libsass/include -fPIC -pthread -Wall -Wextra -Wno-unused-parameter -m64 -O3 -fno-omit-frame-pointer -std=gnu++14 -std=c++0x -fexceptions -frtti -MMD -MF ./Release/.deps/Release/obj.target/libsass/src/libsass/src/to_value.o.d.raw -c -o Release/obj.target/libsass/src/libsass/src/to_value.o ../src/libsass/src/to_value.cpp
  118. 10:24:44 AM: npm ERR! g++ '-DNODE_GYP_MODULE_NAME=libsass' '-DUSING_UV_SHARED=1' '-DUSING_V8_SHARED=1' '-DV8_DEPRECATION_WARNINGS=1' '-DV8_DEPRECATION_WARNINGS' '-DV8_IMMINENT_DEPRECATION_WARNINGS' '-D_GLIBCXX_USE_CXX11_ABI=1' '-D_LARGEFILE_SOURCE' '-D_FILE_OFFSET_BITS=64' '-D__STDC_FORMAT_MACROS' '-DOPENSSL_NO_PINSHARED' '-DOPENSSL_THREADS' '-DLIBSASS_VERSION="3.5.5"' -I/opt/buildhome/.node-gyp/16.8.0/include/node -I/opt/buildhome/.node-gyp/16.8.0/src -I/opt/buildhome/.node-gyp/16.8.0/deps/openssl/config -I/opt/buildhome/.node-gyp/16.8.0/deps/openssl/openssl/include -I/opt/buildhome/.node-gyp/16.8.0/deps/uv/include -I/opt/buildhome/.node-gyp/16.8.0/deps/zlib -I/opt/buildhome/.node-gyp/16.8.0/deps/v8/include -I../src/libsass/include -fPIC -pthread -Wall -Wextra -Wno-unused-parameter -m64 -O3 -fno-omit-frame-pointer -std=gnu++14 -std=c++0x -fexceptions -frtti -MMD -MF ./Release/.deps/Release/obj.target/libsass/src/libsass/src/units.o.d.raw -c -o Release/obj.target/libsass/src/libsass/src/units.o ../src/libsass/src/units.cpp
  119. 10:24:44 AM: npm ERR! g++ '-DNODE_GYP_MODULE_NAME=libsass' '-DUSING_UV_SHARED=1' '-DUSING_V8_SHARED=1' '-DV8_DEPRECATION_WARNINGS=1' '-DV8_DEPRECATION_WARNINGS' '-DV8_IMMINENT_DEPRECATION_WARNINGS' '-D_GLIBCXX_USE_CXX11_ABI=1' '-D_LARGEFILE_SOURCE' '-D_FILE_OFFSET_BITS=64' '-D__STDC_FORMAT_MACROS' '-DOPENSSL_NO_PINSHARED' '-DOPENSSL_THREADS' '-DLIBSASS_VERSION="3.5.5"' -I/opt/buildhome/.node-gyp/16.8.0/include/node -I/opt/buildhome/.node-gyp/16.8.0/src -I/opt/buildhome/.node-gyp/16.8.0/deps/openssl/config -I/opt/buildhome/.node-gyp/16.8.0/deps/openssl/openssl/include -I/opt/buildhome/.node-gyp/16.8.0/deps/uv/include -I/opt/buildhome/.node-gyp/16.8.0/deps/zlib -I/opt/buildhome/.node-gyp/16.8.0/deps/v8/include -I../src/libsass/include -fPIC -pthread -Wall -Wextra -Wno-unused-parameter -m64 -O3 -fno-omit-frame-pointer -std=gnu++14 -std=c++0x -fexceptions -frtti -MMD -MF ./Release/.deps/Release/obj.target/libsass/src/libsass/src/utf8_string.o.d.raw -c -o Release/obj.target/libsass/src/libsass/src/utf8_string.o ../src/libsass/src/utf8_string.cpp
  120. 10:24:44 AM: npm ERR! g++ '-DNODE_GYP_MODULE_NAME=libsass' '-DUSING_UV_SHARED=1' '-DUSING_V8_SHARED=1' '-DV8_DEPRECATION_WARNINGS=1' '-DV8_DEPRECATION_WARNINGS' '-DV8_IMMINENT_DEPRECATION_WARNINGS' '-D_GLIBCXX_USE_CXX11_ABI=1' '-D_LARGEFILE_SOURCE' '-D_FILE_OFFSET_BITS=64' '-D__STDC_FORMAT_MACROS' '-DOPENSSL_NO_PINSHARED' '-DOPENSSL_THREADS' '-DLIBSASS_VERSION="3.5.5"' -I/opt/buildhome/.node-gyp/16.8.0/include/node -I/opt/buildhome/.node-gyp/16.8.0/src -I/opt/buildhome/.node-gyp/16.8.0/deps/openssl/config -I/opt/buildhome/.node-gyp/16.8.0/deps/openssl/openssl/include -I/opt/buildhome/.node-gyp/16.8.0/deps/uv/include -I/opt/buildhome/.node-gyp/16.8.0/deps/zlib -I/opt/buildhome/.node-gyp/16.8.0/deps/v8/include -I../src/libsass/include -fPIC -pthread -Wall -Wextra -Wno-unused-parameter -m64 -O3 -fno-omit-frame-pointer -std=gnu++14 -std=c++0x -fexceptions -frtti -MMD -MF ./Release/.deps/Release/obj.target/libsass/src/libsass/src/util.o.d.raw -c -o Release/obj.target/libsass/src/libsass/src/util.o ../src/libsass/src/util.cpp
  121. 10:24:44 AM: npm ERR! g++ '-DNODE_GYP_MODULE_NAME=libsass' '-DUSING_UV_SHARED=1' '-DUSING_V8_SHARED=1' '-DV8_DEPRECATION_WARNINGS=1' '-DV8_DEPRECATION_WARNINGS' '-DV8_IMMINENT_DEPRECATION_WARNINGS' '-D_GLIBCXX_USE_CXX11_ABI=1' '-D_LARGEFILE_SOURCE' '-D_FILE_OFFSET_BITS=64' '-D__STDC_FORMAT_MACROS' '-DOPENSSL_NO_PINSHARED' '-DOPENSSL_THREADS' '-DLIBSASS_VERSION="3.5.5"' -I/opt/buildhome/.node-gyp/16.8.0/include/node -I/opt/buildhome/.node-gyp/16.8.0/src -I/opt/buildhome/.node-gyp/16.8.0/deps/openssl/config -I/opt/buildhome/.node-gyp/16.8.0/deps/openssl/openssl/include -I/opt/buildhome/.node-gyp/16.8.0/deps/uv/include -I/opt/buildhome/.node-gyp/16.8.0/deps/zlib -I/opt/buildhome/.node-gyp/16.8.0/deps/v8/include -I../src/libsass/include -fPIC -pthread -Wall -Wextra -Wno-unused-parameter -m64 -O3 -fno-omit-frame-pointer -std=gnu++14 -std=c++0x -fexceptions -frtti -MMD -MF ./Release/.deps/Release/obj.target/libsass/src/libsass/src/values.o.d.raw -c -o Release/obj.target/libsass/src/libsass/src/values.o ../src/libsass/src/values.cpp
  122. 10:24:44 AM: npm ERR! rm -f Release/obj.target/src/sass.a && ar crs Release/obj.target/src/sass.a Release/obj.target/libsass/src/libsass/src/ast.o Release/obj.target/libsass/src/libsass/src/ast_fwd_decl.o Release/obj.target/libsass/src/libsass/src/backtrace.o Release/obj.target/libsass/src/libsass/src/base64vlq.o Release/obj.target/libsass/src/libsass/src/bind.o Release/obj.target/libsass/src/libsass/src/cencode.o Release/obj.target/libsass/src/libsass/src/check_nesting.o Release/obj.target/libsass/src/libsass/src/color_maps.o Release/obj.target/libsass/src/libsass/src/constants.o Release/obj.target/libsass/src/libsass/src/context.o Release/obj.target/libsass/src/libsass/src/cssize.o Release/obj.target/libsass/src/libsass/src/emitter.o Release/obj.target/libsass/src/libsass/src/environment.o Release/obj.target/libsass/src/libsass/src/error_handling.o Release/obj.target/libsass/src/libsass/src/eval.o Release/obj.target/libsass/src/libsass/src/expand.o Release/obj.target/libsass/src/libsass/src/extend.o Release/obj.target/libsass/src/libsass/src/file.o Release/obj.target/libsass/src/libsass/src/functions.o Release/obj.target/libsass/src/libsass/src/inspect.o Release/obj.target/libsass/src/libsass/src/json.o Release/obj.target/libsass/src/libsass/src/lexer.o Release/obj.target/libsass/src/libsass/src/listize.o Release/obj.target/libsass/src/libsass/src/memory/SharedPtr.o Release/obj.target/libsass/src/libsass/src/node.o Release/obj.target/libsass/src/libsass/src/operators.o Release/obj.target/libsass/src/libsass/src/output.o Release/obj.target/libsass/src/libsass/src/parser.o Release/obj.target/libsass/src/libsass/src/plugins.o Release/obj.target/libsass/src/libsass/src/position.o Release/obj.target/libsass/src/libsass/src/prelexer.o Release/obj.target/libsass/src/libsass/src/remove_placeholders.o Release/obj.target/libsass/src/libsass/src/sass.o Release/obj.target/libsass/src/libsass/src/sass2scss.o Release/obj.target/libsass/src/libsass/src/sass_context.o Release/obj.target/libsass/src/libsass/src/sass_functions.o Release/obj.target/libsass/src/libsass/src/sass_util.o Release/obj.target/libsass/src/libsass/src/sass_values.o Release/obj.target/libsass/src/libsass/src/source_map.o Release/obj.target/libsass/src/libsass/src/subset_map.o Release/obj.target/libsass/src/libsass/src/to_c.o Release/obj.target/libsass/src/libsass/src/to_value.o Release/obj.target/libsass/src/libsass/src/units.o Release/obj.target/libsass/src/libsass/src/utf8_string.o Release/obj.target/libsass/src/libsass/src/util.o Release/obj.target/libsass/src/libsass/src/values.o
  123. 10:24:44 AM: npm ERR! rm -rf "Release/sass.a" && cp -af "Release/obj.target/src/sass.a" "Release/sass.a"
  124. 10:24:44 AM: npm ERR! g++ '-DNODE_GYP_MODULE_NAME=binding' '-DUSING_UV_SHARED=1' '-DUSING_V8_SHARED=1' '-DV8_DEPRECATION_WARNINGS=1' '-DV8_DEPRECATION_WARNINGS' '-DV8_IMMINENT_DEPRECATION_WARNINGS' '-D_GLIBCXX_USE_CXX11_ABI=1' '-D_LARGEFILE_SOURCE' '-D_FILE_OFFSET_BITS=64' '-D__STDC_FORMAT_MACROS' '-DOPENSSL_NO_PINSHARED' '-DOPENSSL_THREADS' '-DBUILDING_NODE_EXTENSION' -I/opt/buildhome/.node-gyp/16.8.0/include/node -I/opt/buildhome/.node-gyp/16.8.0/src -I/opt/buildhome/.node-gyp/16.8.0/deps/openssl/config -I/opt/buildhome/.node-gyp/16.8.0/deps/openssl/openssl/include -I/opt/buildhome/.node-gyp/16.8.0/deps/uv/include -I/opt/buildhome/.node-gyp/16.8.0/deps/zlib -I/opt/buildhome/.node-gyp/16.8.0/deps/v8/include -I../../nan -I../src/libsass/include -fPIC -pthread -Wall -Wextra -Wno-unused-parameter -m64 -O3 -fno-omit-frame-pointer -fno-rtti -fno-exceptions -std=gnu++14 -std=c++0x -MMD -MF ./Release/.deps/Release/obj.target/binding/src/binding.o.d.raw -c -o Release/obj.target/binding/src/binding.o ../src/binding.cpp
  125. 10:24:44 AM: npm ERR! make: Leaving directory '/opt/build/repo/node_modules/node-sass/build'
  126. 10:24:44 AM: npm ERR! gyp info it worked if it ends with ok
  127. 10:24:44 AM: npm ERR! gyp verb cli [
  128. 10:24:44 AM: npm ERR! gyp verb cli '/opt/buildhome/.nvm/versions/node/v16.8.0/bin/node',
  129. 10:24:44 AM: npm ERR! gyp verb cli '/opt/build/repo/node_modules/node-gyp/bin/node-gyp.js',
  130. 10:24:44 AM: npm ERR! gyp verb cli 'rebuild',
  131. 10:24:44 AM: npm ERR! gyp verb cli '--verbose',
  132. 10:24:44 AM: npm ERR! gyp verb cli '--libsass_ext=',
  133. 10:24:44 AM: npm ERR! gyp verb cli '--libsass_cflags=',
  134. 10:24:44 AM: npm ERR! gyp verb cli '--libsass_ldflags=',
  135. 10:24:44 AM: npm ERR! gyp verb cli '--libsass_library='
  136. 10:24:44 AM: npm ERR! gyp verb cli ]
  137. 10:24:44 AM: npm ERR! gyp info using node-gyp@3.8.0
  138. 10:24:44 AM: npm ERR! gyp info using node@16.8.0 | linux | x64
  139. 10:24:44 AM: npm ERR! gyp verb command rebuild []
  140. 10:24:44 AM: npm ERR! gyp verb command clean []
  141. 10:24:44 AM: npm ERR! gyp verb clean removing "build" directory
  142. 10:24:44 AM: npm ERR! gyp verb command configure []
  143. 10:24:44 AM: npm ERR! gyp verb check python checking for Python executable "python2" in the PATH
  144. 10:24:44 AM: Failed during stage 'building site': Build script returned non-zero exit code: 1
  145. 10:24:44 AM: npm ERR! gyp verb `which` succeeded python2 /opt/buildhome/python2.7/bin/python2
  146. 10:24:44 AM: npm ERR! gyp verb check python version `/opt/buildhome/python2.7/bin/python2 -c "import sys; print "2.7.18npm ERR! gyp verb check python version .%s.%s" % sys.version_info[:3];"` returned: %j
  147. 10:24:44 AM: npm ERR! gyp verb get node dir no --target version specified, falling back to host node version: 16.8.0
  148. 10:24:44 AM: npm ERR! gyp verb command install [ '16.8.0' ]
  149. 10:24:44 AM: npm ERR! gyp verb install input version string "16.8.0"
  150. 10:24:44 AM: npm ERR! gyp verb install installing version: 16.8.0
  151. 10:24:44 AM: npm ERR! gyp verb install --ensure was passed, so won't reinstall if already installednpm ERR! gyp verb install version not already installed, continuing with install 16.8.0
  152. 10:24:44 AM: npm ERR! gyp verb ensuring nodedir is created /opt/buildhome/.node-gyp/16.8.0
  153. 10:24:44 AM: npm ERR! gyp verb created nodedir /opt/buildhome/.node-gyp
  154. 10:24:44 AM: npm ERR! gyp http GET https://nodejs.org/download/release/v16.8.0/node-v16.8.0-headers.tar.gz
  155. 10:24:44 AM: npm ERR! gyp http 200 https://nodejs.org/download/release/v16.8.0/node-v16.8.0-headers.tar.gz
  156. 10:24:44 AM: npm ERR! gyp verb extracted file from tarball include/node/common.gypi
  157. 10:24:44 AM: npm ERR! gyp verb extracted file from tarball include/node/config.gypi
  158. 10:24:44 AM: npm ERR! gyp verb extracted file from tarball include/node/node.h
  159. 10:24:44 AM: npm ERR! gyp verb extracted file from tarball include/node/node_api.h
  160. 10:24:44 AM: npm ERR! gyp verb extracted file from tarball include/node/js_native_api.h
  161. 10:24:44 AM: npm ERR! gyp verb extracted file from tarball include/node/js_native_api_types.h
  162. 10:24:44 AM: npm ERR! gyp verb extracted file from tarball include/node/node_api_types.h
  163. 10:24:44 AM: npm ERR! gyp verb extracted file from tarball include/node/node_buffer.h
  164. 10:24:44 AM: npm ERR! gyp verb extracted file from tarball include/node/node_object_wrap.h
  165. 10:24:44 AM: npm ERR! gyp verb extracted file from tarball include/node/node_version.h
  166. 10:24:44 AM: npm ERR! gyp verb extracted file from tarball include/node/v8-profiler.h
  167. 10:24:44 AM: npm ERR! gyp verb extracted file from tarball include/node/v8-version.h
  168. 10:24:44 AM: npm ERR! gyp verb extracted file from tarball include/node/v8.h
  169. 10:24:44 AM: npm ERR! gyp verb extracted file from tarball include/node/v8config.h
  170. 10:24:44 AM: npm ERR! gyp verb extracted file from tarball include/node/v8-platform.h
  171. 10:24:44 AM: npm ERR! gyp verb extracted file from tarball include/node/v8-internal.h
  172. 10:24:44 AM: npm ERR! gyp verb extracted file from tarball include/node/libplatform/libplatform-export.h
  173. 10:24:44 AM: npm ERR! gyp verb extracted file from tarball include/node/libplatform/libplatform.h
  174. 10:24:44 AM: npm ERR! gyp verb extracted file from tarball include/node/libplatform/v8-tracing.h
  175. 10:24:44 AM: npm ERR! gyp verb extracted file from tarball include/node/cppgc/common.h
  176. 10:24:44 AM: npm ERR! gyp verb extracted file from tarball include/node/uv.h
  177. 10:24:44 AM: npm ERR! gyp verb extracted file from tarball include/node/uv/aix.h
  178. 10:24:44 AM: npm ERR! gyp verb extracted file from tarball include/node/uv/android-ifaddrs.h
  179. 10:24:44 AM: npm ERR! gyp verb extracted file from tarball include/node/uv/bsd.h
  180. 10:24:44 AM: npm ERR! gyp verb extracted file from tarball include/node/uv/darwin.h
  181. 10:24:44 AM: npm ERR! gyp verb extracted file from tarball include/node/uv/linux.h
  182. 10:24:44 AM: npm ERR! gyp verb extracted file from tarball include/node/uv/os390.h
  183. 10:24:44 AM: npm ERR! gyp verb extracted file from tarball include/node/uv/posix.h
  184. 10:24:44 AM: npm ERR! gyp verb extracted file from tarball include/node/uv/stdint-msvc2008.h
  185. 10:24:44 AM: npm ERR! gyp verb extracted file from tarball include/node/uv/sunos.h
  186. 10:24:44 AM: npm ERR! gyp verb extracted file from tarball include/node/uv/threadpool.h
  187. 10:24:44 AM: npm ERR! gyp verb extracted file from tarball include/node/uv/unix.h
  188. 10:24:44 AM: npm ERR! gyp verb extracted file from tarball include/node/uv/win.h
  189. 10:24:44 AM: npm ERR! gyp verb extracted file from tarball include/node/uv/errno.h
  190. 10:24:44 AM: npm ERR! gyp verb extracted file from tarball include/node/uv/tree.h
  191. 10:24:44 AM: npm ERR! gyp verb extracted file from tarball include/node/uv/version.h
  192. 10:24:44 AM: npm ERR! gyp verb extracted file from tarball include/node/openssl/aes.h
  193. 10:24:44 AM: npm ERR! gyp verb extracted file from tarball include/node/openssl/asn1.h
  194. 10:24:44 AM: npm ERR! gyp verb extracted file from tarball include/node/openssl/asn1_mac.h
  195. 10:24:44 AM: npm ERR! gyp verb extracted file from tarball include/node/openssl/asn1t.h
  196. 10:24:44 AM: npm ERR! gyp verb extracted file from tarball include/node/openssl/async.h
  197. 10:24:44 AM: npm ERR! gyp verb extracted file from tarball include/node/openssl/asyncerr.h
  198. 10:24:44 AM: npm ERR! gyp verb extracted file from tarball include/node/openssl/bio.h
  199. 10:24:44 AM: npm ERR! gyp verb extracted file from tarball include/node/openssl/bioerr.h
  200. 10:24:44 AM: npm ERR! gyp verb extracted file from tarball include/node/openssl/blowfish.h
  201. 10:24:44 AM: npm ERR! gyp verb extracted file from tarball include/node/openssl/bnerr.h
  202. 10:24:44 AM: npm ERR! gyp verb extracted file from tarball include/node/openssl/buffer.h
  203. 10:24:44 AM: npm ERR! gyp verb extracted file from tarball include/node/openssl/buffererr.h
  204. 10:24:44 AM: npm ERR! gyp verb extracted file from tarball include/node/openssl/camellia.h
  205. 10:24:44 AM: npm ERR! gyp verb extracted file from tarball include/node/openssl/cast.h
  206. 10:24:44 AM: npm ERR! gyp verb extracted file from tarball include/node/openssl/cmac.h
  207. 10:24:44 AM: npm ERR! gyp verb extracted file from tarball include/node/openssl/cms.h
  208. 10:24:44 AM: npm ERR! gyp verb extracted file from tarball include/node/openssl/cmserr.h
  209. 10:24:44 AM: npm ERR! gyp verb extracted file from tarball include/node/openssl/comp.h
  210. 10:24:44 AM: npm ERR! gyp verb extracted file from tarball include/node/openssl/comperr.h
  211. 10:24:44 AM: npm ERR! gyp verb extracted file from tarball include/node/openssl/conf.h
  212. 10:24:44 AM: npm ERR! gyp verb extracted file from tarball include/node/openssl/conf_api.h
  213. 10:24:44 AM: npm ERR! gyp verb extracted file from tarball include/node/openssl/conferr.h
  214. 10:24:44 AM: npm ERR! gyp verb extracted file from tarball include/node/openssl/cryptoerr.h
  215. 10:24:44 AM: npm ERR! gyp verb extracted file from tarball include/node/openssl/ct.h
  216. 10:24:44 AM: npm ERR! gyp verb extracted file from tarball include/node/openssl/cterr.h
  217. 10:24:44 AM: npm ERR! gyp verb extracted file from tarball include/node/openssl/des.h
  218. 10:24:44 AM: npm ERR! gyp verb extracted file from tarball include/node/openssl/dh.h
  219. 10:24:44 AM: npm ERR! gyp verb extracted file from tarball include/node/openssl/dherr.h
  220. 10:24:44 AM: npm ERR! gyp verb extracted file from tarball include/node/openssl/dsa.h
  221. 10:24:44 AM: npm ERR! gyp verb extracted file from tarball include/node/openssl/dsaerr.h
  222. 10:24:44 AM: npm ERR! gyp verb extracted file from tarball include/node/openssl/dtls1.h
  223. 10:24:44 AM: npm ERR! gyp verb extracted file from tarball include/node/openssl/ebcdic.h
  224. 10:24:44 AM: npm ERR! gyp verb extracted file from tarball include/node/openssl/ecdh.h
  225. 10:24:44 AM: npm ERR! gyp verb extracted file from tarball include/node/openssl/ecdsa.h
  226. 10:24:44 AM: npm ERR! gyp verb extracted file from tarball include/node/openssl/engine.h
  227. 10:24:44 AM: npm ERR! gyp verb extracted file from tarball include/node/openssl/engineerr.h
  228. 10:24:44 AM: npm ERR! gyp verb extracted file from tarball include/node/openssl/err.h
  229. 10:24:44 AM: npm ERR! gyp verb extracted file from tarball include/node/openssl/sslerr.h
  230. 10:24:44 AM: npm ERR! gyp verb extracted file from tarball include/node/openssl/hmac.h
  231. 10:24:44 AM: npm ERR! gyp verb extracted file from tarball include/node/openssl/idea.h
  232. 10:24:44 AM: npm ERR! gyp verb extracted file from tarball include/node/openssl/kdf.h
  233. 10:24:44 AM: npm ERR! gyp verb extracted file from tarball include/node/openssl/kdferr.h
  234. 10:24:44 AM: npm ERR! gyp verb extracted file from tarball include/node/openssl/lhash.h
  235. 10:24:44 AM: npm ERR! gyp verb extracted file from tarball include/node/openssl/md2.h
  236. 10:24:44 AM: npm ERR! gyp verb extracted file from tarball include/node/openssl/md4.h
  237. 10:24:44 AM: npm ERR! gyp verb extracted file from tarball include/node/openssl/md5.h
  238. 10:24:44 AM: npm ERR! gyp verb extracted file from tarball include/node/openssl/mdc2.h
  239. 10:24:44 AM: npm ERR! gyp verb extracted file from tarball include/node/openssl/modes.h
  240. 10:24:44 AM: npm ERR! gyp verb extracted file from tarball include/node/openssl/objects.h
  241. 10:24:44 AM: npm ERR! gyp verb extracted file from tarball include/node/openssl/objectserr.h
  242. 10:24:44 AM: npm ERR! gyp verb extracted file from tarball include/node/openssl/ocsp.h
  243. 10:24:44 AM: npm ERR! gyp verb extracted file from tarball include/node/openssl/ocsperr.h
  244. 10:24:44 AM: npm ERR! gyp verb extracted file from tarball include/node/openssl/x509err.h
  245. 10:24:44 AM: npm ERR! gyp verb extracted file from tarball include/node/openssl/crypto.h
  246. 10:24:44 AM: npm ERR! gyp verb extracted file from tarball include/node/openssl/pem.h
  247. 10:24:44 AM: npm ERR! gyp verb extracted file from tarball include/node/openssl/pem2.h
  248. 10:24:44 AM: npm ERR! gyp verb extracted file from tarball include/node/openssl/pkcs12.h
  249. 10:24:44 AM: npm ERR! gyp verb extracted file from tarball include/node/openssl/pkcs12err.h
  250. 10:24:44 AM: npm ERR! gyp verb extracted file from tarball include/node/openssl/pkcs7.h
  251. 10:24:44 AM: npm ERR! gyp verb extracted file from tarball include/node/openssl/pkcs7err.h
  252. 10:24:44 AM: npm ERR! gyp verb extracted file from tarball include/node/openssl/rand.h
  253. 10:24:44 AM: npm ERR! gyp verb extracted file from tarball include/node/openssl/rand_drbg.h
  254. 10:24:44 AM: npm ERR! gyp verb extracted file from tarball include/node/openssl/randerr.h
  255. 10:24:44 AM: npm ERR! gyp verb extracted file from tarball include/node/openssl/rc2.h
  256. 10:24:44 AM: npm ERR! gyp verb extracted file from tarball include/node/openssl/rc4.h
  257. 10:24:44 AM: npm ERR! gyp verb extracted file from tarball include/node/openssl/rc5.h
  258. 10:24:44 AM: npm ERR! gyp verb extracted file from tarball include/node/openssl/ripemd.h
  259. 10:24:44 AM: npm ERR! gyp verb extracted file from tarball include/node/openssl/rsa.h
  260. 10:24:44 AM: npm ERR! gyp verb extracted file from tarball include/node/openssl/rsaerr.h
  261. 10:24:44 AM: npm ERR! gyp verb extracted file from tarball include/node/openssl/safestack.h
  262. 10:24:44 AM: npm ERR! gyp verb extracted file from tarball include/node/openssl/seed.h
  263. 10:24:44 AM: npm ERR! gyp verb extracted file from tarball include/node/openssl/sha.h
  264. 10:24:44 AM: npm ERR! gyp verb extracted file from tarball include/node/openssl/srp.h
  265. 10:24:44 AM: npm ERR! gyp verb extracted file from tarball include/node/openssl/srtp.h
  266. 10:24:44 AM: npm ERR! gyp verb extracted file from tarball include/node/openssl/ssl2.h
  267. 10:24:44 AM: npm ERR! gyp verb extracted file from tarball include/node/openssl/evperr.h
  268. 10:24:44 AM: npm ERR! gyp verb extracted file from tarball include/node/openssl/stack.h
  269. 10:24:44 AM: npm ERR! gyp verb extracted file from tarball include/node/openssl/store.h
  270. 10:24:44 AM: npm ERR! gyp verb extracted file from tarball include/node/openssl/storeerr.h
  271. 10:24:44 AM: npm ERR! gyp verb extracted file from tarball include/node/openssl/symhacks.h
  272. 10:24:44 AM: npm ERR! gyp verb extracted file from tarball include/node/openssl/ts.h
  273. 10:24:44 AM: npm ERR! gyp verb extracted file from tarball include/node/openssl/tserr.h
  274. 10:24:44 AM: npm ERR! gyp verb extracted file from tarball include/node/openssl/txt_db.h
  275. 10:24:44 AM: npm ERR! gyp verb extracted file from tarball include/node/openssl/ui.h
  276. 10:24:44 AM: npm ERR! gyp verb extracted file from tarball include/node/openssl/uierr.h
  277. 10:24:44 AM: npm ERR! gyp verb extracted file from tarball include/node/openssl/whrlpool.h
  278. 10:24:44 AM: npm ERR! gyp verb extracted file from tarball include/node/openssl/ec.h
  279. 10:24:44 AM: npm ERR! gyp verb extracted file from tarball include/node/openssl/x509v3.h
  280. 10:24:44 AM: npm ERR! gyp verb extracted file from tarball include/node/openssl/x509v3err.h
  281. 10:24:44 AM: npm ERR! gyp verb extracted file from tarball include/node/openssl/ossl_typ.h
  282. 10:24:44 AM: npm ERR! gyp verb extracted file from tarball include/node/openssl/tls1.h
  283. 10:24:44 AM: npm ERR! gyp verb extracted file from tarball include/node/openssl/pemerr.h
  284. 10:24:44 AM: npm ERR! gyp verb extracted file from tarball include/node/openssl/ssl3.h
  285. 10:24:44 AM: npm ERR! gyp verb extracted file from tarball include/node/openssl/ssl.h
  286. 10:24:44 AM: npm ERR! gyp verb extracted file from tarball include/node/openssl/evp.h
  287. 10:24:44 AM: npm ERR! gyp verb extracted file from tarball include/node/openssl/ecerr.h
  288. 10:24:44 AM: npm ERR! gyp verb extracted file from tarball include/node/openssl/opensslv.h
  289. 10:24:44 AM: npm ERR! gyp verb extracted file from tarball include/node/openssl/x509.h
  290. 10:24:44 AM: npm ERR! gyp verb extracted file from tarball include/node/openssl/x509_vfy.h
  291. 10:24:44 AM: npm ERR! gyp verb extracted file from tarball include/node/openssl/asn1err.h
  292. 10:24:44 AM: npm ERR! gyp verb extracted file from tarball include/node/openssl/bn.h
  293. 10:24:44 AM: npm ERR! gyp verb extracted file from tarball include/node/openssl/e_os2.h
  294. 10:24:44 AM: npm ERR! gyp verb extracted file from tarball include/node/openssl/obj_mac.h
  295. 10:24:44 AM: npm ERR! gyp verb extracted file from tarball include/node/openssl/archs/BSD-x86_64/asm/crypto/include/internal/bn_conf.h
  296. 10:24:44 AM: npm ERR! gyp verb extracted file from tarball include/node/openssl/archs/BSD-x86_64/asm/crypto/include/internal/dso_conf.h
  297. 10:24:44 AM: npm ERR! gyp verb extracted file from tarball include/node/openssl/archs/BSD-x86_64/asm/crypto/buildinf.h
  298. 10:24:44 AM: npm ERR! gyp verb extracted file from tarball include/node/openssl/archs/BSD-x86_64/asm/include/openssl/opensslconf.h
  299. 10:24:44 AM: npm ERR! gyp verb extracted file from tarball include/node/openssl/archs/BSD-x86_64/asm/include/progs.h
  300. 10:24:44 AM: npm ERR! gyp verb extracted file from tarball include/node/openssl/archs/BSD-x86_64/asm_avx2/crypto/include/internal/bn_conf.h
  301. 10:24:44 AM: npm ERR! gyp verb extracted file from tarball include/node/openssl/archs/BSD-x86_64/asm_avx2/crypto/include/internal/dso_conf.h
  302. 10:24:44 AM: npm ERR! gyp verb extracted file from tarball include/node/openssl/archs/BSD-x86_64/asm_avx2/crypto/buildinf.h
  303. 10:24:44 AM: npm ERR! gyp verb extracted file from tarball include/node/openssl/archs/BSD-x86_64/asm_avx2/include/openssl/opensslconf.h
  304. 10:24:44 AM: npm ERR! gyp verb extracted file from tarball include/node/openssl/archs/BSD-x86_64/asm_avx2/include/progs.h
  305. 10:24:44 AM: npm ERR! gyp verb extracted file from tarball include/node/openssl/archs/BSD-x86_64/no-asm/crypto/include/internal/bn_conf.h
  306. 10:24:44 AM: npm ERR! gyp verb extracted file from tarball include/node/openssl/archs/BSD-x86_64/no-asm/crypto/include/internal/dso_conf.h
  307. 10:24:44 AM: npm ERR! gyp verb extracted file from tarball include/node/openssl/archs/BSD-x86_64/no-asm/crypto/buildinf.h
  308. 10:24:44 AM: npm ERR! gyp verb extracted file from tarball include/node/openssl/archs/BSD-x86_64/no-asm/include/openssl/opensslconf.h
  309. 10:24:44 AM: npm ERR! gyp verb extracted file from tarball include/node/openssl/archs/BSD-x86_64/no-asm/include/progs.h
  310. 10:24:44 AM: npm ERR! gyp verb extracted file from tarball include/node/openssl/archs/VC-WIN32/asm/crypto/include/internal/bn_conf.h
  311. 10:24:44 AM: npm ERR! gyp verb extracted file from tarball include/node/openssl/archs/VC-WIN32/asm/crypto/include/internal/dso_conf.h
  312. 10:24:44 AM: npm ERR! gyp verb extracted file from tarball include/node/openssl/archs/VC-WIN32/asm/crypto/buildinf.h
  313. 10:24:44 AM: npm ERR! gyp verb extracted file from tarball include/node/openssl/archs/VC-WIN32/asm/include/openssl/opensslconf.h
  314. 10:24:44 AM: npm ERR! gyp verb extracted file from tarball include/node/openssl/archs/VC-WIN32/asm/include/progs.h
  315. 10:24:44 AM: npm ERR! gyp verb extracted file from tarball include/node/openssl/archs/VC-WIN32/asm_avx2/crypto/include/internal/bn_conf.h
  316. 10:24:44 AM: npm ERR! gyp verb extracted file from tarball include/node/openssl/archs/VC-WIN32/asm_avx2/crypto/include/internal/dso_conf.h
  317. 10:24:44 AM: npm ERR! gyp verb extracted file from tarball include/node/openssl/archs/VC-WIN32/asm_avx2/crypto/buildinf.h
  318. 10:24:44 AM: npm ERR! gyp verb extracted file from tarball include/node/openssl/archs/VC-WIN32/asm_avx2/include/openssl/opensslconf.h
  319. 10:24:44 AM: npm ERR! gyp verb extracted file from tarball include/node/openssl/archs/VC-WIN32/asm_avx2/include/progs.h
  320. 10:24:44 AM: npm ERR! gyp verb extracted file from tarball include/node/openssl/archs/VC-WIN32/no-asm/crypto/include/internal/bn_conf.h
  321. 10:24:44 AM: npm ERR! gyp verb extracted file from tarball include/node/openssl/archs/VC-WIN32/no-asm/crypto/include/internal/dso_conf.h
  322. 10:24:44 AM: npm ERR! gyp verb extracted file from tarball include/node/openssl/archs/VC-WIN32/no-asm/crypto/buildinf.h
  323. 10:24:44 AM: npm ERR! gyp verb extracted file from tarball include/node/openssl/archs/VC-WIN32/no-asm/include/openssl/opensslconf.h
  324. 10:24:44 AM: npm ERR! gyp verb extracted file from tarball include/node/openssl/archs/VC-WIN32/no-asm/include/progs.h
  325. 10:24:44 AM: npm ERR! gyp verb extracted file from tarball include/node/openssl/archs/VC-WIN64-ARM/no-asm/crypto/include/internal/bn_conf.h
  326. 10:24:44 AM: npm ERR! gyp verb extracted file from tarball include/node/openssl/archs/VC-WIN64-ARM/no-asm/crypto/include/internal/dso_conf.h
  327. 10:24:44 AM: npm ERR! gyp verb extracted file from tarball include/node/openssl/archs/VC-WIN64-ARM/no-asm/crypto/buildinf.h
  328. 10:24:44 AM: npm ERR! gyp verb extracted file from tarball include/node/openssl/archs/VC-WIN64-ARM/no-asm/include/openssl/opensslconf.h
  329. 10:24:44 AM: npm ERR! gyp verb extracted file from tarball include/node/openssl/archs/VC-WIN64-ARM/no-asm/include/progs.h
  330. 10:24:44 AM: npm ERR! gyp verb extracted file from tarball include/node/openssl/archs/VC-WIN64A/asm/crypto/include/internal/bn_conf.h
  331. 10:24:44 AM: npm ERR! gyp verb extracted file from tarball include/node/openssl/archs/VC-WIN64A/asm/crypto/include/internal/dso_conf.h
  332. 10:24:44 AM: npm ERR! gyp verb extracted file from tarball include/node/openssl/archs/VC-WIN64A/asm/crypto/buildinf.h
  333. 10:24:44 AM: npm ERR! gyp verb extracted file from tarball include/node/openssl/archs/VC-WIN64A/asm/include/openssl/opensslconf.h
  334. 10:24:44 AM: npm ERR! gyp verb extracted file from tarball include/node/openssl/archs/VC-WIN64A/asm/include/progs.h
  335. 10:24:44 AM: npm ERR! gyp verb extracted file from tarball include/node/openssl/archs/VC-WIN64A/asm_avx2/crypto/include/internal/bn_conf.h
  336. 10:24:44 AM: npm ERR! gyp verb extracted file from tarball include/node/openssl/archs/VC-WIN64A/asm_avx2/crypto/include/internal/dso_conf.h
  337. 10:24:44 AM: npm ERR! gyp verb extracted file from tarball include/node/openssl/archs/VC-WIN64A/asm_avx2/crypto/buildinf.h
  338. 10:24:44 AM: npm ERR! gyp verb extracted file from tarball include/node/openssl/archs/VC-WIN64A/asm_avx2/include/openssl/opensslconf.h
  339. 10:24:44 AM: npm ERR! gyp verb extracted file from tarball include/node/openssl/archs/VC-WIN64A/asm_avx2/include/progs.h
  340. 10:24:44 AM: npm ERR! gyp verb extracted file from tarball include/node/openssl/archs/VC-WIN64A/no-asm/crypto/include/internal/bn_conf.h
  341. 10:24:44 AM: npm ERR! gyp verb extracted file from tarball include/node/openssl/archs/VC-WIN64A/no-asm/crypto/include/internal/dso_conf.h
  342. 10:24:44 AM: npm ERR! gyp verb extracted file from tarball include/node/openssl/archs/VC-WIN64A/no-asm/crypto/buildinf.h
  343. 10:24:44 AM: npm ERR! gyp verb extracted file from tarball include/node/openssl/archs/VC-WIN64A/no-asm/include/openssl/opensslconf.h
  344. 10:24:44 AM: npm ERR! gyp verb extracted file from tarball include/node/openssl/archs/VC-WIN64A/no-asm/include/progs.h
  345. 10:24:44 AM: npm ERR! gyp verb extracted file from tarball include/node/openssl/archs/aix-gcc/asm/crypto/include/internal/bn_conf.h
  346. 10:24:44 AM: npm ERR! gyp verb extracted file from tarball include/node/openssl/archs/aix-gcc/asm/crypto/include/internal/dso_conf.h
  347. 10:24:44 AM: npm ERR! gyp verb extracted file from tarball include/node/openssl/archs/aix-gcc/asm/crypto/buildinf.h
  348. 10:24:44 AM: npm ERR! gyp verb extracted file from tarball include/node/openssl/archs/aix-gcc/asm/include/openssl/opensslconf.h
  349. 10:24:44 AM: npm ERR! gyp verb extracted file from tarball include/node/openssl/archs/aix-gcc/asm/include/progs.h
  350. 10:24:44 AM: npm ERR! gyp verb extracted file from tarball include/node/openssl/archs/aix-gcc/asm_avx2/crypto/include/internal/bn_conf.h
  351. 10:24:44 AM: npm ERR! gyp verb extracted file from tarball include/node/openssl/archs/aix-gcc/asm_avx2/crypto/include/internal/dso_conf.h
  352. 10:24:44 AM: npm ERR! gyp verb extracted file from tarball include/node/openssl/archs/aix-gcc/asm_avx2/crypto/buildinf.h
  353. 10:24:44 AM: npm ERR! gyp verb extracted file from tarball include/node/openssl/archs/aix-gcc/asm_avx2/include/openssl/opensslconf.h
  354. 10:24:44 AM: npm ERR! gyp verb extracted file from tarball include/node/openssl/archs/aix-gcc/asm_avx2/include/progs.h
  355. 10:24:44 AM: npm ERR! gyp verb extracted file from tarball include/node/openssl/archs/aix-gcc/no-asm/crypto/include/internal/bn_conf.h
  356. 10:24:44 AM: npm ERR! gyp verb extracted file from tarball include/node/openssl/archs/aix-gcc/no-asm/crypto/include/internal/dso_conf.h
  357. 10:24:44 AM: npm ERR! gyp verb extracted file from tarball include/node/openssl/archs/aix-gcc/no-asm/crypto/buildinf.h
  358. 10:24:44 AM: npm ERR! gyp verb extracted file from tarball include/node/openssl/archs/aix-gcc/no-asm/include/openssl/opensslconf.h
  359. 10:24:44 AM: npm ERR! gyp verb extracted file from tarball include/node/openssl/archs/aix-gcc/no-asm/include/progs.h
  360. 10:24:44 AM: npm ERR! gyp verb extracted file from tarball include/node/openssl/archs/aix64-gcc/asm/crypto/include/internal/bn_conf.h
  361. 10:24:44 AM: npm ERR! gyp verb extracted file from tarball include/node/openssl/archs/aix64-gcc/asm/crypto/include/internal/dso_conf.h
  362. 10:24:44 AM: npm ERR! gyp verb extracted file from tarball include/node/openssl/archs/aix64-gcc/asm/crypto/buildinf.h
  363. 10:24:44 AM: npm ERR! gyp verb extracted file from tarball include/node/openssl/archs/aix64-gcc/asm/include/openssl/opensslconf.h
  364. 10:24:44 AM: npm ERR! gyp verb extracted file from tarball include/node/openssl/archs/aix64-gcc/asm/include/progs.h
  365. 10:24:44 AM: npm ERR! gyp verb extracted file from tarball include/node/openssl/archs/aix64-gcc/asm_avx2/crypto/include/internal/bn_conf.h
  366. 10:24:44 AM: npm ERR! gyp verb extracted file from tarball include/node/openssl/archs/aix64-gcc/asm_avx2/crypto/include/internal/dso_conf.h
  367. 10:24:44 AM: npm ERR! gyp verb extracted file from tarball include/node/openssl/archs/aix64-gcc/asm_avx2/crypto/buildinf.h
  368. 10:24:44 AM: npm ERR! gyp verb extracted file from tarball include/node/openssl/archs/aix64-gcc/asm_avx2/include/openssl/opensslconf.h
  369. 10:24:44 AM: npm ERR! gyp verb extracted file from tarball include/node/openssl/archs/aix64-gcc/asm_avx2/include/progs.h
  370. 10:24:44 AM: npm ERR! gyp verb extracted file from tarball include/node/openssl/archs/aix64-gcc/no-asm/crypto/include/internal/bn_conf.h
  371. 10:24:44 AM: npm ERR! gyp verb extracted file from tarball include/node/openssl/archs/aix64-gcc/no-asm/crypto/include/internal/dso_conf.h
  372. 10:24:44 AM: npm ERR! gyp verb extracted file from tarball include/node/openssl/archs/aix64-gcc/no-asm/crypto/buildinf.h
  373. 10:24:44 AM: npm ERR! gyp verb extracted file from tarball include/node/openssl/archs/aix64-gcc/no-asm/include/openssl/opensslconf.h
  374. 10:24:44 AM: npm ERR! gyp verb extracted file from tarball include/node/openssl/archs/aix64-gcc/no-asm/include/progs.h
  375. 10:24:44 AM: npm ERR! gyp verb extracted file from tarball include/node/openssl/archs/darwin-i386-cc/asm/crypto/include/internal/bn_conf.h
  376. 10:24:44 AM: npm ERR! gyp verb extracted file from tarball include/node/openssl/archs/darwin-i386-cc/asm/crypto/include/internal/dso_conf.h
  377. 10:24:44 AM: npm ERR! gyp verb extracted file from tarball include/node/openssl/archs/darwin-i386-cc/asm/crypto/buildinf.h
  378. 10:24:44 AM: npm ERR! gyp verb extracted file from tarball include/node/openssl/archs/darwin-i386-cc/asm/include/openssl/opensslconf.h
  379. 10:24:44 AM: npm ERR! gyp verb extracted file from tarball include/node/openssl/archs/darwin-i386-cc/asm/include/progs.h
  380. 10:24:44 AM: npm ERR! gyp verb extracted file from tarball include/node/openssl/archs/darwin-i386-cc/asm_avx2/crypto/include/internal/bn_conf.h
  381. 10:24:44 AM: npm ERR! gyp verb extracted file from tarball include/node/openssl/archs/darwin-i386-cc/asm_avx2/crypto/include/internal/dso_conf.h
  382. 10:24:44 AM: npm ERR! gyp verb extracted file from tarball include/node/openssl/archs/darwin-i386-cc/asm_avx2/crypto/buildinf.h
  383. 10:24:44 AM: npm ERR! gyp verb extracted file from tarball include/node/openssl/archs/darwin-i386-cc/asm_avx2/include/openssl/opensslconf.h
  384. 10:24:44 AM: npm ERR! gyp verb extracted file from tarball include/node/openssl/archs/darwin-i386-cc/asm_avx2/include/progs.h
  385. 10:24:44 AM: npm ERR! gyp verb extracted file from tarball include/node/openssl/archs/darwin-i386-cc/no-asm/crypto/include/internal/bn_conf.h
  386. 10:24:44 AM: npm ERR! gyp verb extracted file from tarball include/node/openssl/archs/darwin-i386-cc/no-asm/crypto/include/internal/dso_conf.h
  387. 10:24:44 AM: npm ERR! gyp verb extracted file from tarball include/node/openssl/archs/darwin-i386-cc/no-asm/crypto/buildinf.h
  388. 10:24:44 AM: npm ERR! gyp verb extracted file from tarball include/node/openssl/archs/darwin-i386-cc/no-asm/include/openssl/opensslconf.h
  389. 10:24:44 AM: npm ERR! gyp verb extracted file from tarball include/node/openssl/archs/darwin-i386-cc/no-asm/include/progs.h
  390. 10:24:44 AM: npm ERR! gyp verb extracted file from tarball include/node/openssl/archs/darwin64-x86_64-cc/asm/crypto/include/internal/bn_conf.h
  391. 10:24:44 AM: npm ERR! gyp verb extracted file from tarball include/node/openssl/archs/darwin64-x86_64-cc/asm/crypto/include/internal/dso_conf.h
  392. 10:24:44 AM: npm ERR! gyp verb extracted file from tarball include/node/openssl/archs/darwin64-x86_64-cc/asm/crypto/buildinf.h
  393. 10:24:44 AM: npm ERR! gyp verb extracted file from tarball include/node/openssl/archs/darwin64-x86_64-cc/asm/include/openssl/opensslconf.h
  394. 10:24:44 AM: npm ERR! gyp verb extracted file from tarball include/node/openssl/archs/darwin64-x86_64-cc/asm/include/progs.h
  395. 10:24:44 AM: npm ERR! gyp verb extracted file from tarball include/node/openssl/archs/darwin64-x86_64-cc/asm_avx2/crypto/include/internal/bn_conf.h
  396. 10:24:44 AM: npm ERR! gyp verb extracted file from tarball include/node/openssl/archs/darwin64-x86_64-cc/asm_avx2/crypto/include/internal/dso_conf.h
  397. 10:24:44 AM: npm ERR! gyp verb extracted file from tarball include/node/openssl/archs/darwin64-x86_64-cc/asm_avx2/crypto/buildinf.h
  398. 10:24:44 AM: npm ERR! gyp verb extracted file from tarball include/node/openssl/archs/darwin64-x86_64-cc/asm_avx2/include/openssl/opensslconf.h
  399. 10:24:44 AM: npm ERR! gyp verb extracted file from tarball include/node/openssl/archs/darwin64-x86_64-cc/asm_avx2/include/progs.h
  400. 10:24:44 AM: npm ERR! gyp verb extracted file from tarball include/node/openssl/archs/darwin64-x86_64-cc/no-asm/crypto/include/internal/bn_conf.h
  401. 10:24:44 AM: npm ERR! gyp verb extracted file from tarball include/node/openssl/archs/darwin64-x86_64-cc/no-asm/crypto/include/internal/dso_conf.h
  402. 10:24:44 AM: npm ERR! gyp verb extracted file from tarball include/node/openssl/archs/darwin64-x86_64-cc/no-asm/crypto/buildinf.h
  403. 10:24:44 AM: npm ERR! gyp verb extracted file from tarball include/node/openssl/archs/darwin64-x86_64-cc/no-asm/include/openssl/opensslconf.h
  404. 10:24:44 AM: npm ERR! gyp verb extracted file from tarball include/node/openssl/archs/darwin64-x86_64-cc/no-asm/include/progs.h
  405. 10:24:44 AM: npm ERR! gyp verb extracted file from tarball include/node/openssl/archs/linux-aarch64/asm/crypto/include/internal/bn_conf.h
  406. 10:24:44 AM: npm ERR! gyp verb extracted file from tarball include/node/openssl/archs/linux-aarch64/asm/crypto/include/internal/dso_conf.h
  407. 10:24:44 AM: npm ERR! gyp verb extracted file from tarball include/node/openssl/archs/linux-aarch64/asm/crypto/buildinf.h
  408. 10:24:44 AM: npm ERR! gyp verb extracted file from tarball include/node/openssl/archs/linux-aarch64/asm/include/openssl/opensslconf.h
  409. 10:24:44 AM: npm ERR! gyp verb extracted file from tarball include/node/openssl/archs/linux-aarch64/asm/include/progs.h
  410. 10:24:44 AM: npm ERR! gyp verb extracted file from tarball include/node/openssl/archs/linux-aarch64/asm_avx2/crypto/include/internal/bn_conf.h
  411. 10:24:44 AM: npm ERR! gyp verb extracted file from tarball include/node/openssl/archs/linux-aarch64/asm_avx2/crypto/include/internal/dso_conf.h
  412. 10:24:44 AM: npm ERR! gyp verb extracted file from tarball include/node/openssl/archs/linux-aarch64/asm_avx2/crypto/buildinf.h
  413. 10:24:44 AM: npm ERR! gyp verb extracted file from tarball include/node/openssl/archs/linux-aarch64/asm_avx2/include/openssl/opensslconf.h
  414. 10:24:44 AM: npm ERR! gyp verb extracted file from tarball include/node/openssl/archs/linux-aarch64/asm_avx2/include/progs.h
  415. 10:24:44 AM: npm ERR! gyp verb extracted file from tarball include/node/openssl/archs/linux-aarch64/no-asm/crypto/include/internal/bn_conf.h
  416. 10:24:44 AM: npm ERR! gyp verb extracted file from tarball include/node/openssl/archs/linux-aarch64/no-asm/crypto/include/internal/dso_conf.h
  417. 10:24:44 AM: npm ERR! gyp verb extracted file from tarball include/node/openssl/archs/linux-aarch64/no-asm/crypto/buildinf.h
  418. 10:24:44 AM: npm ERR! gyp verb extracted file from tarball include/node/openssl/archs/linux-aarch64/no-asm/include/openssl/opensslconf.h
  419. 10:24:44 AM: npm ERR! gyp verb extracted file from tarball include/node/openssl/archs/linux-aarch64/no-asm/include/progs.h
  420. 10:24:44 AM: npm ERR! gyp verb extracted file from tarball include/node/openssl/archs/linux-armv4/asm/crypto/include/internal/bn_conf.h
  421. 10:24:44 AM: npm ERR! gyp verb extracted file from tarball include/node/openssl/archs/linux-armv4/asm/crypto/include/internal/dso_conf.h
  422. 10:24:44 AM: npm ERR! gyp verb extracted file from tarball include/node/openssl/archs/linux-armv4/asm/crypto/buildinf.h
  423. 10:24:44 AM: npm ERR! gyp verb extracted file from tarball include/node/openssl/archs/linux-armv4/asm/include/openssl/opensslconf.h
  424. 10:24:44 AM: npm ERR! gyp verb extracted file from tarball include/node/openssl/archs/linux-armv4/asm/include/progs.h
  425. 10:24:44 AM: npm ERR! gyp verb extracted file from tarball include/node/openssl/archs/linux-armv4/asm_avx2/crypto/include/internal/bn_conf.h
  426. 10:24:44 AM: npm ERR! gyp verb extracted file from tarball include/node/openssl/archs/linux-armv4/asm_avx2/crypto/include/internal/dso_conf.h
  427. 10:24:44 AM: npm ERR! gyp verb extracted file from tarball include/node/openssl/archs/linux-armv4/asm_avx2/crypto/buildinf.h
  428. 10:24:44 AM: npm ERR! gyp verb extracted file from tarball include/node/openssl/archs/linux-armv4/asm_avx2/include/openssl/opensslconf.h
  429. 10:24:44 AM: npm ERR! gyp verb extracted file from tarball include/node/openssl/archs/linux-armv4/asm_avx2/include/progs.h
  430. 10:24:44 AM: npm ERR! gyp verb extracted file from tarball include/node/openssl/archs/linux-armv4/no-asm/crypto/include/internal/bn_conf.h
  431. 10:24:44 AM: npm ERR! gyp verb extracted file from tarball include/node/openssl/archs/linux-armv4/no-asm/crypto/include/internal/dso_conf.h
  432. 10:24:44 AM: npm ERR! gyp verb extracted file from tarball include/node/openssl/archs/linux-armv4/no-asm/crypto/buildinf.h
  433. 10:24:44 AM: npm ERR! gyp verb extracted file from tarball include/node/openssl/archs/linux-armv4/no-asm/include/openssl/opensslconf.h
  434. 10:24:44 AM: npm ERR! gyp verb extracted file from tarball include/node/openssl/archs/linux-armv4/no-asm/include/progs.h
  435. 10:24:44 AM: npm ERR! gyp verb extracted file from tarball include/node/openssl/archs/linux-elf/asm/crypto/include/internal/bn_conf.h
  436. 10:24:44 AM: npm ERR! gyp verb extracted file from tarball include/node/openssl/archs/linux-elf/asm/crypto/include/internal/dso_conf.h
  437. 10:24:44 AM: npm ERR! gyp verb extracted file from tarball include/node/openssl/archs/linux-elf/asm/crypto/buildinf.h
  438. 10:24:44 AM: npm ERR! gyp verb extracted file from tarball include/node/openssl/archs/linux-elf/asm/include/openssl/opensslconf.h
  439. 10:24:44 AM: npm ERR! gyp verb extracted file from tarball include/node/openssl/archs/linux-elf/asm/include/progs.h
  440. 10:24:44 AM: npm ERR! gyp verb extracted file from tarball include/node/openssl/archs/linux-elf/asm_avx2/crypto/include/internal/bn_conf.h
  441. 10:24:44 AM: npm ERR! gyp verb extracted file from tarball include/node/openssl/archs/linux-elf/asm_avx2/crypto/include/internal/dso_conf.h
  442. 10:24:44 AM: npm ERR! gyp verb extracted file from tarball include/node/openssl/archs/linux-elf/asm_avx2/crypto/buildinf.h
  443. 10:24:44 AM: npm ERR! gyp verb extracted file from tarball include/node/openssl/archs/linux-elf/asm_avx2/include/openssl/opensslconf.h
  444. 10:24:44 AM: npm ERR! gyp verb extracted file from tarball include/node/openssl/archs/linux-elf/asm_avx2/include/progs.h
  445. 10:24:44 AM: npm ERR! gyp verb extracted file from tarball include/node/openssl/archs/linux-elf/no-asm/crypto/include/internal/bn_conf.h
  446. 10:24:44 AM: npm ERR! gyp verb extracted file from tarball include/node/openssl/archs/linux-elf/no-asm/crypto/include/internal/dso_conf.h
  447. 10:24:44 AM: npm ERR! gyp verb extracted file from tarball include/node/openssl/archs/linux-elf/no-asm/crypto/buildinf.h
  448. 10:24:44 AM: npm ERR! gyp verb extracted file from tarball include/node/openssl/archs/linux-elf/no-asm/include/openssl/opensslconf.h
  449. 10:24:44 AM: npm ERR! gyp verb extracted file from tarball include/node/openssl/archs/linux-elf/no-asm/include/progs.h
  450. 10:24:44 AM: npm ERR! gyp verb extracted file from tarball include/node/openssl/archs/linux-ppc/asm/crypto/include/internal/bn_conf.h
  451. 10:24:44 AM: npm ERR! gyp verb extracted file from tarball include/node/openssl/archs/linux-ppc/asm/crypto/include/internal/dso_conf.h
  452. 10:24:44 AM: npm ERR! gyp verb extracted file from tarball include/node/openssl/archs/linux-ppc/asm/crypto/buildinf.h
  453. 10:24:44 AM: npm ERR! gyp verb extracted file from tarball include/node/openssl/archs/linux-ppc/asm/include/openssl/opensslconf.h
  454. 10:24:44 AM: npm ERR! gyp verb extracted file from tarball include/node/openssl/archs/linux-ppc/asm/include/progs.h
  455. 10:24:44 AM: npm ERR! gyp verb extracted file from tarball include/node/openssl/archs/linux-ppc/asm_avx2/crypto/include/internal/bn_conf.h
  456. 10:24:44 AM: npm ERR! gyp verb extracted file from tarball include/node/openssl/archs/linux-ppc/asm_avx2/crypto/include/internal/dso_conf.h
  457. 10:24:44 AM: npm ERR! gyp verb extracted file from tarball include/node/openssl/archs/linux-ppc/asm_avx2/crypto/buildinf.h
  458. 10:24:44 AM: npm ERR! gyp verb extracted file from tarball include/node/openssl/archs/linux-ppc/asm_avx2/include/openssl/opensslconf.h
  459. 10:24:44 AM: npm ERR! gyp verb extracted file from tarball include/node/openssl/archs/linux-ppc/asm_avx2/include/progs.h
  460. 10:24:44 AM: npm ERR! gyp verb extracted file from tarball include/node/openssl/archs/linux-ppc/no-asm/crypto/include/internal/bn_conf.h
  461. 10:24:44 AM: npm ERR! gyp verb extracted file from tarball include/node/openssl/archs/linux-ppc/no-asm/crypto/include/internal/dso_conf.h
  462. 10:24:44 AM: npm ERR! gyp verb extracted file from tarball include/node/openssl/archs/linux-ppc/no-asm/crypto/buildinf.h
  463. 10:24:44 AM: npm ERR! gyp verb extracted file from tarball include/node/openssl/archs/linux-ppc/no-asm/include/openssl/opensslconf.h
  464. 10:24:44 AM: npm ERR! gyp verb extracted file from tarball include/node/openssl/archs/linux-ppc/no-asm/include/progs.h
  465. 10:24:44 AM: npm ERR! gyp verb extracted file from tarball include/node/openssl/archs/linux-ppc64/asm/crypto/include/internal/bn_conf.h
  466. 10:24:44 AM: npm ERR! gyp verb extracted file from tarball include/node/openssl/archs/linux-ppc64/asm/crypto/include/internal/dso_conf.h
  467. 10:24:44 AM: npm ERR! gyp verb extracted file from tarball include/node/openssl/archs/linux-ppc64/asm/crypto/buildinf.h
  468. 10:24:44 AM: npm ERR! gyp verb extracted file from tarball include/node/openssl/archs/linux-ppc64/asm/include/openssl/opensslconf.h
  469. 10:24:44 AM: npm ERR! gyp verb extracted file from tarball include/node/openssl/archs/linux-ppc64/asm/include/progs.h
  470. 10:24:44 AM: npm ERR! gyp verb extracted file from tarball include/node/openssl/archs/linux-ppc64/asm_avx2/crypto/include/internal/bn_conf.h
  471. 10:24:44 AM: npm ERR! gyp verb extracted file from tarball include/node/openssl/archs/linux-ppc64/asm_avx2/crypto/include/internal/dso_conf.h
  472. 10:24:44 AM: npm ERR! gyp verb extracted file from tarball include/node/openssl/archs/linux-ppc64/asm_avx2/crypto/buildinf.h
  473. 10:24:44 AM: npm ERR! gyp verb extracted file from tarball include/node/openssl/archs/linux-ppc64/asm_avx2/include/openssl/opensslconf.h
  474. 10:24:44 AM: npm ERR! gyp verb extracted file from tarball include/node/openssl/archs/linux-ppc64/asm_avx2/include/progs.h
  475. 10:24:44 AM: npm ERR! gyp verb extracted file from tarball include/node/openssl/archs/linux-ppc64/no-asm/crypto/include/internal/bn_conf.h
  476. 10:24:44 AM: npm ERR! gyp verb extracted file from tarball include/node/openssl/archs/linux-ppc64/no-asm/crypto/include/internal/dso_conf.h
  477. 10:24:44 AM: npm ERR! gyp verb extracted file from tarball include/node/openssl/archs/linux-ppc64/no-asm/crypto/buildinf.h
  478. 10:24:44 AM: npm ERR! gyp verb extracted file from tarball include/node/openssl/archs/linux-ppc64/no-asm/include/openssl/opensslconf.h
  479. 10:24:44 AM: npm ERR! gyp verb extracted file from tarball include/node/openssl/archs/linux-ppc64/no-asm/include/progs.h
  480. 10:24:44 AM: npm ERR! gyp verb extracted file from tarball include/node/openssl/archs/linux-ppc64le/asm/crypto/include/internal/bn_conf.h
  481. 10:24:44 AM: npm ERR! gyp verb extracted file from tarball include/node/openssl/archs/linux-ppc64le/asm/crypto/include/internal/dso_conf.h
  482. 10:24:44 AM: npm ERR! gyp verb extracted file from tarball include/node/openssl/archs/linux-ppc64le/asm/crypto/buildinf.h
  483. 10:24:44 AM: npm ERR! gyp verb extracted file from tarball include/node/openssl/archs/linux-ppc64le/asm/include/openssl/opensslconf.h
  484. 10:24:44 AM: npm ERR! gyp verb extracted file from tarball include/node/openssl/archs/linux-ppc64le/asm/include/progs.h
  485. 10:24:44 AM: npm ERR! gyp verb extracted file from tarball include/node/openssl/archs/linux-ppc64le/asm_avx2/crypto/include/internal/bn_conf.h
  486. 10:24:44 AM: npm ERR! gyp verb extracted file from tarball include/node/openssl/archs/linux-ppc64le/asm_avx2/crypto/include/internal/dso_conf.h
  487. 10:24:44 AM: npm ERR! gyp verb extracted file from tarball include/node/openssl/archs/linux-ppc64le/asm_avx2/crypto/buildinf.h
  488. 10:24:44 AM: npm ERR! gyp verb extracted file from tarball include/node/openssl/archs/linux-ppc64le/asm_avx2/include/openssl/opensslconf.h
  489. 10:24:44 AM: npm ERR! gyp verb extracted file from tarball include/node/openssl/archs/linux-ppc64le/asm_avx2/include/progs.h
  490. 10:24:44 AM: npm ERR! gyp verb extracted file from tarball include/node/openssl/archs/linux-ppc64le/no-asm/crypto/include/internal/bn_conf.h
  491. 10:24:44 AM: npm ERR! gyp verb extracted file from tarball include/node/openssl/archs/linux-ppc64le/no-asm/crypto/include/internal/dso_conf.h
  492. 10:24:44 AM: npm ERR! gyp verb extracted file from tarball include/node/openssl/archs/linux-ppc64le/no-asm/crypto/buildinf.h
  493. 10:24:44 AM: npm ERR! gyp verb extracted file from tarball include/node/openssl/archs/linux-ppc64le/no-asm/include/openssl/opensslconf.h
  494. 10:24:44 AM: npm ERR! gyp verb extracted file from tarball include/node/openssl/archs/linux-ppc64le/no-asm/include/progs.h
  495. 10:24:44 AM: npm ERR! gyp verb extracted file from tarball include/node/openssl/archs/linux-x32/asm/crypto/include/internal/bn_conf.h
  496. 10:24:44 AM: npm ERR! gyp verb extracted file from tarball include/node/openssl/archs/linux-x32/asm/crypto/include/internal/dso_conf.h
  497. 10:24:44 AM: npm ERR! gyp verb extracted file from tarball include/node/openssl/archs/linux-x32/asm/crypto/buildinf.h
  498. 10:24:44 AM: npm ERR! gyp verb extracted file from tarball include/node/openssl/archs/linux-x32/asm/include/openssl/opensslconf.h
  499. 10:24:44 AM: npm ERR! gyp verb extracted file from tarball include/node/openssl/archs/linux-x32/asm/include/progs.h
  500. 10:24:44 AM: npm ERR! gyp verb extracted file from tarball include/node/openssl/archs/linux-x32/asm_avx2/crypto/include/internal/bn_conf.h
  501. 10:24:44 AM: npm ERR! gyp verb extracted file from tarball include/node/openssl/archs/linux-x32/asm_avx2/crypto/include/internal/dso_conf.h
  502. 10:24:44 AM: npm ERR! gyp verb extracted file from tarball include/node/openssl/archs/linux-x32/asm_avx2/crypto/buildinf.h
  503. 10:24:44 AM: npm ERR! gyp verb extracted file from tarball include/node/openssl/archs/linux-x32/asm_avx2/include/openssl/opensslconf.h
  504. 10:24:44 AM: npm ERR! gyp verb extracted file from tarball include/node/openssl/archs/linux-x32/asm_avx2/include/progs.h
  505. 10:24:44 AM: npm ERR! gyp verb extracted file from tarball include/node/openssl/archs/linux-x32/no-asm/crypto/include/internal/bn_conf.h
  506. 10:24:44 AM: npm ERR! gyp verb extracted file from tarball include/node/openssl/archs/linux-x32/no-asm/crypto/include/internal/dso_conf.h
  507. 10:24:44 AM: npm ERR! gyp verb extracted file from tarball include/node/openssl/archs/linux-x32/no-asm/crypto/buildinf.h
  508. 10:24:44 AM: npm ERR! gyp verb extracted file from tarball include/node/openssl/archs/linux-x32/no-asm/include/openssl/opensslconf.h
  509. 10:24:44 AM: npm ERR! gyp verb extracted file from tarball include/node/openssl/archs/linux-x32/no-asm/include/progs.h
  510. 10:24:44 AM: npm ERR! gyp verb extracted file from tarball include/node/openssl/archs/linux-x86_64/asm/crypto/include/internal/bn_conf.h
  511. 10:24:44 AM: npm ERR! gyp verb extracted file from tarball include/node/openssl/archs/linux-x86_64/asm/crypto/include/internal/dso_conf.h
  512. 10:24:44 AM: npm ERR! gyp verb extracted file from tarball include/node/openssl/archs/linux-x86_64/asm/crypto/buildinf.h
  513. 10:24:44 AM: npm ERR! gyp verb extracted file from tarball include/node/openssl/archs/linux-x86_64/asm/include/openssl/opensslconf.h
  514. 10:24:44 AM: npm ERR! gyp verb extracted file from tarball include/node/openssl/archs/linux-x86_64/asm/include/progs.h
  515. 10:24:44 AM: npm ERR! gyp verb extracted file from tarball include/node/openssl/archs/linux-x86_64/asm_avx2/crypto/include/internal/bn_conf.h
  516. 10:24:44 AM: npm ERR! gyp verb extracted file from tarball include/node/openssl/archs/linux-x86_64/asm_avx2/crypto/include/internal/dso_conf.h
  517. 10:24:44 AM: npm ERR! gyp verb extracted file from tarball include/node/openssl/archs/linux-x86_64/asm_avx2/crypto/buildinf.h
  518. 10:24:44 AM: npm ERR! gyp verb extracted file from tarball include/node/openssl/archs/linux-x86_64/asm_avx2/include/openssl/opensslconf.h
  519. 10:24:44 AM: npm ERR! gyp verb extracted file from tarball include/node/openssl/archs/linux-x86_64/asm_avx2/include/progs.h
  520. 10:24:44 AM: npm ERR! gyp verb extracted file from tarball include/node/openssl/archs/linux-x86_64/no-asm/crypto/include/internal/bn_conf.h
  521. 10:24:44 AM: npm ERR! gyp verb extracted file from tarball include/node/openssl/archs/linux-x86_64/no-asm/crypto/include/internal/dso_conf.h
  522. 10:24:44 AM: npm ERR! gyp verb extracted file from tarball include/node/openssl/archs/linux-x86_64/no-asm/crypto/buildinf.h
  523. 10:24:44 AM: npm ERR! gyp verb extracted file from tarball include/node/openssl/archs/linux-x86_64/no-asm/include/openssl/opensslconf.h
  524. 10:24:44 AM: npm ERR! gyp verb extracted file from tarball include/node/openssl/archs/linux-x86_64/no-asm/include/progs.h
  525. 10:24:44 AM: npm ERR! gyp verb extracted file from tarball include/node/openssl/archs/linux32-s390x/asm/crypto/include/internal/bn_conf.h
  526. 10:24:44 AM: npm ERR! gyp verb extracted file from tarball include/node/openssl/archs/linux32-s390x/asm/crypto/include/internal/dso_conf.h
  527. 10:24:44 AM: npm ERR! gyp verb extracted file from tarball include/node/openssl/archs/linux32-s390x/asm/crypto/buildinf.h
  528. 10:24:44 AM: npm ERR! gyp verb extracted file from tarball include/node/openssl/archs/linux32-s390x/asm/include/openssl/opensslconf.h
  529. 10:24:44 AM: npm ERR! gyp verb extracted file from tarball include/node/openssl/archs/linux32-s390x/asm/include/progs.h
  530. 10:24:44 AM: npm ERR! gyp verb extracted file from tarball include/node/openssl/archs/linux32-s390x/asm_avx2/crypto/include/internal/bn_conf.h
  531. 10:24:44 AM: npm ERR! gyp verb extracted file from tarball include/node/openssl/archs/linux32-s390x/asm_avx2/crypto/include/internal/dso_conf.h
  532. 10:24:44 AM: npm ERR! gyp verb extracted file from tarball include/node/openssl/archs/linux32-s390x/asm_avx2/crypto/buildinf.h
  533. 10:24:44 AM: npm ERR! gyp verb extracted file from tarball include/node/openssl/archs/linux32-s390x/asm_avx2/include/openssl/opensslconf.h
  534. 10:24:44 AM: npm ERR! gyp verb extracted file from tarball include/node/openssl/archs/linux32-s390x/asm_avx2/include/progs.h
  535. 10:24:44 AM: npm ERR! gyp verb extracted file from tarball include/node/openssl/archs/linux32-s390x/no-asm/crypto/include/internal/bn_conf.h
  536. 10:24:44 AM: npm ERR! gyp verb extracted file from tarball include/node/openssl/archs/linux32-s390x/no-asm/crypto/include/internal/dso_conf.h
  537. 10:24:44 AM: npm ERR! gyp verb extracted file from tarball include/node/openssl/archs/linux32-s390x/no-asm/crypto/buildinf.h
  538. 10:24:44 AM: npm ERR! gyp verb extracted file from tarball include/node/openssl/archs/linux32-s390x/no-asm/include/openssl/opensslconf.h
  539. 10:24:44 AM: npm ERR! gyp verb extracted file from tarball include/node/openssl/archs/linux32-s390x/no-asm/include/progs.h
  540. 10:24:44 AM: npm ERR! gyp verb extracted file from tarball include/node/openssl/archs/linux64-s390x/asm/crypto/include/internal/bn_conf.h
  541. 10:24:44 AM: npm ERR! gyp verb extracted file from tarball include/node/openssl/archs/linux64-s390x/asm/crypto/include/internal/dso_conf.h
  542. 10:24:44 AM: npm ERR! gyp verb extracted file from tarball include/node/openssl/archs/linux64-s390x/asm/crypto/buildinf.h
  543. 10:24:44 AM: npm ERR! gyp verb extracted file from tarball include/node/openssl/archs/linux64-s390x/asm/include/openssl/opensslconf.h
  544. 10:24:44 AM: npm ERR! gyp verb extracted file from tarball include/node/openssl/archs/linux64-s390x/asm/include/progs.h
  545. 10:24:44 AM: npm ERR! gyp verb extracted file from tarball include/node/openssl/archs/linux64-s390x/asm_avx2/crypto/include/internal/bn_conf.h
  546. 10:24:44 AM: npm ERR! gyp verb extracted file from tarball include/node/openssl/archs/linux64-s390x/asm_avx2/crypto/include/internal/dso_conf.h
  547. 10:24:44 AM: npm ERR! gyp verb extracted file from tarball include/node/openssl/archs/linux64-s390x/asm_avx2/crypto/buildinf.h
  548. 10:24:44 AM: npm ERR! gyp verb extracted file from tarball include/node/openssl/archs/linux64-s390x/asm_avx2/include/openssl/opensslconf.h
  549. 10:24:44 AM: npm ERR! gyp verb extracted file from tarball include/node/openssl/archs/linux64-s390x/asm_avx2/include/progs.h
  550. 10:24:44 AM: npm ERR! gyp verb extracted file from tarball include/node/openssl/archs/linux64-s390x/no-asm/crypto/include/internal/bn_conf.h
  551. 10:24:44 AM: npm ERR! gyp verb extracted file from tarball include/node/openssl/archs/linux64-s390x/no-asm/crypto/include/internal/dso_conf.h
  552. 10:24:44 AM: npm ERR! gyp verb extracted file from tarball include/node/openssl/archs/linux64-s390x/no-asm/crypto/buildinf.h
  553. 10:24:44 AM: npm ERR! gyp verb extracted file from tarball include/node/openssl/archs/linux64-s390x/no-asm/include/openssl/opensslconf.h
  554. 10:24:44 AM: npm ERR! gyp verb extracted file from tarball include/node/openssl/archs/linux64-s390x/no-asm/include/progs.h
  555. 10:24:44 AM: npm ERR! gyp verb extracted file from tarball include/node/openssl/archs/solaris-x86-gcc/asm/crypto/include/internal/bn_conf.h
  556. 10:24:44 AM: npm ERR! gyp verb extracted file from tarball include/node/openssl/archs/solaris-x86-gcc/asm/crypto/include/internal/dso_conf.h
  557. 10:24:44 AM: npm ERR! gyp verb extracted file from tarball include/node/openssl/archs/solaris-x86-gcc/asm/crypto/buildinf.h
  558. 10:24:44 AM: npm ERR! gyp verb extracted file from tarball include/node/openssl/archs/solaris-x86-gcc/asm/include/openssl/opensslconf.h
  559. 10:24:44 AM: npm ERR! gyp verb extracted file from tarball include/node/openssl/archs/solaris-x86-gcc/asm/include/progs.h
  560. 10:24:44 AM: npm ERR! gyp verb extracted file from tarball include/node/openssl/archs/solaris-x86-gcc/asm_avx2/crypto/include/internal/bn_conf.h
  561. 10:24:44 AM: npm ERR! gyp verb extracted file from tarball include/node/openssl/archs/solaris-x86-gcc/asm_avx2/crypto/include/internal/dso_conf.h
  562. 10:24:44 AM: npm ERR! gyp verb extracted file from tarball include/node/openssl/archs/solaris-x86-gcc/asm_avx2/crypto/buildinf.h
  563. 10:24:44 AM: npm ERR! gyp verb extracted file from tarball include/node/openssl/archs/solaris-x86-gcc/asm_avx2/include/openssl/opensslconf.h
  564. 10:24:44 AM: npm ERR! gyp verb extracted file from tarball include/node/openssl/archs/solaris-x86-gcc/asm_avx2/include/progs.h
  565. 10:24:44 AM: npm ERR! gyp verb extracted file from tarball include/node/openssl/archs/solaris-x86-gcc/no-asm/crypto/include/internal/bn_conf.h
  566. 10:24:44 AM: npm ERR! gyp verb extracted file from tarball include/node/openssl/archs/solaris-x86-gcc/no-asm/crypto/include/internal/dso_conf.h
  567. 10:24:44 AM: npm ERR! gyp verb extracted file from tarball include/node/openssl/archs/solaris-x86-gcc/no-asm/crypto/buildinf.h
  568. 10:24:44 AM: npm ERR! gyp verb extracted file from tarball include/node/openssl/archs/solaris-x86-gcc/no-asm/include/openssl/opensslconf.h
  569. 10:24:44 AM: npm ERR! gyp verb extracted file from tarball include/node/openssl/archs/solaris-x86-gcc/no-asm/include/progs.h
  570. 10:24:44 AM: npm ERR! gyp verb extracted file from tarball include/node/openssl/archs/solaris64-x86_64-gcc/asm/crypto/include/internal/bn_conf.h
  571. 10:24:44 AM: npm ERR! gyp verb extracted file from tarball include/node/openssl/archs/solaris64-x86_64-gcc/asm/crypto/include/internal/dso_conf.h
  572. 10:24:44 AM: npm ERR! gyp verb extracted file from tarball include/node/openssl/archs/solaris64-x86_64-gcc/asm/crypto/buildinf.h
  573. 10:24:44 AM: npm ERR! gyp verb extracted file from tarball include/node/openssl/archs/solaris64-x86_64-gcc/asm/include/openssl/opensslconf.h
  574. 10:24:44 AM: npm ERR! gyp verb extracted file from tarball include/node/openssl/archs/solaris64-x86_64-gcc/asm/include/progs.h
  575. 10:24:44 AM: npm ERR! gyp verb extracted file from tarball include/node/openssl/archs/solaris64-x86_64-gcc/asm_avx2/crypto/include/internal/bn_conf.h
  576. 10:24:44 AM: npm ERR! gyp verb extracted file from tarball include/node/openssl/archs/solaris64-x86_64-gcc/asm_avx2/crypto/include/internal/dso_conf.h
  577. 10:24:44 AM: npm ERR! gyp verb extracted file from tarball include/node/openssl/archs/solaris64-x86_64-gcc/asm_avx2/crypto/buildinf.h
  578. 10:24:44 AM: npm ERR! gyp verb extracted file from tarball include/node/openssl/archs/solaris64-x86_64-gcc/asm_avx2/include/openssl/opensslconf.h
  579. 10:24:44 AM: npm ERR! gyp verb extracted file from tarball include/node/openssl/archs/solaris64-x86_64-gcc/asm_avx2/include/progs.h
  580. 10:24:44 AM: npm ERR! gyp verb extracted file from tarball include/node/openssl/archs/solaris64-x86_64-gcc/no-asm/crypto/include/internal/bn_conf.h
  581. 10:24:44 AM: npm ERR! gyp verb extracted file from tarball include/node/openssl/archs/solaris64-x86_64-gcc/no-asm/crypto/include/internal/dso_conf.h
  582. 10:24:44 AM: npm ERR! gyp verb extracted file from tarball include/node/openssl/archs/solaris64-x86_64-gcc/no-asm/crypto/buildinf.h
  583. 10:24:44 AM: npm ERR! gyp verb extracted file from tarball include/node/openssl/archs/solaris64-x86_64-gcc/no-asm/include/openssl/opensslconf.h
  584. 10:24:44 AM: npm ERR! gyp verb content checksum node-v16.8.0-headers.tar.gz fa04f9a4fd9126fe2c0bf43e3d464d730dd328cc130c3599478530f64489be7f
  585. 10:24:44 AM: npm ERR! gyp verb extracted file from tarball include/node/openssl/archs/solaris64-x86_64-gcc/no-asm/include/progs.h
  586. 10:24:44 AM: npm ERR! gyp verb extracted file from tarball include/node/openssl/archs/BSD-x86/asm/crypto/include/internal/bn_conf.h
  587. 10:24:44 AM: npm ERR! gyp verb extracted file from tarball include/node/openssl/archs/BSD-x86/asm/crypto/include/internal/dso_conf.h
  588. 10:24:44 AM: npm ERR! gyp verb extracted file from tarball include/node/openssl/archs/BSD-x86/asm/crypto/buildinf.h
  589. 10:24:44 AM: npm ERR! gyp verb extracted file from tarball include/node/openssl/archs/BSD-x86/asm/include/openssl/opensslconf.h
  590. 10:24:44 AM: npm ERR! gyp verb extracted file from tarball include/node/openssl/archs/BSD-x86/asm/include/progs.h
  591. 10:24:44 AM: npm ERR! gyp verb extracted file from tarball include/node/openssl/archs/BSD-x86/asm_avx2/crypto/include/internal/bn_conf.h
  592. 10:24:44 AM: npm ERR! gyp verb extracted file from tarball include/node/openssl/archs/BSD-x86/asm_avx2/crypto/include/internal/dso_conf.h
  593. 10:24:44 AM: npm ERR! gyp verb extracted file from tarball include/node/openssl/archs/BSD-x86/asm_avx2/crypto/buildinf.h
  594. 10:24:44 AM: npm ERR! gyp verb extracted file from tarball include/node/openssl/archs/BSD-x86/asm_avx2/include/openssl/opensslconf.h
  595. 10:24:44 AM: npm ERR! gyp verb extracted file from tarball include/node/openssl/archs/BSD-x86/asm_avx2/include/progs.h
  596. 10:24:44 AM: npm ERR! gyp verb extracted file from tarball include/node/openssl/archs/BSD-x86/no-asm/crypto/include/internal/bn_conf.h
  597. 10:24:44 AM: npm ERR! gyp verb extracted file from tarball include/node/openssl/archs/BSD-x86/no-asm/crypto/include/internal/dso_conf.h
  598. 10:24:44 AM: npm ERR! gyp verb extracted file from tarball include/node/openssl/archs/BSD-x86/no-asm/crypto/buildinf.h
  599. 10:24:44 AM: npm ERR! gyp verb extracted file from tarball include/node/openssl/archs/BSD-x86/no-asm/include/openssl/opensslconf.h
  600. 10:24:44 AM: npm ERR! gyp verb extracted file from tarball include/node/openssl/archs/BSD-x86/no-asm/include/progs.h
  601. 10:24:44 AM: npm ERR! gyp verb extracted file from tarball include/node/openssl/archs/darwin64-arm64-cc/asm/crypto/include/internal/bn_conf.h
  602. 10:24:44 AM: npm ERR! gyp verb extracted file from tarball include/node/openssl/archs/darwin64-arm64-cc/asm/crypto/include/internal/dso_conf.h
  603. 10:24:44 AM: npm ERR! gyp verb extracted file from tarball include/node/openssl/archs/darwin64-arm64-cc/asm/crypto/buildinf.h
  604. 10:24:44 AM: npm ERR! gyp verb extracted file from tarball include/node/openssl/archs/darwin64-arm64-cc/asm/include/openssl/opensslconf.h
  605. 10:24:44 AM: npm ERR! gyp verb extracted file from tarball include/node/openssl/archs/darwin64-arm64-cc/asm/include/progs.h
  606. 10:24:44 AM: npm ERR! gyp verb extracted file from tarball include/node/openssl/archs/darwin64-arm64-cc/asm_avx2/crypto/include/internal/bn_conf.h
  607. 10:24:44 AM: npm ERR! gyp verb extracted file from tarball include/node/openssl/archs/darwin64-arm64-cc/asm_avx2/crypto/include/internal/dso_conf.h
  608. 10:24:44 AM: npm ERR! gyp verb extracted file from tarball include/node/openssl/archs/darwin64-arm64-cc/asm_avx2/crypto/buildinf.h
  609. 10:24:44 AM: npm ERR! gyp verb extracted file from tarball include/node/openssl/archs/darwin64-arm64-cc/asm_avx2/include/openssl/opensslconf.h
  610. 10:24:44 AM: npm ERR! gyp verb extracted file from tarball include/node/openssl/archs/darwin64-arm64-cc/asm_avx2/include/progs.h
  611. 10:24:44 AM: npm ERR! gyp verb extracted file from tarball include/node/openssl/archs/darwin64-arm64-cc/no-asm/crypto/include/internal/bn_conf.h
  612. 10:24:44 AM: npm ERR! gyp verb extracted file from tarball include/node/openssl/archs/darwin64-arm64-cc/no-asm/crypto/include/internal/dso_conf.h
  613. 10:24:44 AM: npm ERR! gyp verb extracted file from tarball include/node/openssl/archs/darwin64-arm64-cc/no-asm/crypto/buildinf.h
  614. 10:24:44 AM: npm ERR! gyp verb extracted file from tarball include/node/openssl/archs/darwin64-arm64-cc/no-asm/include/openssl/opensslconf.h
  615. 10:24:44 AM: npm ERR! gyp verb extracted file from tarball include/node/openssl/archs/darwin64-arm64-cc/no-asm/include/progs.h
  616. 10:24:44 AM: npm ERR! gyp verb extracted file from tarball include/node/openssl/archs/linux64-mips64/asm/crypto/include/internal/bn_conf.h
  617. 10:24:44 AM: npm ERR! gyp verb extracted file from tarball include/node/openssl/archs/linux64-mips64/asm/crypto/include/internal/dso_conf.h
  618. 10:24:44 AM: npm ERR! gyp verb extracted file from tarball include/node/openssl/archs/linux64-mips64/asm/crypto/buildinf.h
  619. 10:24:44 AM: npm ERR! gyp verb extracted file from tarball include/node/openssl/archs/linux64-mips64/asm/include/openssl/opensslconf.h
  620. 10:24:44 AM: npm ERR! gyp verb extracted file from tarball include/node/openssl/archs/linux64-mips64/asm/include/progs.h
  621. 10:24:44 AM: npm ERR! gyp verb extracted file from tarball include/node/openssl/archs/linux64-mips64/asm_avx2/crypto/include/internal/bn_conf.h
  622. 10:24:44 AM: npm ERR! gyp verb extracted file from tarball include/node/openssl/archs/linux64-mips64/asm_avx2/crypto/include/internal/dso_conf.h
  623. 10:24:44 AM: npm ERR! gyp verb extracted file from tarball include/node/openssl/archs/linux64-mips64/asm_avx2/crypto/buildinf.h
  624. 10:24:44 AM: npm ERR! gyp verb extracted file from tarball include/node/openssl/archs/linux64-mips64/asm_avx2/include/openssl/opensslconf.h
  625. 10:24:44 AM: npm ERR! gyp verb extracted file from tarball include/node/openssl/archs/linux64-mips64/asm_avx2/include/progs.h
  626. 10:24:44 AM: npm ERR! gyp verb extracted file from tarball include/node/openssl/archs/linux64-mips64/no-asm/crypto/include/internal/bn_conf.h
  627. 10:24:44 AM: npm ERR! gyp verb extracted file from tarball include/node/openssl/archs/linux64-mips64/no-asm/crypto/include/internal/dso_conf.h
  628. 10:24:44 AM: npm ERR! gyp verb extracted file from tarball include/node/openssl/archs/linux64-mips64/no-asm/crypto/buildinf.h
  629. 10:24:44 AM: npm ERR! gyp verb extracted file from tarball include/node/openssl/archs/linux64-mips64/no-asm/include/openssl/opensslconf.h
  630. 10:24:44 AM: npm ERR! gyp verb extracted file from tarball include/node/openssl/archs/linux64-mips64/no-asm/include/progs.h
  631. 10:24:44 AM: npm ERR! gyp verb extracted file from tarball include/node/openssl/bn_conf.h
  632. 10:24:44 AM: npm ERR! gyp verb extracted file from tarball include/node/openssl/dso_conf.h
  633. 10:24:44 AM: npm ERR! gyp verb extracted file from tarball include/node/openssl/opensslconf.h
  634. 10:24:44 AM: npm ERR! gyp verb extracted file from tarball include/node/openssl/dso_conf_asm.h
  635. 10:24:44 AM: npm ERR! gyp verb extracted file from tarball include/node/openssl/bn_conf_asm.h
  636. 10:24:44 AM: npm ERR! gyp verb extracted file from tarball include/node/openssl/bn_conf_no-asm.h
  637. 10:24:44 AM: npm ERR! gyp verb extracted file from tarball include/node/openssl/dso_conf_no-asm.h
  638. 10:24:44 AM: npm ERR! gyp verb extracted file from tarball include/node/openssl/opensslconf_asm.h
  639. 10:24:44 AM: npm ERR! gyp verb extracted file from tarball include/node/openssl/opensslconf_no-asm.h
  640. 10:24:44 AM: npm ERR! gyp verb extracted file from tarball include/node/zconf.h
  641. 10:24:44 AM: npm ERR! gyp verb extracted file from tarball include/node/zlib.h
  642. 10:24:44 AM: npm ERR! gyp verb tarball done parsing tarball
  643. 10:24:44 AM: npm ERR! gyp verb check download content checksum, need to download `SHASUMS256.txt`...
  644. 10:24:44 AM: npm ERR! gyp verb checksum url https://nodejs.org/download/release/v16.8.0/SHASUMS256.txt
  645. 10:24:44 AM: npm ERR! gyp http GET https://nodejs.org/download/release/v16.8.0/SHASUMS256.txt
  646. 10:24:44 AM: npm ERR! gyp http 200 https://nodejs.org/download/release/v16.8.0/SHASUMS256.txt
  647. 10:24:44 AM: npm ERR! gyp verb checksum data {"node-v16.8.0-aix-ppc64.tar.gz":"cc9e8e2600c2ad9ee80be45a850453a5f0237650f8bd4364db4a9f941a5b6e57","node-v16.8.0-darwin-arm64.tar.gz":"891e72d166abbb1b838b5113cc8cfaf2fe905dfe77afe84a5af56e426ff74ddf","node-v16.8.0-darwin-arm64.tar.xz":"f1aa35e99542bdaab51e46917203cf215463982a16862199ecfa200534190119","node-v16.8.0-darwin-x64.tar.gz":"9c013cb82830ab5adb9630ff28046f420a7805bb4a930ec2b3f5b162c5f6de88","node-v16.8.0-darwin-x64.tar.xz":"fdcc827192f349bb1f3ec58361cb6a9a783b84d3bc19d51ca2fd5b0968b89f3b","node-v16.8.0-headers.tar.gz":"fa04f9a4fd9126fe2c0bf43e3d464d730dd328cc130c3599478530f64489be7f","node-v16.8.0-headers.tar.xz":"c24263b3f90bc490fba030a7836485b3df0351c8b68c7a83011dd01ed45d95be","node-v16.8.0-linux-arm64.tar.gz":"3f8cbdd3165fb9bf499f0e35bbd2ae4b301f2af5e9f349f82beacdb7278539bb","node-v16.8.0-linux-arm64.tar.xz":"4d08cda750e42e691d18881b4a443de4c19e0e2c1195e56a15a3ec45aeed895c","node-v16.8.0-linux-armv7l.tar.gz":"7d325b9b8f189c4b59196df933fcb5a8009684f9073977f00a75dc66924fb03d","node-v16.8.0-linux-armv7l.tar.xz":"86b4d718aa0003e895b845db86851720a9f9ce3e66f031324bfeebd63e4b922f","node-v16.8.0-linux-ppc64le.tar.gz":"437d5de90cb77837d5fc0faae08c3aaa17dbad0309341c5a1934db994196e9c9","node-v16.8.0-linux-ppc64le.tar.xz":"eb0a02f5c7b4c2187d034a536ad42311283ac91d761af9d69bd46f2ecbe5abbe","node-v16.8.0-linux-s390x.tar.gz":"45a1784f04b7ff6aee9d15badc8d559ade43c413949592d4d7b7cf727dc9b957","node-v16.8.0-linux-s390x.tar.xz":"cefc32542c3521bbd075b218bd2f7444589a537e6c82ff6b64f46765efb07392","node-v16.8.0-linux-x64.tar.gz":"aa1f366b522a9565332096fdc32ed0cd58a2049c0875d839703d3fe58b4c226d","node-v16.8.0-linux-x64.tar.xz":"85880c0e63c254faa75f8cf6512bc353f1587ba6e65a5e1d7366bf684684ae74","node-v16.8.0.pkg":"b91e3e368e681cb6e91e01c379382b0921f2d585f2444c7196fdf68d5688547f","node-v16.8.0.tar.gz":"0cc13572bc7c5a9bf7a2c5cb2800ff045780e43d0fa6e3eb0f1be46b4bf9a1c6","node-v16.8.0.tar.xz":"b8790226312970ba5d8fd98229380c48bf0366eb1a3633091e350a34a4b46392","node-v16.8.0-win-x64.7z":"11032b8841444015f01f56370580e1f14eab997bf4d497a249f719caa4418e52","node-v16.8.0-win-x64.zip":"16193b45e18c116ddd062cc1a7ac5d96de9cb2198d4334f345d5718ea6d603f7","node-v16.8.0-win-x86.7z":"d2aa238864ae9adb0f3e565ab89021e713bcb5911dbaa4046a59307400d5bbb5","node-v16.8.0-win-x86.zip":"d3322f8f1174a92ca72900ae7a189a40b3a402ba7781a00ec1996ff346bdccc8","node-v16.8.0-x64.msi":"fe18c039bfcca609e2601c10c26fddd335794c1c3065e80e58985e744bb6ffe5","node-v16.8.0-x86.msi":"6a2868f3f4df8b0f4d060ae1f305f27d499248c0b260759c058d27d6c90ba66b","win-x64/node.exe":"17031318847f432785f33f2ed9db6328d3ad4ce15602ece56c8077cf6eaca45d","win-x64/node.lib":"33b4ae0ab35e7180d8d1b5c2f47da889f9edc75617a42cacf249a4c1ac7635b1","win-x64/node_pdb.7z":"54ad71ddc4cfd97c0319874cc8a2656a35db0cff7b5a45ebe5b970fb0110248b","win-x64/node_pdb.zip":"0c30e3b24e8096e8a45331186ff1b6729a65f9693bb6409627fb03436765fb9f","win-x86/node.exe":"86daf79b0e3090153d8985ec5eb200eb213da34280eac88ebe7df05cb8ea0c45","win-x86/node.lib":"407a64a2b21512f6cd8ec1a98c2a8228475d3de02352a191b98bdedb738f3193","win-x86/node_pdb.7z":"1b2f4e1cb25aae99d48443635778a5793d19b8cb9d868a265c532bedf788e950","win-x86/node_pdb.zip":"f58094285001c98e62fa231a0885ec3d3bc0e4407130c41f70682159f12dd2f4"}
  648. 10:24:44 AM: npm ERR! gyp verb download contents checksum {"node-v16.8.0-headers.tar.gz":"fa04f9a4fd9126fe2c0bf43e3d464d730dd328cc130c3599478530f64489be7f"}
  649. 10:24:44 AM: npm ERR! gyp verb validating download checksum for node-v16.8.0-headers.tar.gz (fa04f9a4fd9126fe2c0bf43e3d464d730dd328cc130c3599478530f64489be7f == fa04f9a4fd9126fe2c0bf43e3d464d730dd328cc130c3599478530f64489be7f)
  650. 10:24:44 AM: npm ERR! gyp verb get node dir target node version installed: 16.8.0
  651. 10:24:44 AM: npm ERR! gyp verb build dir attempting to create "build" dir: /opt/build/repo/node_modules/node-sass/build
  652. 10:24:44 AM: npm ERR! gyp verb build dir "build" dir needed to be created? /opt/build/repo/node_modules/node-sass/build
  653. 10:24:44 AM: npm ERR! gyp verb build/config.gypi creating config file
  654. 10:24:44 AM: npm ERR! gyp verb build/config.gypi writing out config file: /opt/build/repo/node_modules/node-sass/build/config.gypi
  655. 10:24:44 AM: npm ERR! (node:1422) [DEP0150] DeprecationWarning: Setting process.config is deprecated. In the future the property will be read-only.
  656. 10:24:44 AM: npm ERR! (Use `node --trace-deprecation ...` to show where the warning was created)
  657. 10:24:44 AM: npm ERR! gyp verb config.gypi checking for gypi file: /opt/build/repo/node_modules/node-sass/config.gypi
  658. 10:24:44 AM: npm ERR! gyp verb common.gypi checking for gypi file: /opt/build/repo/node_modules/node-sass/common.gypi
  659. 10:24:44 AM: npm ERR! gyp verb gyp gyp format was not specified; forcing "make"
  660. 10:24:44 AM: npm ERR! gyp info spawn /opt/buildhome/python2.7/bin/python2
  661. 10:24:44 AM: npm ERR! gyp info spawn args [
  662. 10:24:44 AM: npm ERR! gyp info spawn args '/opt/build/repo/node_modules/node-gyp/gyp/gyp_main.py',
  663. 10:24:44 AM: npm ERR! gyp info spawn args 'binding.gyp',
  664. 10:24:44 AM: npm ERR! gyp info spawn args '-f',
  665. 10:24:44 AM: npm ERR! gyp info spawn args 'make',
  666. 10:24:44 AM: npm ERR! gyp info spawn args '-I',
  667. 10:24:44 AM: npm ERR! gyp info spawn args '/opt/build/repo/node_modules/node-sass/build/config.gypi',
  668. 10:24:44 AM: npm ERR! gyp info spawn args '-I',
  669. 10:24:44 AM: npm ERR! gyp info spawn args '/opt/build/repo/node_modules/node-gyp/addon.gypi',
  670. 10:24:44 AM: npm ERR! gyp info spawn args '-I',
  671. 10:24:44 AM: npm ERR! gyp info spawn args '/opt/buildhome/.node-gyp/16.8.0/include/node/common.gypi',
  672. 10:24:44 AM: npm ERR! gyp info spawn args '-Dlibrary=shared_library',
  673. 10:24:44 AM: npm ERR! gyp info spawn args '-Dvisibility=default',
  674. 10:24:44 AM: npm ERR! gyp info spawn args '-Dnode_root_dir=/opt/buildhome/.node-gyp/16.8.0',
  675. 10:24:44 AM: npm ERR! gyp info spawn args '-Dnode_gyp_dir=/opt/build/repo/node_modules/node-gyp',
  676. 10:24:44 AM: npm ERR! gyp info spawn args '-Dnode_lib_file=/opt/buildhome/.node-gyp/16.8.0/<(target_arch)/node.lib',
  677. 10:24:44 AM: npm ERR! gyp info spawn args '-Dmodule_root_dir=/opt/build/repo/node_modules/node-sass',
  678. 10:24:44 AM: npm ERR! gyp info spawn args '-Dnode_engine=v8',
  679. 10:24:44 AM: npm ERR! gyp info spawn args '--depth=.',
  680. 10:24:44 AM: npm ERR! gyp info spawn args '--no-parallel',
  681. 10:24:44 AM: npm ERR! gyp info spawn args '--generator-output',
  682. 10:24:44 AM: npm ERR! gyp info spawn args 'build',
  683. 10:24:44 AM: npm ERR! gyp info spawn args '-Goutput_dir=.'
  684. 10:24:44 AM: npm ERR! gyp info spawn args ]
  685. 10:24:44 AM: npm ERR! gyp verb command build []
  686. 10:24:44 AM: npm ERR! gyp verb build type Release
  687. 10:24:44 AM: npm ERR! gyp verb architecture x64
  688. 10:24:44 AM: npm ERR! gyp verb node dev dir /opt/buildhome/.node-gyp/16.8.0
  689. 10:24:44 AM: npm ERR! gyp verb `which` succeeded for `make` /usr/bin/make
  690. 10:24:44 AM: npm ERR! gyp info spawn make
  691. 10:24:44 AM: npm ERR! gyp info spawn args [ 'V=1', 'BUILDTYPE=Release', '-C', 'build' ]
  692. 10:24:44 AM: npm ERR! ../src/libsass/src/cencode.c: In function ‘base64_encode_block’:
  693. 10:24:44 AM: npm ERR! ../src/libsass/src/cencode.c:48:11: warning: this statement may fall through [-Wimplicit-fallthrough=]
  694. 10:24:44 AM: npm ERR! 48 | result = (fragment & 0x003) << 4;
  695. 10:24:44 AM: npm ERR! | ~~~~~~~^~~~~~~~~~~~~~~~~~~~~~~~~
  696. 10:24:44 AM: npm ERR! ../src/libsass/src/cencode.c:52:2: note: here
  697. 10:24:44 AM: npm ERR! 52 | case step_B:
  698. 10:24:44 AM: npm ERR! | ^~~~
  699. 10:24:44 AM: npm ERR! ../src/libsass/src/cencode.c:62:11: warning: this statement may fall through [-Wimplicit-fallthrough=]
  700. 10:24:44 AM: npm ERR! 62 | result = (fragment & 0x00f) << 2;
  701. 10:24:44 AM: npm ERR! | ~~~~~~~^~~~~~~~~~~~~~~~~~~~~~~~~
  702. 10:24:44 AM: npm ERR! ../src/libsass/src/cencode.c:66:2: note: here
  703. 10:24:44 AM: npm ERR! 66 | case step_C:
  704. 10:24:44 AM: npm ERR! | ^~~~
  705. 10:24:44 AM: npm ERR! ../src/libsass/src/functions.cpp: In function ‘void Sass::Functions::handle_utf8_error(const Sass::ParserState&, Sass::Backtraces)’:
  706. 10:24:44 AM: npm ERR! ../src/libsass/src/functions.cpp:110:20: warning: catching polymorphic type ‘class utf8::invalid_code_point’ by value [-Wcatch-value=]
  707. 10:24:44 AM: npm ERR! 110 | catch (utf8::invalid_code_point) {
  708. 10:24:44 AM: npm ERR! | ^~~~~~~~~~~~~~~~~~
  709. 10:24:44 AM: npm ERR! ../src/libsass/src/functions.cpp:114:20: warning: catching polymorphic type ‘class utf8::not_enough_room’ by value [-Wcatch-value=]
  710. 10:24:44 AM: npm ERR! 114 | catch (utf8::not_enough_room) {
  711. 10:24:44 AM: npm ERR! | ^~~~~~~~~~~~~~~
  712. 10:24:44 AM: npm ERR! ../src/libsass/src/functions.cpp:118:20: warning: catching polymorphic type ‘class utf8::invalid_utf8’ by value [-Wcatch-value=]
  713. 10:24:44 AM: npm ERR! 118 | catch (utf8::invalid_utf8) {
  714. 10:24:44 AM: npm ERR! | ^~~~~~~~~~~~
  715. 10:24:44 AM: npm ERR! ../src/libsass/src/json.cpp: In function ‘char* json_encode_string(const char*)’:
  716. 10:24:44 AM: npm ERR! ../src/libsass/src/json.cpp:405:15: warning: catching polymorphic type ‘class std::exception’ by value [-Wcatch-value=]
  717. 10:24:44 AM: npm ERR! 405 | catch (std::exception) {
  718. 10:24:44 AM: npm ERR! | ^~~~~~~~~
  719. 10:24:44 AM: npm ERR! ../src/libsass/src/json.cpp: In function ‘char* json_stringify(const JsonNode*, const char*)’:
  720. 10:24:44 AM: npm ERR! ../src/libsass/src/json.cpp:424:15: warning: catching polymorphic type ‘class std::exception’ by value [-Wcatch-value=]
  721. 10:24:44 AM: npm ERR! 424 | catch (std::exception) {
  722. 10:24:44 AM: npm ERR! | ^~~~~~~~~
  723. 10:24:44 AM: npm ERR! In file included from /opt/buildhome/.node-gyp/16.8.0/include/node/v8.h:30,
  724. 10:24:44 AM: npm ERR! from /opt/buildhome/.node-gyp/16.8.0/include/node/node.h:63,
  725. 10:24:44 AM: npm ERR! from ../../nan/nan.h:56,
  726. 10:24:44 AM: npm ERR! from ../src/binding.cpp:1:
  727. 10:24:44 AM: npm ERR! /opt/buildhome/.node-gyp/16.8.0/include/node/v8-internal.h: In function ‘void v8::internal::PerformCastCheck(T*)’:
  728. 10:24:44 AM: npm ERR! /opt/buildhome/.node-gyp/16.8.0/include/node/v8-internal.h:488:38: error: ‘remove_cv_t’ is not a member of ‘std’; did you mean ‘remove_cv’?
  729. 10:24:44 AM: npm ERR! 488 | !std::is_same<Data, std::remove_cv_t<T>>::value>::Perform(data);
  730. 10:24:44 AM: npm ERR! | ^~~~~~~~~~~
  731. 10:24:44 AM: npm ERR! | remove_cv
  732. 10:24:44 AM: npm ERR! /opt/buildhome/.node-gyp/16.8.0/include/node/v8-internal.h:488:38: error: ‘remove_cv_t’ is not a member of ‘std’; did you mean ‘remove_cv’?
  733. 10:24:44 AM: npm ERR! 488 | !std::is_same<Data, std::remove_cv_t<T>>::value>::Perform(data);
  734. 10:24:44 AM: npm ERR! | ^~~~~~~~~~~
  735. 10:24:44 AM: npm ERR! | remove_cv
  736. 10:24:44 AM: npm ERR! /opt/buildhome/.node-gyp/16.8.0/include/node/v8-internal.h:488:50: error: template argument 2 is invalid
  737. 10:24:44 AM: npm ERR! 488 | !std::is_same<Data, std::remove_cv_t<T>>::value>::Perform(data);
  738. 10:24:44 AM: npm ERR! | ^
  739. 10:24:44 AM: npm ERR! /opt/buildhome/.node-gyp/16.8.0/include/node/v8-internal.h:488:63: error: ‘::Perform’ has not been declared
  740. 10:24:44 AM: npm ERR! 488 | !std::is_same<Data, std::remove_cv_t<T>>::value>::Perform(data);
  741. 10:24:44 AM: npm ERR! | ^~~~~~~
  742. 10:24:44 AM: npm ERR! In file included from ../src/binding.cpp:1:
  743. 10:24:44 AM: npm ERR! ../../nan/nan.h: In function ‘void Nan::AsyncQueueWorker(Nan::AsyncWorker*)’:
  744. 10:24:44 AM: npm ERR! ../../nan/nan.h:2294:62: warning: cast between incompatible function types from ‘void (*)(uv_work_t*)’ {aka ‘void (*)(uv_work_s*)’} to ‘uv_after_work_cb’ {aka ‘void (*)(uv_work_s*, int)’} [-Wcast-function-type]
  745. 10:24:44 AM: npm ERR! 2294 | , reinterpret_cast<uv_after_work_cb>(AsyncExecuteComplete)
  746. 10:24:44 AM: npm ERR! | ^
  747. 10:24:44 AM: npm ERR! ../src/binding.cpp: In function ‘Nan::NAN_METHOD_RETURN_TYPE render(Nan::NAN_METHOD_ARGS_TYPE)’:
  748. 10:24:44 AM: npm ERR! ../src/binding.cpp:284:98: warning: cast between incompatible function types from ‘void (*)(uv_work_t*)’ {aka ‘void (*)(uv_work_s*)’} to ‘uv_after_work_cb’ {aka ‘void (*)(uv_work_s*, int)’} [-Wcast-function-type]
  749. 10:24:44 AM: npm ERR! 284 | int status = uv_queue_work(uv_default_loop(), &ctx_w->request, compile_it, (uv_after_work_cb)MakeCallback);
  750. 10:24:44 AM: npm ERR! | ^~~~~~~~~~~~
  751. 10:24:44 AM: npm ERR! ../src/binding.cpp: In function ‘Nan::NAN_METHOD_RETURN_TYPE render_file(Nan::NAN_METHOD_ARGS_TYPE)’:
  752. 10:24:44 AM: npm ERR! ../src/binding.cpp:320:98: warning: cast between incompatible function types from ‘void (*)(uv_work_t*)’ {aka ‘void (*)(uv_work_s*)’} to ‘uv_after_work_cb’ {aka ‘void (*)(uv_work_s*, int)’} [-Wcast-function-type]
  753. 10:24:44 AM: npm ERR! 320 | int status = uv_queue_work(uv_default_loop(), &ctx_w->request, compile_it, (uv_after_work_cb)MakeCallback);
  754. 10:24:44 AM: npm ERR! | ^~~~~~~~~~~~
  755. 10:24:44 AM: npm ERR! In file included from ../../nan/nan.h:56,
  756. 10:24:44 AM: npm ERR! from ../src/binding.cpp:1:
  757. 10:24:44 AM: npm ERR! ../src/binding.cpp: At global scope:
  758. 10:24:44 AM: npm ERR! /opt/buildhome/.node-gyp/16.8.0/include/node/node.h:810:43: warning: cast between incompatible function types from ‘void (*)(Nan::ADDON_REGISTER_FUNCTION_ARGS_TYPE)’ {aka ‘void (*)(v8::Local<v8::Object>)’} to ‘node::addon_register_func’ {aka ‘void (*)(v8::Local<v8::Object>, v8::Local<v8::Value>, void*)’} [-Wcast-function-type]
  759. 10:24:44 AM: npm ERR! 810 | (node::addon_register_func) (regfunc), \
  760. 10:24:44 AM: npm ERR! | ^
  761. 10:24:44 AM: npm ERR! /opt/buildhome/.node-gyp/16.8.0/include/node/node.h:844:3: note: in expansion of macro ‘NODE_MODULE_X’
  762. 10:24:44 AM: npm ERR! 844 | NODE_MODULE_X(modname, regfunc, NULL, 0) // NOLINT (readability/null_usage)
  763. 10:24:44 AM: npm ERR! | ^~~~~~~~~~~~~
  764. 10:24:44 AM: npm ERR! ../src/binding.cpp:358:1: note: in expansion of macro ‘NODE_MODULE’
  765. 10:24:44 AM: npm ERR! 358 | NODE_MODULE(binding, RegisterModule);
  766. 10:24:44 AM: npm ERR! | ^~~~~~~~~~~
  767. 10:24:44 AM: npm ERR! make: *** [binding.target.mk:133: Release/obj.target/binding/src/binding.o] Error 1
  768. 10:24:44 AM: npm ERR! gyp ERR! build error
  769. 10:24:44 AM: npm ERR! gyp ERR! stack Error: `make` failed with exit code: 2
  770. 10:24:44 AM: npm ERR! gyp ERR! stack at ChildProcess.onExit (/opt/build/repo/node_modules/node-gyp/lib/build.js:262:23)
  771. 10:24:44 AM: npm ERR! gyp ERR! stack at ChildProcess.emit (node:events:394:28)
  772. 10:24:44 AM: npm ERR! gyp ERR! stack at Process.ChildProcess._handle.onexit (node:internal/child_process:290:12)
  773. 10:24:44 AM: npm ERR! gyp ERR! System Linux 4.19.167+
  774. 10:24:44 AM: npm ERR! gyp ERR! command "/opt/buildhome/.nvm/versions/node/v16.8.0/bin/node" "/opt/build/repo/node_modules/node-gyp/bin/node-gyp.js" "rebuild" "--verbose" "--libsass_ext=" "--libsass_cflags=" "--libsass_ldflags=" "--libsass_library="
  775. 10:24:44 AM: npm ERR! gyp ERR! cwd /opt/build/repo/node_modules/node-sass
  776. 10:24:44 AM: npm ERR! gyp ERR! node -v v16.8.0
  777. 10:24:44 AM: npm ERR! gyp ERR! node-gyp -v v3.8.0
  778. 10:24:44 AM: npm ERR! gyp ERR! not ok
  779. 10:24:44 AM: npm ERR! Build failed with error code: 1
  780. 10:24:44 AM: npm ERR! A complete log of this run can be found in:
  781. 10:24:44 AM: npm ERR! /opt/buildhome/.npm/_logs/2021-09-07T08_24_44_218Z-debug.log
  782. 10:24:44 AM: Error during NPM install
  783. 10:24:44 AM: Build was terminated: Build script returned non-zero exit code: 1
  784. 10:24:44 AM: Failing build: Failed to build site
  785. 10:24:44 AM: Finished processing build request in 3m17.247999504s
RAW Paste Data