SHARE
TWEET

Untitled

a guest Jul 7th, 2010 68 Never
Not a member of Pastebin yet? Sign Up, it unlocks many cool features!
  1. [300062-bad-pattern-error-part-1]% gunzip -c ~/Desktop/downloads/pqm-stdout.gz| subunit-filter --no-skip |  subunit2pyunit                  
  2.  
  3. Executing star-merge http://bazaar.launchpad.net/~parthm/bzr/300062-bad-pattern-error-part-1 at Thu Jul  8 03:40:09 2010
  4. Merge successful.
  5. Executing pre-commit hook /home/pqm/bin/kill-chroot-processes.sh /srv/pqm.ubuntu.com/chroot-amd64 && /home/pqm/bin/dchroot-run LANG=en_GB.utf8 make check PYTHON=python2.4 at Thu Jul  8 03:40:14 2010
  6. Scanning for processes to kill in chroot /srv/pqm.ubuntu.com/chroot-amd64
  7. removed directory: `/srv/pqm.ubuntu.com/chroot-amd64/tmp/bzr-diff-nt_oeh'
  8. removed directory: `/srv/pqm.ubuntu.com/chroot-amd64/tmp/bzr-diff--Xfcjb'
  9. python2.4 tools/rst2html.py --link-stylesheet --footnote-references=superscript --halt=warning --stylesheet=../../default.css doc/en/tutorials/tutorial.txt doc/en/tutorials/tutorial.html
  10. python2.4 tools/rst2html.py --link-stylesheet --footnote-references=superscript --halt=warning --stylesheet=../../default.css doc/en/tutorials/using_bazaar_with_launchpad.txt doc/en/tutorials/using_bazaar_with_launchpad.html
  11. python2.4 tools/rst2html.py --link-stylesheet --footnote-references=superscript --halt=warning --stylesheet=../../default.css doc/en/tutorials/centralized_workflow.txt doc/en/tutorials/centralized_workflow.html
  12. python2.4 tools/rst2html.py --link-stylesheet --footnote-references=superscript --halt=warning --stylesheet=../../default.css doc/ru/tutorials/centralized_workflow.txt doc/ru/tutorials/centralized_workflow.html
  13. python2.4 tools/rst2html.py --link-stylesheet --footnote-references=superscript --halt=warning --stylesheet=../../default.css doc/ru/tutorials/tutorial.txt doc/ru/tutorials/tutorial.html
  14. python2.4 tools/rst2html.py --link-stylesheet --footnote-references=superscript --halt=warning --stylesheet=../../default.css doc/ru/tutorials/using_bazaar_with_launchpad.txt doc/ru/tutorials/using_bazaar_with_launchpad.html
  15. python2.4 tools/rst2html.py --link-stylesheet --footnote-references=superscript --halt=warning --stylesheet=../../default.css doc/ja/tutorials/tutorial.txt doc/ja/tutorials/tutorial.html
  16. python2.4 tools/rst2html.py --link-stylesheet --footnote-references=superscript --halt=warning --stylesheet=../../default.css doc/ja/tutorials/using_bazaar_with_launchpad.txt doc/ja/tutorials/using_bazaar_with_launchpad.html
  17. python2.4 tools/rst2html.py --link-stylesheet --footnote-references=superscript --halt=warning --stylesheet=../../default.css doc/ja/tutorials/centralized_workflow.txt doc/ja/tutorials/centralized_workflow.html
  18. python2.4 tools/rst2html.py --link-stylesheet --footnote-references=superscript --halt=warning --stylesheet=../../default.css doc/en/mini-tutorial/index.txt doc/en/mini-tutorial/index.html
  19. python2.4 tools/rst2html.py --link-stylesheet --footnote-references=superscript --halt=warning --stylesheet=../../default.css doc/es/mini-tutorial/index.txt doc/es/mini-tutorial/index.html
  20. python2.4 tools/rst2html.py --link-stylesheet --footnote-references=superscript --halt=warning --stylesheet=../../default.css doc/ja/mini-tutorial/index.txt doc/ja/mini-tutorial/index.html
  21. python2.4 tools/rst2html.py --link-stylesheet --footnote-references=superscript --halt=warning --stylesheet=../../default.css doc/ru/mini-tutorial/index.txt doc/ru/mini-tutorial/index.html
  22. python2.4 tools/rst2html.py --link-stylesheet --footnote-references=superscript --halt=warning --stylesheet=../../default.css doc/en/user-guide/index-plain.txt doc/en/user-guide/index-plain.html
  23. python2.4 tools/rst2html.py --link-stylesheet --footnote-references=superscript --halt=warning --stylesheet=../../default.css doc/es/user-guide/index-plain.txt doc/es/user-guide/index-plain.html
  24. python2.4 tools/rst2html.py --link-stylesheet --footnote-references=superscript --halt=warning --stylesheet=../../default.css doc/ru/user-guide/index-plain.txt doc/ru/user-guide/index-plain.html
  25. python2.4 tools/rst2html.py --link-stylesheet --footnote-references=superscript --halt=warning --stylesheet=../../default.css doc/en/admin-guide/index-plain.txt doc/en/admin-guide/index-plain.html
  26. python2.4 -c "import shutil; shutil.copyfile('NEWS', 'doc/en/release-notes/NEWS.txt')"
  27. python2.4 tools/rst2html.py --link-stylesheet --footnote-references=superscript --halt=warning --stylesheet=../../default.css doc/en/release-notes/NEWS.txt doc/en/release-notes/NEWS.html
  28. python2.4 tools/rst2html.py --link-stylesheet --footnote-references=superscript --halt=warning --stylesheet=../../default.css doc/en/upgrade-guide/index.txt doc/en/upgrade-guide/index.html
  29. python2.4 tools/rst2html.py --link-stylesheet --footnote-references=superscript --halt=warning --stylesheet=default.css doc/index.txt doc/index.html
  30. python2.4 tools/rst2html.py --link-stylesheet --footnote-references=superscript --halt=warning --stylesheet=default.css doc/index.es.txt doc/index.es.html
  31. python2.4 tools/rst2html.py --link-stylesheet --footnote-references=superscript --halt=warning --stylesheet=default.css doc/index.ja.txt doc/index.ja.html
  32. python2.4 tools/rst2html.py --link-stylesheet --footnote-references=superscript --halt=warning --stylesheet=default.css doc/index.ru.txt doc/index.ru.html
  33. python2.4 tools/rst2html.py --link-stylesheet --footnote-references=superscript --halt=warning --stylesheet=../default.css doc/developers/api-versioning.txt doc/developers/api-versioning.html
  34. python2.4 tools/rst2html.py --link-stylesheet --footnote-references=superscript --halt=warning --stylesheet=../default.css doc/developers/apport.txt doc/developers/apport.html
  35. python2.4 tools/rst2html.py --link-stylesheet --footnote-references=superscript --halt=warning --stylesheet=../default.css doc/developers/authentication-ring.txt doc/developers/authentication-ring.html
  36. python2.4 tools/rst2html.py --link-stylesheet --footnote-references=superscript --halt=warning --stylesheet=../default.css doc/developers/btree_index_prefetch.txt doc/developers/btree_index_prefetch.html
  37. python2.4 tools/rst2html.py --link-stylesheet --footnote-references=superscript --halt=warning --stylesheet=../default.css doc/developers/bug-handling.txt doc/developers/bug-handling.html
  38. python2.4 tools/rst2html.py --link-stylesheet --footnote-references=superscript --halt=warning --stylesheet=../default.css doc/developers/bundle-format4.txt doc/developers/bundle-format4.html
  39. python2.4 tools/rst2html.py --link-stylesheet --footnote-references=superscript --halt=warning --stylesheet=../default.css doc/developers/bundles.txt doc/developers/bundles.html
  40. python2.4 tools/rst2html.py --link-stylesheet --footnote-references=superscript --halt=warning --stylesheet=../default.css doc/developers/case-insensitive-file-systems.txt doc/developers/case-insensitive-file-systems.html
  41. python2.4 tools/rst2html.py --link-stylesheet --footnote-references=superscript --halt=warning --stylesheet=../default.css doc/developers/check.txt doc/developers/check.html
  42. python2.4 tools/rst2html.py --link-stylesheet --footnote-references=superscript --halt=warning --stylesheet=../default.css doc/developers/code-review.txt doc/developers/code-review.html
  43. python2.4 tools/rst2html.py --link-stylesheet --footnote-references=superscript --halt=warning --stylesheet=../default.css doc/developers/code-style.txt doc/developers/code-style.html
  44. python2.4 tools/rst2html.py --link-stylesheet --footnote-references=superscript --halt=warning --stylesheet=../default.css doc/developers/colocated-branches.txt doc/developers/colocated-branches.html
  45. python2.4 tools/rst2html.py --link-stylesheet --footnote-references=superscript --halt=warning --stylesheet=../default.css doc/developers/container-format.txt doc/developers/container-format.html
  46. python2.4 tools/rst2html.py --link-stylesheet --footnote-references=superscript --halt=warning --stylesheet=../default.css doc/developers/content-filtering.txt doc/developers/content-filtering.html
  47. python2.4 tools/rst2html.py --link-stylesheet --footnote-references=superscript --halt=warning --stylesheet=../default.css doc/developers/contribution-quickstart.txt doc/developers/contribution-quickstart.html
  48. python2.4 tools/rst2html.py --link-stylesheet --footnote-references=superscript --halt=warning --stylesheet=../default.css doc/developers/cycle.txt doc/developers/cycle.html
  49. python2.4 tools/rst2html.py --link-stylesheet --footnote-references=superscript --halt=warning --stylesheet=../default.css doc/developers/development-repo.txt doc/developers/development-repo.html
  50. python2.4 tools/rst2html.py --link-stylesheet --footnote-references=superscript --halt=warning --stylesheet=../default.css doc/developers/dirstate.txt doc/developers/dirstate.html
  51. python2.4 tools/rst2html.py --link-stylesheet --footnote-references=superscript --halt=warning --stylesheet=../default.css doc/developers/ec2.txt doc/developers/ec2.html
  52. python2.4 tools/rst2html.py --link-stylesheet --footnote-references=superscript --halt=warning --stylesheet=../default.css doc/developers/groupcompress-design.txt doc/developers/groupcompress-design.html
  53. python2.4 tools/rst2html.py --link-stylesheet --footnote-references=superscript --halt=warning --stylesheet=../default.css doc/developers/HACKING.txt doc/developers/HACKING.html
  54. python2.4 tools/rst2html.py --link-stylesheet --footnote-references=superscript --halt=warning --stylesheet=../default.css doc/developers/improved_chk_index.txt doc/developers/improved_chk_index.html
  55. python2.4 tools/rst2html.py --link-stylesheet --footnote-references=superscript --halt=warning --stylesheet=../default.css doc/developers/index-plain.txt doc/developers/index-plain.html
  56. python2.4 tools/rst2html.py --link-stylesheet --footnote-references=superscript --halt=warning --stylesheet=../default.css doc/developers/indices.txt doc/developers/indices.html
  57. python2.4 tools/rst2html.py --link-stylesheet --footnote-references=superscript --halt=warning --stylesheet=../default.css doc/developers/integration.txt doc/developers/integration.html
  58. python2.4 tools/rst2html.py --link-stylesheet --footnote-references=superscript --halt=warning --stylesheet=../default.css doc/developers/inventory.txt doc/developers/inventory.html
  59. python2.4 tools/rst2html.py --link-stylesheet --footnote-references=superscript --halt=warning --stylesheet=../default.css doc/developers/last-modified.txt doc/developers/last-modified.html
  60. python2.4 tools/rst2html.py --link-stylesheet --footnote-references=superscript --halt=warning --stylesheet=../default.css doc/developers/lca-merge.txt doc/developers/lca-merge.html
  61. python2.4 tools/rst2html.py --link-stylesheet --footnote-references=superscript --halt=warning --stylesheet=../default.css doc/developers/lca_tree_merging.txt doc/developers/lca_tree_merging.html
  62. python2.4 tools/rst2html.py --link-stylesheet --footnote-references=superscript --halt=warning --stylesheet=../default.css doc/developers/network-protocol.txt doc/developers/network-protocol.html
  63. python2.4 tools/rst2html.py --link-stylesheet --footnote-references=superscript --halt=warning --stylesheet=../default.css doc/developers/overview.txt doc/developers/overview.html
  64. python2.4 tools/rst2html.py --link-stylesheet --footnote-references=superscript --halt=warning --stylesheet=../default.css doc/developers/packrepo.txt doc/developers/packrepo.html
  65. python2.4 tools/rst2html.py --link-stylesheet --footnote-references=superscript --halt=warning --stylesheet=../default.css doc/developers/performance-roadmap.txt doc/developers/performance-roadmap.html
  66. python2.4 tools/rst2html.py --link-stylesheet --footnote-references=superscript --halt=warning --stylesheet=../default.css doc/developers/plugin-api.txt doc/developers/plugin-api.html
  67. python2.4 tools/rst2html.py --link-stylesheet --footnote-references=superscript --halt=warning --stylesheet=../default.css doc/developers/ppa.txt doc/developers/ppa.html
  68. python2.4 tools/rst2html.py --link-stylesheet --footnote-references=superscript --halt=warning --stylesheet=../default.css doc/developers/principles.txt doc/developers/principles.html
  69. python2.4 tools/rst2html.py --link-stylesheet --footnote-references=superscript --halt=warning --stylesheet=../default.css doc/developers/profiling.txt doc/developers/profiling.html
  70. python2.4 tools/rst2html.py --link-stylesheet --footnote-references=superscript --halt=warning --stylesheet=../default.css doc/developers/releasing.txt doc/developers/releasing.html
  71. python2.4 tools/rst2html.py --link-stylesheet --footnote-references=superscript --halt=warning --stylesheet=../default.css doc/developers/repository-stream.txt doc/developers/repository-stream.html
  72. python2.4 tools/rst2html.py --link-stylesheet --footnote-references=superscript --halt=warning --stylesheet=../default.css doc/developers/repository.txt doc/developers/repository.html
  73. python2.4 tools/rst2html.py --link-stylesheet --footnote-references=superscript --halt=warning --stylesheet=../default.css doc/developers/revision-properties.txt doc/developers/revision-properties.html
  74. python2.4 tools/rst2html.py --link-stylesheet --footnote-references=superscript --halt=warning --stylesheet=../default.css doc/developers/testing.txt doc/developers/testing.html
  75. python2.4 tools/rst2html.py --link-stylesheet --footnote-references=superscript --halt=warning --stylesheet=../default.css doc/developers/tortoise-strategy.txt doc/developers/tortoise-strategy.html
  76. python2.4 tools/rst2html.py --link-stylesheet --footnote-references=superscript --halt=warning --stylesheet=../default.css doc/developers/update.txt doc/developers/update.html
  77. python2.4 tools/rst2html.py --link-stylesheet --footnote-references=superscript --halt=warning --stylesheet=../default.css doc/developers/win32_build_setup.txt doc/developers/win32_build_setup.html
  78. python2.4 tools/generate_docs.py -o man1/bzr.1 man
  79. building extension modules.
  80. python2.4 setup.py build_ext -i
  81. running build_ext
  82. pyrexc bzrlib/_annotator_pyx.pyx --> bzrlib/_annotator_pyx.c
  83. building 'bzrlib._annotator_pyx' extension
  84. creating build
  85. creating build/temp.linux-x86_64-2.4
  86. creating build/temp.linux-x86_64-2.4/bzrlib
  87. gcc -pthread -fno-strict-aliasing -DNDEBUG -g -fwrapv -O2 -Wall -Wstrict-prototypes -fPIC -I/usr/include/python2.4 -c bzrlib/_annotator_pyx.c -o build/temp.linux-x86_64-2.4/bzrlib/_annotator_pyx.o
  88. gcc -pthread -shared build/temp.linux-x86_64-2.4/bzrlib/_annotator_pyx.o -o bzrlib/_annotator_pyx.so
  89. pyrexc bzrlib/_bencode_pyx.pyx --> bzrlib/_bencode_pyx.c
  90. building 'bzrlib._bencode_pyx' extension
  91. gcc -pthread -fno-strict-aliasing -DNDEBUG -g -fwrapv -O2 -Wall -Wstrict-prototypes -fPIC -I/usr/include/python2.4 -c bzrlib/_bencode_pyx.c -o build/temp.linux-x86_64-2.4/bzrlib/_bencode_pyx.o
  92. gcc -pthread -shared build/temp.linux-x86_64-2.4/bzrlib/_bencode_pyx.o -o bzrlib/_bencode_pyx.so
  93. pyrexc bzrlib/_chunks_to_lines_pyx.pyx --> bzrlib/_chunks_to_lines_pyx.c
  94. building 'bzrlib._chunks_to_lines_pyx' extension
  95. gcc -pthread -fno-strict-aliasing -DNDEBUG -g -fwrapv -O2 -Wall -Wstrict-prototypes -fPIC -I/usr/include/python2.4 -c bzrlib/_chunks_to_lines_pyx.c -o build/temp.linux-x86_64-2.4/bzrlib/_chunks_to_lines_pyx.o
  96. gcc -pthread -shared build/temp.linux-x86_64-2.4/bzrlib/_chunks_to_lines_pyx.o -o bzrlib/_chunks_to_lines_pyx.so
  97. pyrexc bzrlib/_groupcompress_pyx.pyx --> bzrlib/_groupcompress_pyx.c
  98. building 'bzrlib._groupcompress_pyx' extension
  99. gcc -pthread -fno-strict-aliasing -DNDEBUG -g -fwrapv -O2 -Wall -Wstrict-prototypes -fPIC -I/usr/include/python2.4 -c bzrlib/_groupcompress_pyx.c -o build/temp.linux-x86_64-2.4/bzrlib/_groupcompress_pyx.o
  100. gcc -pthread -fno-strict-aliasing -DNDEBUG -g -fwrapv -O2 -Wall -Wstrict-prototypes -fPIC -I/usr/include/python2.4 -c bzrlib/diff-delta.c -o build/temp.linux-x86_64-2.4/bzrlib/diff-delta.o
  101. gcc -pthread -shared build/temp.linux-x86_64-2.4/bzrlib/_groupcompress_pyx.o build/temp.linux-x86_64-2.4/bzrlib/diff-delta.o -o bzrlib/_groupcompress_pyx.so
  102. pyrexc bzrlib/_knit_load_data_pyx.pyx --> bzrlib/_knit_load_data_pyx.c
  103. building 'bzrlib._knit_load_data_pyx' extension
  104. gcc -pthread -fno-strict-aliasing -DNDEBUG -g -fwrapv -O2 -Wall -Wstrict-prototypes -fPIC -I/usr/include/python2.4 -c bzrlib/_knit_load_data_pyx.c -o build/temp.linux-x86_64-2.4/bzrlib/_knit_load_data_pyx.o
  105. gcc -pthread -shared build/temp.linux-x86_64-2.4/bzrlib/_knit_load_data_pyx.o -o bzrlib/_knit_load_data_pyx.so
  106. pyrexc bzrlib/_known_graph_pyx.pyx --> bzrlib/_known_graph_pyx.c
  107. building 'bzrlib._known_graph_pyx' extension
  108. gcc -pthread -fno-strict-aliasing -DNDEBUG -g -fwrapv -O2 -Wall -Wstrict-prototypes -fPIC -I/usr/include/python2.4 -c bzrlib/_known_graph_pyx.c -o build/temp.linux-x86_64-2.4/bzrlib/_known_graph_pyx.o
  109. gcc -pthread -shared build/temp.linux-x86_64-2.4/bzrlib/_known_graph_pyx.o -o bzrlib/_known_graph_pyx.so
  110. pyrexc bzrlib/_rio_pyx.pyx --> bzrlib/_rio_pyx.c
  111. building 'bzrlib._rio_pyx' extension
  112. gcc -pthread -fno-strict-aliasing -DNDEBUG -g -fwrapv -O2 -Wall -Wstrict-prototypes -fPIC -I/usr/include/python2.4 -c bzrlib/_rio_pyx.c -o build/temp.linux-x86_64-2.4/bzrlib/_rio_pyx.o
  113. gcc -pthread -shared build/temp.linux-x86_64-2.4/bzrlib/_rio_pyx.o -o bzrlib/_rio_pyx.so
  114. pyrexc bzrlib/_dirstate_helpers_pyx.pyx --> bzrlib/_dirstate_helpers_pyx.c
  115. building 'bzrlib._dirstate_helpers_pyx' extension
  116. gcc -pthread -fno-strict-aliasing -DNDEBUG -g -fwrapv -O2 -Wall -Wstrict-prototypes -fPIC -I/usr/include/python2.4 -c bzrlib/_dirstate_helpers_pyx.c -o build/temp.linux-x86_64-2.4/bzrlib/_dirstate_helpers_pyx.o
  117. gcc -pthread -shared build/temp.linux-x86_64-2.4/bzrlib/_dirstate_helpers_pyx.o -o bzrlib/_dirstate_helpers_pyx.so
  118. pyrexc bzrlib/_readdir_pyx.pyx --> bzrlib/_readdir_pyx.c
  119. building 'bzrlib._readdir_pyx' extension
  120. gcc -pthread -fno-strict-aliasing -DNDEBUG -g -fwrapv -O2 -Wall -Wstrict-prototypes -fPIC -I/usr/include/python2.4 -c bzrlib/_readdir_pyx.c -o build/temp.linux-x86_64-2.4/bzrlib/_readdir_pyx.o
  121. gcc -pthread -shared build/temp.linux-x86_64-2.4/bzrlib/_readdir_pyx.o -o bzrlib/_readdir_pyx.so
  122. pyrexc bzrlib/_chk_map_pyx.pyx --> bzrlib/_chk_map_pyx.c
  123. building 'bzrlib._chk_map_pyx' extension
  124. gcc -pthread -fno-strict-aliasing -DNDEBUG -g -fwrapv -O2 -Wall -Wstrict-prototypes -fPIC -I/usr/include/python2.4 -c bzrlib/_chk_map_pyx.c -o build/temp.linux-x86_64-2.4/bzrlib/_chk_map_pyx.o
  125. gcc -pthread -shared build/temp.linux-x86_64-2.4/bzrlib/_chk_map_pyx.o -o bzrlib/_chk_map_pyx.so
  126. building 'bzrlib._patiencediff_c' extension
  127. gcc -pthread -fno-strict-aliasing -DNDEBUG -g -fwrapv -O2 -Wall -Wstrict-prototypes -fPIC -I/usr/include/python2.4 -c bzrlib/_patiencediff_c.c -o build/temp.linux-x86_64-2.4/bzrlib/_patiencediff_c.o
  128. gcc -pthread -shared build/temp.linux-x86_64-2.4/bzrlib/_patiencediff_c.o -o bzrlib/_patiencediff_c.so
  129. pyrexc bzrlib/_simple_set_pyx.pyx --> bzrlib/_simple_set_pyx.c
  130. building 'bzrlib._simple_set_pyx' extension
  131. gcc -pthread -fno-strict-aliasing -DNDEBUG -g -fwrapv -O2 -Wall -Wstrict-prototypes -fPIC -I/usr/include/python2.4 -c bzrlib/_simple_set_pyx.c -o build/temp.linux-x86_64-2.4/bzrlib/_simple_set_pyx.o
  132. gcc -pthread -shared build/temp.linux-x86_64-2.4/bzrlib/_simple_set_pyx.o -o bzrlib/_simple_set_pyx.so
  133. building 'bzrlib._static_tuple_c' extension
  134. gcc -pthread -fno-strict-aliasing -DNDEBUG -g -fwrapv -O2 -Wall -Wstrict-prototypes -fPIC -I/usr/include/python2.4 -c bzrlib/_static_tuple_c.c -o build/temp.linux-x86_64-2.4/bzrlib/_static_tuple_c.o
  135. gcc -pthread -shared build/temp.linux-x86_64-2.4/bzrlib/_static_tuple_c.o -o bzrlib/_static_tuple_c.so
  136. pyrexc bzrlib/_btree_serializer_pyx.pyx --> bzrlib/_btree_serializer_pyx.c
  137. building 'bzrlib._btree_serializer_pyx' extension
  138. gcc -pthread -fno-strict-aliasing -DNDEBUG -g -fwrapv -O2 -Wall -Wstrict-prototypes -fPIC -I/usr/include/python2.4 -c bzrlib/_btree_serializer_pyx.c -o build/temp.linux-x86_64-2.4/bzrlib/_btree_serializer_pyx.o
  139. gcc -pthread -shared build/temp.linux-x86_64-2.4/bzrlib/_btree_serializer_pyx.o -o bzrlib/_btree_serializer_pyx.so
  140. # Generate a stream for PQM to watch.
  141. python2.4 -Werror -O ./bzr selftest --subunit  | tee selftest.log
  142. bzrlib.tests.blackbox.test_info.TestInfo.test_info_locking ... ok
  143. bzrlib.tests.blackbox.test_revert.TestRevert.test_revert_dirname ... ok
  144. bzrlib.tests.per_branch.test_sprout.TestSprout.test_sprout_stacked_hooks_get_stacked_branch(BzrBranchFormat4) ... ok
  145. bzrlib.tests.per_merger.TestMergeImplementation.test_merge_move_and_change(lca) ... ok
  146. bzrlib.tests.per_merger.TestMergeImplementation.test_modify_conflicts_with_delete(lca) ... ok
  147. bzrlib.tests.per_transport.TransportTests.test_symlink(SFTPTransport,SFTPAbsoluteServer) ... ok
  148. bzrlib.tests.per_transport.TransportTests.test_symlink(SFTPTransport,SFTPHomeDirServer) ... ok
  149. bzrlib.tests.per_transport.TransportTests.test_symlink(SFTPTransport,SFTPSiblingAbsoluteServer) ... ok
  150. bzrlib.tests.per_transport.TransportTests.test_unicode_paths(FtpTransport,FTPTestServer) ... ok
  151. bzrlib.tests.per_tree.test_path_content_summary.TestPathContentSummary.test_file_content_summary_not_versioned(PreviewTree) ... ok
  152. bzrlib.tests.per_tree.test_path_content_summary.TestPathContentSummary.test_file_content_summary_not_versioned(PreviewTreePost) ... ok
  153. bzrlib.tests.per_repository.test_fetch.TestFetchSameRepository.test_fetch_into_smart_with_ghost(RepositoryFormat5) ... ok
  154. bzrlib.tests.per_repository.test_fetch.TestFetchSameRepository.test_fetch_into_smart_with_ghost(RepositoryFormat6) ... ok
  155. bzrlib.tests.per_repository_reference.test_get_record_stream.TestGetRecordStream.test_ordered_fulltext_complex(RepositoryFormatKnitPack5) ... ok
  156. bzrlib.tests.per_repository_reference.test_get_record_stream.TestGetRecordStream.test_ordered_fulltext_complex(RepositoryFormatKnitPack5RichRootBroken) ... ok
  157. bzrlib.tests.per_repository_reference.test_get_record_stream.TestGetRecordStream.test_ordered_fulltext_complex(RepositoryFormatKnitPack5RichRoot) ... ok
  158. bzrlib.tests.per_repository_reference.test_get_record_stream.TestGetRecordStream.test_ordered_fulltext_complex(RepositoryFormatKnitPack6) ... ok
  159. bzrlib.tests.per_repository_reference.test_get_record_stream.TestGetRecordStream.test_ordered_fulltext_complex(RepositoryFormatKnitPack6RichRoot) ... ok
  160. bzrlib.tests.per_repository_reference.test_get_record_stream.TestGetRecordStream.test_ordered_fulltext_complex(RepositoryFormatPackDevelopment2Subtree) ... ok
  161. bzrlib.tests.per_repository_reference.test_get_record_stream.TestGetRecordStream.test_ordered_fulltext_complex(RemoteRepositoryFormat-default) ... ok
  162. bzrlib.tests.per_repository_reference.test_get_record_stream.TestGetRecordStream.test_ordered_fulltext_complex(RemoteRepositoryFormat-v2) ... ok
  163. bzrlib.tests.test_conflicts.TestResolveParentLoop.test_resolve_taking_other(dir1_into_dir4,dir3_into_dir2) ... ok
  164. bzrlib.tests.test_conflicts.TestResolveParentLoop.test_resolve_taking_other(dir3_into_dir2,dir1_into_dir4) ... ok
  165. bzrlib.tests.test_conflicts.TestResolveParentLoop.test_resolve_taking_this(dir1_into_dir4,dir3_into_dir2) ... ok
  166. bzrlib.tests.test_conflicts.TestResolveParentLoop.test_resolve_taking_this(dir3_into_dir2,dir1_into_dir4) ... ok
  167. bzrlib.tests.test_fifo_cache.TestFIFOCache.test_cleanup_at_deconstruct ... ok
  168. bzrlib.tests.test_globbing.TestGlobster.test_bad_pattern ... ERROR
  169. bzrlib.tests.test_lock.TestOSLock.test_read_locks_block_write_locks(fcntl) ... ok
  170. bzrlib.tests.test_lock.TestOSLock.test_write_locks_block_read_lock(fcntl) ... ok
  171. bzrlib.tests.test_lockdir.TestLockDir.test_35_wait_lock_changing ... ok
  172. bzrlib.tests.test_merge.TestMergerEntriesLCA.test_one_lca_accidentally_pruned ... ok
  173. bzrlib.tests.test_merge.TestMergerEntriesLCA.test_one_lca_supersedes_path ... ok
  174. bzrlib.tests.test_merge.TestMergerEntriesLCA.test_same_lca_resolution_one_side_updates_content ... ok
  175. bzrlib.tests.test_merge_core.FunctionalMergeTest.test_weave_conflicts_not_in_base ... ok
  176. bzrlib.tests.test_osutils.TestReCompile.test_re_compile_checked ... ERROR
  177. bzrlib.tests.test_osutils.TestReCompile.test_re_compile_checked_error ... ERROR
  178. bzrlib.tests.test_shelf.TestPrepareShelf.test_shelve_changed_root_id ... ok
  179. bzrlib.tests.test_shelf_ui.TestApplyReporter.test_shelve_old_root_deleted ... ok
  180. bzrlib.tests.test_shelf_ui.TestApplyReporter.test_shelve_split ... ok
  181. bzrlib.tests.test_shelf_ui.TestShelver.test_shelve_old_root_deleted ... ok
  182. bzrlib.tests.test_shelf_ui.TestShelver.test_shelve_split ... ok
  183. There are 529 lines with trailing white space in 153 files.
  184. There are 2022 lines longer than 79 characters in 338 files.
  185. bzrlib.tests.test_strace.TestStrace.test_strace_callable_is_called ... ok
  186. bzrlib.tests.test_strace.TestStrace.test_strace_callable_result ... ok
  187. bzrlib.tests.test_strace.TestStrace.test_strace_result_has_raw_log ... ok
  188. bzrlib.tests.test_tag.TestTagsInCheckouts.test_tag_deletion_from_master_to_bound ... ok
  189. bzrlib.tests.test_win32utils.Test_CommandLineToArgv.test_single_quote_support ... ok
  190. # Check that there were no errors reported.
  191. subunit-stats < selftest.log
  192. There are 529 lines with trailing white space in 153 files.
  193. There are 2022 lines longer than 79 characters in 338 files.
  194. Total tests:   24131
  195. Passed tests:  22039
  196. Failed tests:      3
  197. Skipped tests:  2089
  198. Seen tags:
  199.  
  200. ======================================================================
  201. ERROR: bzrlib.tests.test_globbing.TestGlobster.test_bad_pattern
  202. ----------------------------------------------------------------------
  203. _StringException: Text attachment: log
  204. ------------
  205.  
  206. ------------
  207. Text attachment: traceback
  208. ------------
  209. Traceback (most recent call last):
  210.   File "/usr/lib/python2.4/site-packages/testtools/runtest.py", line 128, in _run_user
  211.     return fn(*args)
  212.   File "/usr/lib/python2.4/site-packages/testtools/testcase.py", line 368, in _run_test_method
  213.     testMethod()
  214.   File "/home/pqm/bzr-pqm-workdir/home/+trunk/bzrlib/tests/test_globbing.py", line 316, in test_bad_pattern
  215.     e = self.assertRaises(errors.InvalidPattern, g.match, 'foo')
  216.   File "/home/pqm/bzr-pqm-workdir/home/+trunk/bzrlib/tests/__init__.py", line 1249, in assertRaises
  217.     callableObj(*args, **kwargs)
  218.   File "/home/pqm/bzr-pqm-workdir/home/+trunk/bzrlib/globbing.py", line 219, in match
  219.     except errors.InvalidPattern, e:
  220.   File "/home/pqm/bzr-pqm-workdir/home/+trunk/bzrlib/lazy_import.py", line 106, in __getattribute__
  221.     obj = _replace()
  222.   File "/home/pqm/bzr-pqm-workdir/home/+trunk/bzrlib/lazy_import.py", line 88, in _replace
  223.     extra=e)
  224. IllegalUseOfScopeReplacer: ScopeReplacer object 'errors' was used incorrectly: Object already cleaned up, did you assign it to another variable?: _factory
  225. ------------
  226.  
  227.  
  228. ======================================================================
  229. ERROR: bzrlib.tests.test_osutils.TestReCompile.test_re_compile_checked
  230. ----------------------------------------------------------------------
  231. _StringException: Text attachment: log
  232. ------------
  233. 4186.807  Deprecated function called
  234. Called from:
  235.   File "/usr/lib/python2.4/site-packages/testtools/runtest.py", line 128, in _run_user
  236.     return fn(*args)
  237.   File "/usr/lib/python2.4/site-packages/testtools/testcase.py", line 368, in _run_test_method
  238.     testMethod()
  239.   File "/home/pqm/bzr-pqm-workdir/home/+trunk/bzrlib/tests/test_osutils.py", line 1709, in test_re_compile_checked
  240.     r = osutils.re_compile_checked(r'A*', re.IGNORECASE)
  241.   File "/home/pqm/bzr-pqm-workdir/home/+trunk/bzrlib/symbol_versioning.py", line 95, in decorated_function
  242.     trace.mutter_callsite(4, "Deprecated function called")
  243. ------------
  244. Text attachment: traceback
  245. ------------
  246. Traceback (most recent call last):
  247.   File "/usr/lib/python2.4/site-packages/testtools/runtest.py", line 128, in _run_user
  248.     return fn(*args)
  249.   File "/usr/lib/python2.4/site-packages/testtools/testcase.py", line 368, in _run_test_method
  250.     testMethod()
  251.   File "/home/pqm/bzr-pqm-workdir/home/+trunk/bzrlib/tests/test_osutils.py", line 1709, in test_re_compile_checked
  252.     r = osutils.re_compile_checked(r'A*', re.IGNORECASE)
  253.   File "/home/pqm/bzr-pqm-workdir/home/+trunk/bzrlib/symbol_versioning.py", line 97, in decorated_function
  254.     DeprecationWarning, stacklevel=2)
  255.   File "/usr/lib/python2.4/warnings.py", line 61, in warn
  256.     warn_explicit(message, category, filename, lineno, module, registry)
  257.   File "/usr/lib/python2.4/warnings.py", line 96, in warn_explicit
  258.     raise message
  259. DeprecationWarning: bzrlib.osutils.re_compile_checked was deprecated in version 2.2.0.
  260. ------------
  261.  
  262.  
  263. ======================================================================
  264. ERROR: bzrlib.tests.test_osutils.TestReCompile.test_re_compile_checked_error
  265. ----------------------------------------------------------------------
  266. _StringException: Text attachment: log
  267. ------------
  268. 4186.811  Deprecated function called
  269. Called from:
  270.   File "/usr/lib/python2.4/site-packages/testtools/testcase.py", line 368, in _run_test_method
  271.     testMethod()
  272.   File "/home/pqm/bzr-pqm-workdir/home/+trunk/bzrlib/tests/test_osutils.py", line 1717, in test_re_compile_checked_error
  273.     osutils.re_compile_checked, '*', re.IGNORECASE, 'test case')
  274.   File "/home/pqm/bzr-pqm-workdir/home/+trunk/bzrlib/tests/__init__.py", line 1249, in assertRaises
  275.     callableObj(*args, **kwargs)
  276.   File "/home/pqm/bzr-pqm-workdir/home/+trunk/bzrlib/symbol_versioning.py", line 95, in decorated_function
  277.     trace.mutter_callsite(4, "Deprecated function called")
  278. ------------
  279. Text attachment: traceback
  280. ------------
  281. Traceback (most recent call last):
  282.   File "/usr/lib/python2.4/site-packages/testtools/runtest.py", line 128, in _run_user
  283.     return fn(*args)
  284.   File "/usr/lib/python2.4/site-packages/testtools/testcase.py", line 368, in _run_test_method
  285.     testMethod()
  286.   File "/home/pqm/bzr-pqm-workdir/home/+trunk/bzrlib/tests/test_osutils.py", line 1717, in test_re_compile_checked_error
  287.     osutils.re_compile_checked, '*', re.IGNORECASE, 'test case')
  288.   File "/home/pqm/bzr-pqm-workdir/home/+trunk/bzrlib/tests/__init__.py", line 1249, in assertRaises
  289.     callableObj(*args, **kwargs)
  290.   File "/home/pqm/bzr-pqm-workdir/home/+trunk/bzrlib/symbol_versioning.py", line 97, in decorated_function
  291.     DeprecationWarning, stacklevel=2)
  292.   File "/usr/lib/python2.4/warnings.py", line 61, in warn
  293.     warn_explicit(message, category, filename, lineno, module, registry)
  294.   File "/usr/lib/python2.4/warnings.py", line 96, in warn_explicit
  295.     raise message
  296. DeprecationWarning: bzrlib.osutils.re_compile_checked was deprecated in version 2.2.0.
  297. ------------
  298.  
  299.  
  300. ----------------------------------------------------------------------
  301. Ran 46 tests in 12.448s
  302.  
  303. FAILED (errors=3)
  304. [300062-bad-pattern-error-part-1]%
RAW Paste Data
We use cookies for various purposes including analytics. By continuing to use Pastebin, you agree to our use of cookies as described in the Cookies Policy. OK, I Understand
 
Top