SHARE
TWEET

Untitled

a guest Sep 11th, 2019 88 Never
Not a member of Pastebin yet? Sign Up, it unlocks many cool features!
  1. 21:38:00: Executing task 'packAll'...
  2.  
  3. > Task :buildSrc:discoverMainScriptsExtensions
  4. > Task :buildSrc:generateScriptPluginAdapters UP-TO-DATE
  5. > Task :buildSrc:compileKotlin UP-TO-DATE
  6. > Task :buildSrc:compileJava NO-SOURCE
  7. > Task :buildSrc:compileGroovy NO-SOURCE
  8. > Task :buildSrc:pluginDescriptors UP-TO-DATE
  9. > Task :buildSrc:processResources NO-SOURCE
  10. > Task :buildSrc:classes UP-TO-DATE
  11. > Task :buildSrc:inspectClassesForKotlinIC UP-TO-DATE
  12. > Task :buildSrc:jar UP-TO-DATE
  13. > Task :buildSrc:assemble UP-TO-DATE
  14. > Task :buildSrc:discoverTestScriptsExtensions
  15. > Task :buildSrc:compileTestKotlin NO-SOURCE
  16. > Task :buildSrc:pluginUnderTestMetadata UP-TO-DATE
  17. > Task :buildSrc:compileTestJava NO-SOURCE
  18. > Task :buildSrc:compileTestGroovy NO-SOURCE
  19. > Task :buildSrc:processTestResources NO-SOURCE
  20. > Task :buildSrc:testClasses UP-TO-DATE
  21. > Task :buildSrc:test NO-SOURCE
  22. > Task :buildSrc:validateTaskProperties UP-TO-DATE
  23. > Task :buildSrc:check UP-TO-DATE
  24. > Task :buildSrc:build UP-TO-DATE
  25.  
  26. > Configure project :mcru-commons
  27. Kotlin Multiplatform Projects are an experimental feature.
  28.  
  29. > Task :mcru-commons:compileKotlinJvm8 UP-TO-DATE
  30. > Task :mcru-commons:jvm8ProcessResources NO-SOURCE
  31. > Task :mcru-commons:jvm8MainClasses UP-TO-DATE
  32. > Task :mcru-commons:jvm8Jar UP-TO-DATE
  33. > Task :mcruCore:compileKotlin UP-TO-DATE
  34. > Task :mcruCore:compileJava UP-TO-DATE
  35. > Task :mcruCore:processResources UP-TO-DATE
  36. > Task :mcruCore:classes UP-TO-DATE
  37. > Task :mcruCore:inspectClassesForKotlinIC UP-TO-DATE
  38. > Task :mcruCore:jar UP-TO-DATE
  39. > Task :mcruServices:compileKotlin UP-TO-DATE
  40. > Task :mcruServices:compileJava UP-TO-DATE
  41. > Task :mcruServices:processResources UP-TO-DATE
  42. > Task :mcruServices:classes UP-TO-DATE
  43. > Task :mcruServices:inspectClassesForKotlinIC UP-TO-DATE
  44. > Task :mcruServices:jar UP-TO-DATE
  45. > Task :mcruCommon:compileKotlin UP-TO-DATE
  46.  
  47. > Task :mcruCommon:compileJava
  48. D:\work\mcru\mcruCommon\src\main\java\ru\minecrafting\common\display_tools\HighlightedBlock.java:28: error: cannot access CraftPlayer
  49.         CraftPlayerWrapper player = new CraftPlayerWrapper(user.getPlayer());
  50.                                     ^
  51.   class file for org.bukkit.craftbukkit.v1_14_R1.entity.CraftPlayer not found
  52. D:\work\mcru\mcruCommon\src\main\java\ru\minecrafting\common\display_tools\HighlightedBlock.java:38: error: cannot access EntityFallingBlock
  53.         player.sendPacket(PacketFactory.INSTANCE.createPacketPlayOutSpawnEntity(this.entityFallingBlock.getWrappedPublic(), 70, 20));
  54.                                                                                                                         ^
  55.   class file for net.minecraft.server.v1_14_R1.EntityFallingBlock not found
  56. D:\work\mcru\mcruCommon\src\main\java\ru\minecrafting\common\display_tools\HighlightedBlock.java:38: error: cannot access Packet
  57.         player.sendPacket(PacketFactory.INSTANCE.createPacketPlayOutSpawnEntity(this.entityFallingBlock.getWrappedPublic(), 70, 20));
  58.               ^
  59.   class file for net.minecraft.server.v1_14_R1.Packet not found
  60. D:\work\mcru\mcruCommon\src\main\java\ru\minecrafting\common\display_tools\HighlightedBlock.java:54: error: cannot access PacketPlayOutEntityDestroy
  61.             new CraftPlayerWrapper(user.getPlayer()).sendPacket(PacketFactory.INSTANCE.createPacketPlayOutEntityDestroy(this.entityFallingBlock.getId()));
  62.                                                     ^
  63.   class file for net.minecraft.server.v1_14_R1.PacketPlayOutEntityDestroy not found
  64. D:\work\mcru\mcruCommon\src\main\java\ru\minecrafting\common\sequencer\Paster.java:443: error: cannot access NBTBase
  65.                                 NBTTagCompound nbt_tag= (NBTTagCompound) this.readWENBT(nbt_data).getWrappedPublic();
  66.                                                         ^
  67.   class file for net.minecraft.server.v1_14_R1.NBTBase not found
  68. D:\work\mcru\mcruCommon\src\main\java\ru\minecrafting\common\sequencer\Paster.java:517: error: cannot access World
  69.                 CraftWorldWrapper worldServer = CraftWorldWrapper.Companion.create(getWorld());
  70.                                                                            ^
  71.   class file for net.minecraft.server.v1_14_R1.World not found
  72. D:\work\mcru\mcruCommon\src\main\java\ru\minecrafting\common\sequencer\Paster.java:522: error: cannot access CraftEntity
  73.                 Optional<CraftEntityWrapper<?, ?>> entity = CraftEntityUtils.INSTANCE.findEntityById(id, worldServer);
  74.                                            ^
  75.   class file for org.bukkit.craftbukkit.v1_14_R1.entity.CraftEntity not found
  76. D:\work\mcru\mcruCommon\src\main\java\ru\minecrafting\common\tools\VillagesTools.java:28: error: cannot access WorldServer
  77.         WorldServer world_server = CraftWorldWrapper.Companion.create(world).getWrappedPublic();
  78.                                                                                              ^
  79.   class file for net.minecraft.server.v1_14_R1.WorldServer not found
  80. Note: Some input files use or override a deprecated API.
  81. Note: Recompile with -Xlint:deprecation for details.
  82. Note: Some input files use unchecked or unsafe operations.
  83. Note: Recompile with -Xlint:unchecked for details.
  84. 8 errors
  85.  
  86. > Task :mcruCommon:compileJava FAILED
  87.  
  88. FAILURE: Build failed with an exception.
  89.  
  90. * What went wrong:
  91. Execution failed for task ':mcruCommon:compileJava'.
  92. > Compilation failed; see the compiler error output for details.
  93.  
  94. * Try:
  95. Run with --stacktrace option to get the stack trace. Run with --info or --debug option to get more log output. Run with --scan to get full insights.
  96.  
  97. * Get more help at https://help.gradle.org
  98.  
  99. Deprecated Gradle features were used in this build, making it incompatible with Gradle 6.0.
  100. Use '--warning-mode all' to show the individual deprecation warnings.
  101. See https://docs.gradle.org/5.0/userguide/command_line_interface.html#sec:command_line_warnings
  102.  
  103. BUILD FAILED in 9s
  104. 14 actionable tasks: 1 executed, 13 up-to-date
  105. Compilation failed; see the compiler error output for details.
  106. 21:38:09: Task execution finished 'packAll'.
RAW Paste Data
We use cookies for various purposes including analytics. By continuing to use Pastebin, you agree to our use of cookies as described in the Cookies Policy. OK, I Understand
 
Top