Advertisement
Guest User

Untitled

a guest
Dec 12th, 2017
147
Never
Not a member of Pastebin yet? Sign Up, it unlocks many cool features!
Bash 3.95 KB | None
  1. Checking if port 8080 is in use... [free]
  2. [INFO] ------------------------------------------------------------------------
  3. [INFO] BUILD FAILURE
  4. [INFO] ------------------------------------------------------------------------
  5. [INFO] Total time: 2.606 s
  6. [INFO] Finished at: 2017-12-12T11:19:52+01:00
  7. [INFO] Final Memory: 19M/212M
  8. [INFO] ------------------------------------------------------------------------
  9. [ERROR] Failed to execute goal org.openmrs.maven.plugins:openmrs-sdk-maven-plugin:3.12.1:run (default-cli) on project standalone-pom: Execution default-cli of goal org.openmrs.maven.plugins:openmrs-sdk-maven-plugin:3.12.1:run failed. NullPointerException -> [Help 1]
  10. org.apache.maven.lifecycle.LifecycleExecutionException: Failed to execute goal org.openmrs.maven.plugins:openmrs-sdk-maven-plugin:3.12.1:run (default-cli) on project standalone-pom: Execution default-cli of goal org.openmrs.maven.plugins:openmrs-sdk-maven-plugin:3.12.1:run failed.
  11.     at org.apache.maven.lifecycle.internal.MojoExecutor.execute(MojoExecutor.java:212)
  12.     at org.apache.maven.lifecycle.internal.MojoExecutor.execute(MojoExecutor.java:153)
  13.     at org.apache.maven.lifecycle.internal.MojoExecutor.execute(MojoExecutor.java:145)
  14.     at org.apache.maven.lifecycle.internal.LifecycleModuleBuilder.buildProject(LifecycleModuleBuilder.java:116)
  15.     at org.apache.maven.lifecycle.internal.LifecycleModuleBuilder.buildProject(LifecycleModuleBuilder.java:80)
  16.     at org.apache.maven.lifecycle.internal.builder.singlethreaded.SingleThreadedBuilder.build(SingleThreadedBuilder.java:51)
  17.     at org.apache.maven.lifecycle.internal.LifecycleStarter.execute(LifecycleStarter.java:128)
  18.     at org.apache.maven.DefaultMaven.doExecute(DefaultMaven.java:307)
  19.     at org.apache.maven.DefaultMaven.doExecute(DefaultMaven.java:193)
  20.     at org.apache.maven.DefaultMaven.execute(DefaultMaven.java:106)
  21.     at org.apache.maven.cli.MavenCli.execute(MavenCli.java:863)
  22.     at org.apache.maven.cli.MavenCli.doMain(MavenCli.java:288)
  23.     at org.apache.maven.cli.MavenCli.main(MavenCli.java:199)
  24.     at sun.reflect.NativeMethodAccessorImpl.invoke0(Native Method)
  25.     at sun.reflect.NativeMethodAccessorImpl.invoke(NativeMethodAccessorImpl.java:62)
  26.     at sun.reflect.DelegatingMethodAccessorImpl.invoke(DelegatingMethodAccessorImpl.java:43)
  27.     at java.lang.reflect.Method.invoke(Method.java:498)
  28.     at org.codehaus.plexus.classworlds.launcher.Launcher.launchEnhanced(Launcher.java:289)
  29.     at org.codehaus.plexus.classworlds.launcher.Launcher.launch(Launcher.java:229)
  30.     at org.codehaus.plexus.classworlds.launcher.Launcher.mainWithExitCode(Launcher.java:415)
  31.     at org.codehaus.plexus.classworlds.launcher.Launcher.main(Launcher.java:356)
  32. Caused by: org.apache.maven.plugin.PluginExecutionException: Execution default-cli of goal org.openmrs.maven.plugins:openmrs-sdk-maven-plugin:3.12.1:run failed.
  33.     at org.apache.maven.plugin.DefaultBuildPluginManager.executeMojo(DefaultBuildPluginManager.java:145)
  34.     at org.apache.maven.lifecycle.internal.MojoExecutor.execute(MojoExecutor.java:207)
  35.     ... 20 more
  36. Caused by: java.lang.NullPointerException
  37.     at java.util.regex.Matcher.getTextLength(Matcher.java:1283)
  38.     at java.util.regex.Matcher.reset(Matcher.java:309)
  39.     at java.util.regex.Matcher.<init>(Matcher.java:229)
  40.     at java.util.regex.Pattern.matcher(Pattern.java:1093)
  41.     at org.openmrs.maven.plugins.Run.adjustParamToAtLeast(Run.java:279)
  42.     at org.openmrs.maven.plugins.Run.adjustXmxToAtLeast(Run.java:270)
  43.     at org.openmrs.maven.plugins.Run.runInFork(Run.java:183)
  44.     at org.openmrs.maven.plugins.Run.executeTask(Run.java:129)
  45.     at org.openmrs.maven.plugins.AbstractTask.execute(AbstractTask.java:181)
  46.     at org.apache.maven.plugin.DefaultBuildPluginManager.executeMojo(DefaultBuildPluginManager.java:134)
  47.     ... 21 more
  48. [ERROR]
  49. [ERROR] Re-run Maven using the -X switch to enable full debug logging.
  50. [ERROR]
  51. [ERROR] For more information about the errors and possible solutions, please read the following articles:
  52. [ERROR] [Help 1] http://cwiki.apache.org/confluence/display/MAVEN/PluginExecutionException
Advertisement
RAW Paste Data Copied
Advertisement