Guest User

pdf4qt build error

a guest
Sep 23rd, 2025
150
0
Never
Not a member of Pastebin yet? Sign Up, it unlocks many cool features!
text 35.87 KB | None | 0 0
  1. ==> Starting build()...
  2. [ 1%] Generating usr/bin/translations/PDF4QT_en.qm
  3. [ 1%] Generating usr/bin/translations/PDF4QT_cs.qm
  4. [ 1%] Generating usr/bin/translations/PDF4QT_ko.qm
  5. [ 1%] Generating usr/bin/translations/PDF4QT_de.qm
  6. [ 1%] Generating usr/bin/translations/PDF4QT_es.qm
  7. [ 1%] Built target Pdf4QtLaunchPad_autogen_timestamp_deps
  8. [ 1%] Built target Pdf4QtLibCore_autogen_timestamp_deps
  9. [ 1%] Automatic MOC and UIC for target Pdf4QtLibCore
  10. [ 2%] Automatic MOC and UIC for target Pdf4QtLaunchPad
  11. Updating '/tmp/makepkg/pdf4qt/src/pdf4qt.git/build/usr/bin/translations/PDF4QT_en.qm'...
  12. Generated 0 translation(s) (0 finished and 0 unfinished)
  13. Ignored 2725 untranslated source text(s)
  14. Updating '/tmp/makepkg/pdf4qt/src/pdf4qt.git/build/usr/bin/translations/PDF4QT_ko.qm'...
  15. Updating '/tmp/makepkg/pdf4qt/src/pdf4qt.git/build/usr/bin/translations/PDF4QT_es.qm'...
  16. Updating '/tmp/makepkg/pdf4qt/src/pdf4qt.git/build/usr/bin/translations/PDF4QT_cs.qm'...
  17. Updating '/tmp/makepkg/pdf4qt/src/pdf4qt.git/build/usr/bin/translations/PDF4QT_de.qm'...
  18. Generated 1884 translation(s) (1884 finished and 0 unfinished)
  19. Ignored 2725 untranslated source text(s)
  20. Generated 1647 translation(s) (1647 finished and 0 unfinished)
  21. Ignored 2725 untranslated source text(s)
  22. Generated 2472 translation(s) (2298 finished and 174 unfinished)
  23. Ignored 2014 untranslated source text(s)
  24. Generated 1917 translation(s) (1917 finished and 0 unfinished)
  25. Ignored 2725 untranslated source text(s)
  26. [ 2%] Built target PDF4QT_lrelease
  27. [ 2%] Built target Pdf4QtLaunchPad_autogen
  28. [ 3%] Automatic RCC for app.qrc
  29. [ 3%] Building CXX object Pdf4QtLaunchPad/CMakeFiles/Pdf4QtLaunchPad.dir/main.cpp.o
  30. [ 3%] Building CXX object Pdf4QtLaunchPad/CMakeFiles/Pdf4QtLaunchPad.dir/Pdf4QtLaunchPad_autogen/mocs_compilation.cpp.o
  31. [ 4%] Building CXX object Pdf4QtLaunchPad/CMakeFiles/Pdf4QtLaunchPad.dir/Pdf4QtLaunchPad_autogen/EWIEGA46WW/qrc_app.cpp.o
  32. [ 4%] Building CXX object Pdf4QtLaunchPad/CMakeFiles/Pdf4QtLaunchPad.dir/launchapplicationwidget.cpp.o
  33. [ 4%] Building CXX object Pdf4QtLaunchPad/CMakeFiles/Pdf4QtLaunchPad.dir/launchdialog.cpp.o
  34. [ 4%] Built target Pdf4QtLibCore_autogen
  35. [ 5%] Automatic RCC for aatl.qrc
  36. [ 5%] Automatic RCC for cmaps.qrc
  37. [ 5%] Building CXX object Pdf4QtLibCore/CMakeFiles/Pdf4QtLibCore.dir/Pdf4QtLibCore_autogen/mocs_compilation.cpp.o
  38. [ 5%] Building CXX object Pdf4QtLibCore/CMakeFiles/Pdf4QtLibCore.dir/sources/pdfblendfunction.cpp.o
  39. [ 5%] Building CXX object Pdf4QtLibCore/CMakeFiles/Pdf4QtLibCore.dir/sources/pdfaction.cpp.o
  40. [ 5%] Building CXX object Pdf4QtLibCore/CMakeFiles/Pdf4QtLibCore.dir/sources/pdfdocumentbuilder.cpp.o
  41. [ 7%] Building CXX object Pdf4QtLibCore/CMakeFiles/Pdf4QtLibCore.dir/sources/pdfdocumentmanipulator.cpp.o
  42. [ 7%] Building CXX object Pdf4QtLibCore/CMakeFiles/Pdf4QtLibCore.dir/sources/pdfannotation.cpp.o
  43. [ 7%] Building CXX object Pdf4QtLibCore/CMakeFiles/Pdf4QtLibCore.dir/sources/pdfalgorithmlcs.cpp.o
  44. [ 7%] Linking CXX executable ../usr/bin/Pdf4QtLaunchPad
  45. [ 7%] Building CXX object Pdf4QtLibCore/CMakeFiles/Pdf4QtLibCore.dir/sources/pdfccittfaxdecoder.cpp.o
  46. [ 7%] Building CXX object Pdf4QtLibCore/CMakeFiles/Pdf4QtLibCore.dir/sources/pdfcertificatemanager.cpp.o
  47. [ 7%] Building CXX object Pdf4QtLibCore/CMakeFiles/Pdf4QtLibCore.dir/sources/pdfcms.cpp.o
  48. [ 8%] Building CXX object Pdf4QtLibCore/CMakeFiles/Pdf4QtLibCore.dir/sources/pdfdiff.cpp.o
  49. [ 9%] Building CXX object Pdf4QtLibCore/CMakeFiles/Pdf4QtLibCore.dir/sources/pdfdocumenttextflow.cpp.o
  50. [ 9%] Building CXX object Pdf4QtLibCore/CMakeFiles/Pdf4QtLibCore.dir/sources/pdfdocumenttextfloweditormodel.cpp.o
  51. [ 9%] Building CXX object Pdf4QtLibCore/CMakeFiles/Pdf4QtLibCore.dir/sources/pdfexecutionpolicy.cpp.o
  52. [ 9%] Building CXX object Pdf4QtLibCore/CMakeFiles/Pdf4QtLibCore.dir/sources/pdficontheme.cpp.o
  53. [ 9%] Building CXX object Pdf4QtLibCore/CMakeFiles/Pdf4QtLibCore.dir/sources/pdfdocumentwriter.cpp.o
  54. [ 10%] Building CXX object Pdf4QtLibCore/CMakeFiles/Pdf4QtLibCore.dir/sources/pdffile.cpp.o
  55. [ 10%] Building CXX object Pdf4QtLibCore/CMakeFiles/Pdf4QtLibCore.dir/sources/pdfform.cpp.o
  56. [ 11%] Building CXX object Pdf4QtLibCore/CMakeFiles/Pdf4QtLibCore.dir/sources/pdfjavascriptscanner.cpp.o
  57. [ 11%] Building CXX object Pdf4QtLibCore/CMakeFiles/Pdf4QtLibCore.dir/sources/pdfjbig2decoder.cpp.o
  58. [ 11%] Building CXX object Pdf4QtLibCore/CMakeFiles/Pdf4QtLibCore.dir/sources/pdfmultimedia.cpp.o
  59. [ 12%] Building CXX object Pdf4QtLibCore/CMakeFiles/Pdf4QtLibCore.dir/sources/pdfobject.cpp.o
  60. [ 12%] Building CXX object Pdf4QtLibCore/CMakeFiles/Pdf4QtLibCore.dir/sources/pdfobjecteditormodel.cpp.o
  61. [ 12%] Built target Pdf4QtLaunchPad
  62. [ 12%] Building CXX object Pdf4QtLibCore/CMakeFiles/Pdf4QtLibCore.dir/sources/pdfobjectutils.cpp.o
  63. [ 13%] Building CXX object Pdf4QtLibCore/CMakeFiles/Pdf4QtLibCore.dir/sources/pdfoptimizer.cpp.o
  64. [ 13%] Building CXX object Pdf4QtLibCore/CMakeFiles/Pdf4QtLibCore.dir/sources/pdfoptionalcontent.cpp.o
  65. [ 13%] Building CXX object Pdf4QtLibCore/CMakeFiles/Pdf4QtLibCore.dir/sources/pdfoutline.cpp.o
  66. [ 14%] Building CXX object Pdf4QtLibCore/CMakeFiles/Pdf4QtLibCore.dir/sources/pdfpagenavigation.cpp.o
  67. [ 14%] Building CXX object Pdf4QtLibCore/CMakeFiles/Pdf4QtLibCore.dir/sources/pdfpagetransition.cpp.o
  68. [ 14%] Building CXX object Pdf4QtLibCore/CMakeFiles/Pdf4QtLibCore.dir/sources/pdfpainterutils.cpp.o
  69. [ 15%] Building CXX object Pdf4QtLibCore/CMakeFiles/Pdf4QtLibCore.dir/sources/pdfparser.cpp.o
  70. [ 15%] Building CXX object Pdf4QtLibCore/CMakeFiles/Pdf4QtLibCore.dir/sources/pdfdocument.cpp.o
  71. [ 15%] Building CXX object Pdf4QtLibCore/CMakeFiles/Pdf4QtLibCore.dir/sources/pdfdocumentreader.cpp.o
  72. [ 16%] Building CXX object Pdf4QtLibCore/CMakeFiles/Pdf4QtLibCore.dir/sources/pdfpattern.cpp.o
  73. [ 16%] Building CXX object Pdf4QtLibCore/CMakeFiles/Pdf4QtLibCore.dir/sources/pdfplugin.cpp.o
  74. [ 16%] Building CXX object Pdf4QtLibCore/CMakeFiles/Pdf4QtLibCore.dir/sources/pdfprogress.cpp.o
  75. [ 16%] Building CXX object Pdf4QtLibCore/CMakeFiles/Pdf4QtLibCore.dir/sources/pdfredact.cpp.o
  76. [ 17%] Building CXX object Pdf4QtLibCore/CMakeFiles/Pdf4QtLibCore.dir/sources/pdfsecurityhandler.cpp.o
  77. [ 17%] Building CXX object Pdf4QtLibCore/CMakeFiles/Pdf4QtLibCore.dir/sources/pdfsignaturehandler.cpp.o
  78. [ 17%] Building CXX object Pdf4QtLibCore/CMakeFiles/Pdf4QtLibCore.dir/sources/pdfsnapper.cpp.o
  79. [ 18%] Building CXX object Pdf4QtLibCore/CMakeFiles/Pdf4QtLibCore.dir/sources/pdfstructuretree.cpp.o
  80. [ 18%] Building CXX object Pdf4QtLibCore/CMakeFiles/Pdf4QtLibCore.dir/sources/pdftextlayout.cpp.o
  81. [ 18%] Building CXX object Pdf4QtLibCore/CMakeFiles/Pdf4QtLibCore.dir/sources/pdftransparencyrenderer.cpp.o
  82. [ 19%] Building CXX object Pdf4QtLibCore/CMakeFiles/Pdf4QtLibCore.dir/sources/pdfutils.cpp.o
  83. [ 19%] Building CXX object Pdf4QtLibCore/CMakeFiles/Pdf4QtLibCore.dir/sources/pdfxfaengine.cpp.o
  84. [ 19%] Building CXX object Pdf4QtLibCore/CMakeFiles/Pdf4QtLibCore.dir/sources/pdfxreftable.cpp.o
  85. [ 20%] Building CXX object Pdf4QtLibCore/CMakeFiles/Pdf4QtLibCore.dir/sources/pdfvisitor.cpp.o
  86. [ 20%] Building CXX object Pdf4QtLibCore/CMakeFiles/Pdf4QtLibCore.dir/sources/pdfencoding.cpp.o
  87. [ 20%] Building CXX object Pdf4QtLibCore/CMakeFiles/Pdf4QtLibCore.dir/sources/pdfcatalog.cpp.o
  88. [ 21%] Building CXX object Pdf4QtLibCore/CMakeFiles/Pdf4QtLibCore.dir/sources/pdfpage.cpp.o
  89. [ 21%] Building CXX object Pdf4QtLibCore/CMakeFiles/Pdf4QtLibCore.dir/sources/pdfstreamfilters.cpp.o
  90. [ 21%] Building CXX object Pdf4QtLibCore/CMakeFiles/Pdf4QtLibCore.dir/sources/pdfcolorspaces.cpp.o
  91. [ 22%] Building CXX object Pdf4QtLibCore/CMakeFiles/Pdf4QtLibCore.dir/sources/pdfrenderer.cpp.o
  92. [ 22%] Building CXX object Pdf4QtLibCore/CMakeFiles/Pdf4QtLibCore.dir/sources/pdfpagecontentprocessor.cpp.o
  93. [ 22%] Building CXX object Pdf4QtLibCore/CMakeFiles/Pdf4QtLibCore.dir/sources/pdfpainter.cpp.o
  94. [ 23%] Building CXX object Pdf4QtLibCore/CMakeFiles/Pdf4QtLibCore.dir/sources/pdffunction.cpp.o
  95. [ 23%] Building CXX object Pdf4QtLibCore/CMakeFiles/Pdf4QtLibCore.dir/sources/pdfnametounicode.cpp.o
  96. [ 23%] Building CXX object Pdf4QtLibCore/CMakeFiles/Pdf4QtLibCore.dir/sources/pdffont.cpp.o
  97. [ 24%] Building CXX object Pdf4QtLibCore/CMakeFiles/Pdf4QtLibCore.dir/sources/pdfimage.cpp.o
  98. [ 24%] Building CXX object Pdf4QtLibCore/CMakeFiles/Pdf4QtLibCore.dir/sources/pdfdocumentsanitizer.cpp.o
  99. [ 24%] Building CXX object Pdf4QtLibCore/CMakeFiles/Pdf4QtLibCore.dir/sources/pdfimageconversion.cpp.o
  100. [ 24%] Building CXX object Pdf4QtLibCore/CMakeFiles/Pdf4QtLibCore.dir/sources/pdfcolorconvertor.cpp.o
  101. [ 25%] Building CXX object Pdf4QtLibCore/CMakeFiles/Pdf4QtLibCore.dir/sources/pdftextlayoutgenerator.cpp.o
  102. [ 25%] Building CXX object Pdf4QtLibCore/CMakeFiles/Pdf4QtLibCore.dir/sources/pdfwidgetsnapshot.cpp.o
  103. [ 25%] Building CXX object Pdf4QtLibCore/CMakeFiles/Pdf4QtLibCore.dir/sources/pdfcertificatestore.cpp.o
  104. [ 26%] Building CXX object Pdf4QtLibCore/CMakeFiles/Pdf4QtLibCore.dir/sources/pdfblpainter.cpp.o
  105. [ 26%] Building CXX object Pdf4QtLibCore/CMakeFiles/Pdf4QtLibCore.dir/sources/pdfpagecontenteditorprocessor.cpp.o
  106. [ 26%] Building CXX object Pdf4QtLibCore/CMakeFiles/Pdf4QtLibCore.dir/sources/pdfpagecontenteditorcontentstreambuilder.cpp.o
  107. [ 27%] Building CXX object Pdf4QtLibCore/CMakeFiles/Pdf4QtLibCore.dir/sources/pdfapplicationtranslator.cpp.o
  108. [ 27%] Building CXX object Pdf4QtLibCore/CMakeFiles/Pdf4QtLibCore.dir/Pdf4QtLibCore_autogen/EWIEGA46WW/qrc_cmaps.cpp.o
  109. [ 27%] Building CXX object Pdf4QtLibCore/CMakeFiles/Pdf4QtLibCore.dir/Pdf4QtLibCore_autogen/EWIEGA46WW/qrc_aatl.cpp.o
  110. /tmp/makepkg/pdf4qt/src/pdf4qt.git/Pdf4QtLibCore/sources/pdfblpainter.cpp: In member function ‘virtual bool pdf::PDFBLPaintEngine::begin(QPaintDevice*)’:
  111. /tmp/makepkg/pdf4qt/src/pdf4qt.git/Pdf4QtLibCore/sources/pdfblpainter.cpp:225:14: error: ‘struct BLContextCreateInfo’ has no member named ‘threadCount’; did you mean ‘thread_count’?
  112. 225 | info.threadCount = QThread::idealThreadCount();
  113. | ^~~~~~~~~~~
  114. | thread_count
  115. /tmp/makepkg/pdf4qt/src/pdf4qt.git/Pdf4QtLibCore/sources/pdfblpainter.cpp:228:18: error: ‘class BLContext’ has no member named ‘setHint’; did you mean ‘set_hint’?
  116. 228 | m_blContext->setHint(BL_CONTEXT_HINT_RENDERING_QUALITY, BL_RENDERING_QUALITY_MAX_VALUE);
  117. | ^~~~~~~
  118. | set_hint
  119. /tmp/makepkg/pdf4qt/src/pdf4qt.git/Pdf4QtLibCore/sources/pdfblpainter.cpp:230:26: error: ‘class BLImage’ has no member named ‘createFromData’; did you mean ‘create_from_data’?
  120. 230 | m_blOffscreenBuffer->createFromData(m_qtOffscreenBuffer.width(), m_qtOffscreenBuffer.height(), BL_FORMAT_PRGB32, m_qtOffscreenBuffer.bits(), m_qtOffscreenBuffer.bytesPerLine());
  121. | ^~~~~~~~~~~~~~
  122. | create_from_data
  123. /tmp/makepkg/pdf4qt/src/pdf4qt.git/Pdf4QtLibCore/sources/pdfblpainter.cpp:233:22: error: ‘class BLContext’ has no member named ‘clearAll’; did you mean ‘clear_all’?
  124. 233 | m_blContext->clearAll();
  125. | ^~~~~~~~
  126. | clear_all
  127. /tmp/makepkg/pdf4qt/src/pdf4qt.git/Pdf4QtLibCore/sources/pdfblpainter.cpp:237:22: error: ‘class BLContext’ has no member named ‘userToMeta’; did you mean ‘user_to_meta’?
  128. 237 | m_blContext->userToMeta();
  129. | ^~~~~~~~~~
  130. | user_to_meta
  131. /tmp/makepkg/pdf4qt/src/pdf4qt.git/Pdf4QtLibCore/sources/pdfblpainter.cpp: In member function ‘virtual void pdf::PDFBLPaintEngine::updateState(const QPaintEngineState&)’:
  132. /tmp/makepkg/pdf4qt/src/pdf4qt.git/Pdf4QtLibCore/sources/pdfblpainter.cpp:299:22: error: ‘class BLContext’ has no member named ‘setCompOp’; did you mean ‘set_comp_op’?
  133. 299 | m_blContext->setCompOp(getBLCompOp(updatedState.compositionMode()));
  134. | ^~~~~~~~~
  135. | set_comp_op
  136. /tmp/makepkg/pdf4qt/src/pdf4qt.git/Pdf4QtLibCore/sources/pdfblpainter.cpp:304:22: error: ‘class BLContext’ has no member named ‘setGlobalAlpha’; did you mean ‘set_global_alpha’?
  137. 304 | m_blContext->setGlobalAlpha(updatedState.opacity());
  138. | ^~~~~~~~~~~~~~
  139. | set_global_alpha
  140. /tmp/makepkg/pdf4qt/src/pdf4qt.git/Pdf4QtLibCore/sources/pdfblpainter.cpp:310:22: error: ‘class BLContext’ has no member named ‘setTransform’; did you mean ‘set_transform’?
  141. 310 | m_blContext->setTransform(getBLMatrix(updatedState.transform()));
  142. | ^~~~~~~~~~~~
  143. | set_transform
  144. /tmp/makepkg/pdf4qt/src/pdf4qt.git/Pdf4QtLibCore/sources/pdfblpainter.cpp: In member function ‘virtual void pdf::PDFBLPaintEngine::drawRects(const QRect*, int)’:
  145. /tmp/makepkg/pdf4qt/src/pdf4qt.git/Pdf4QtLibCore/sources/pdfblpainter.cpp:384:22: error: ‘class BLContext’ has no member named ‘fillRectArray’; did you mean ‘fill_rect_array’?
  146. 384 | m_blContext->fillRectArray(blRects.view());
  147. | ^~~~~~~~~~~~~
  148. | fill_rect_array
  149. /tmp/makepkg/pdf4qt/src/pdf4qt.git/Pdf4QtLibCore/sources/pdfblpainter.cpp:389:22: error: ‘class BLContext’ has no member named ‘strokeRectArray’; did you mean ‘stroke_rect_array’?
  150. 389 | m_blContext->strokeRectArray(blRects.view());
  151. | ^~~~~~~~~~~~~~~
  152. | stroke_rect_array
  153. /tmp/makepkg/pdf4qt/src/pdf4qt.git/Pdf4QtLibCore/sources/pdfblpainter.cpp: In member function ‘virtual void pdf::PDFBLPaintEngine::drawRects(const QRectF*, int)’:
  154. /tmp/makepkg/pdf4qt/src/pdf4qt.git/Pdf4QtLibCore/sources/pdfblpainter.cpp:430:22: error: ‘class BLContext’ has no member named ‘fillRectArray’; did you mean ‘fill_rect_array’?
  155. 430 | m_blContext->fillRectArray(blRects.view());
  156. | ^~~~~~~~~~~~~
  157. | fill_rect_array
  158. /tmp/makepkg/pdf4qt/src/pdf4qt.git/Pdf4QtLibCore/sources/pdfblpainter.cpp:435:22: error: ‘class BLContext’ has no member named ‘strokeRectArray’; did you mean ‘stroke_rect_array’?
  159. 435 | m_blContext->strokeRectArray(blRects.view());
  160. | ^~~~~~~~~~~~~~~
  161. | stroke_rect_array
  162. /tmp/makepkg/pdf4qt/src/pdf4qt.git/Pdf4QtLibCore/sources/pdfblpainter.cpp: In member function ‘virtual void pdf::PDFBLPaintEngine::drawLines(const QLine*, int)’:
  163. /tmp/makepkg/pdf4qt/src/pdf4qt.git/Pdf4QtLibCore/sources/pdfblpainter.cpp:485:22: error: ‘class BLContext’ has no member named ‘strokeLine’; did you mean ‘stroke_line’?
  164. 485 | m_blContext->strokeLine(line.x1(), line.y1(), line.x2(), line.y2());
  165. | ^~~~~~~~~~
  166. | stroke_line
  167. /tmp/makepkg/pdf4qt/src/pdf4qt.git/Pdf4QtLibCore/sources/pdfblpainter.cpp: In member function ‘virtual void pdf::PDFBLPaintEngine::drawLines(const QLineF*, int)’:
  168. /tmp/makepkg/pdf4qt/src/pdf4qt.git/Pdf4QtLibCore/sources/pdfblpainter.cpp:534:22: error: ‘class BLContext’ has no member named ‘strokeLine’; did you mean ‘stroke_line’?
  169. 534 | m_blContext->strokeLine(line.x1(), line.y1(), line.x2(), line.y2());
  170. | ^~~~~~~~~~
  171. | stroke_line
  172. /tmp/makepkg/pdf4qt/src/pdf4qt.git/Pdf4QtLibCore/sources/pdfblpainter.cpp: In member function ‘void pdf::PDFBLPaintEngine::drawPathImpl(const QPainterPath&, bool, bool, bool)’:
  173. /tmp/makepkg/pdf4qt/src/pdf4qt.git/Pdf4QtLibCore/sources/pdfblpainter.cpp:588:34: error: ‘class BLContext’ has no member named ‘resetTransform’; did you mean ‘reset_transform’?
  174. 588 | m_blContext->resetTransform();
  175. | ^~~~~~~~~~~~~~
  176. | reset_transform
  177. /tmp/makepkg/pdf4qt/src/pdf4qt.git/Pdf4QtLibCore/sources/pdfblpainter.cpp:589:34: error: ‘class BLContext’ has no member named ‘fillPath’; did you mean ‘fill_path’?
  178. 589 | m_blContext->fillPath(getBLPath(fillPath));
  179. | ^~~~~~~~
  180. | fill_path
  181. /tmp/makepkg/pdf4qt/src/pdf4qt.git/Pdf4QtLibCore/sources/pdfblpainter.cpp:604:34: error: ‘class BLContext’ has no member named ‘resetTransform’; did you mean ‘reset_transform’?
  182. 604 | m_blContext->resetTransform();
  183. | ^~~~~~~~~~~~~~
  184. | reset_transform
  185. /tmp/makepkg/pdf4qt/src/pdf4qt.git/Pdf4QtLibCore/sources/pdfblpainter.cpp:606:34: error: ‘class BLContext’ has no member named ‘fillPath’; did you mean ‘fill_path’?
  186. 606 | m_blContext->fillPath(getBLPath(finalTransformedStrokedPath));
  187. | ^~~~~~~~
  188. | fill_path
  189. /tmp/makepkg/pdf4qt/src/pdf4qt.git/Pdf4QtLibCore/sources/pdfblpainter.cpp:619:22: error: ‘class BLContext’ has no member named ‘fillPath’; did you mean ‘fill_path’?
  190. 619 | m_blContext->fillPath(blPath);
  191. | ^~~~~~~~
  192. | fill_path
  193. /tmp/makepkg/pdf4qt/src/pdf4qt.git/Pdf4QtLibCore/sources/pdfblpainter.cpp:624:22: error: ‘class BLContext’ has no member named ‘strokePath’; did you mean ‘stroke_path’?
  194. 624 | m_blContext->strokePath(blPath);
  195. | ^~~~~~~~~~
  196. | stroke_path
  197. /tmp/makepkg/pdf4qt/src/pdf4qt.git/Pdf4QtLibCore/sources/pdfblpainter.cpp: In member function ‘virtual void pdf::PDFBLPaintEngine::drawPoints(const QPointF*, int)’:
  198. /tmp/makepkg/pdf4qt/src/pdf4qt.git/Pdf4QtLibCore/sources/pdfblpainter.cpp:631:18: error: ‘class BLContext’ has no member named ‘setFillStyle’; did you mean ‘set_fill_style’?
  199. 631 | m_blContext->setFillStyle(BLRgba32(m_currentPen.color().rgba()));
  200. | ^~~~~~~~~~~~
  201. | set_fill_style
  202. /tmp/makepkg/pdf4qt/src/pdf4qt.git/Pdf4QtLibCore/sources/pdfblpainter.cpp:643:22: error: ‘class BLContext’ has no member named ‘fillEllipse’; did you mean ‘fill_ellipse’?
  203. 643 | m_blContext->fillEllipse(blEllipse);
  204. | ^~~~~~~~~~~
  205. | fill_ellipse
  206. /tmp/makepkg/pdf4qt/src/pdf4qt.git/Pdf4QtLibCore/sources/pdfblpainter.cpp: In member function ‘virtual void pdf::PDFBLPaintEngine::drawPoints(const QPoint*, int)’:
  207. /tmp/makepkg/pdf4qt/src/pdf4qt.git/Pdf4QtLibCore/sources/pdfblpainter.cpp:652:18: error: ‘class BLContext’ has no member named ‘setFillStyle’; did you mean ‘set_fill_style’?
  208. 652 | m_blContext->setFillStyle(BLRgba32(m_currentPen.color().rgba()));
  209. | ^~~~~~~~~~~~
  210. | set_fill_style
  211. /tmp/makepkg/pdf4qt/src/pdf4qt.git/Pdf4QtLibCore/sources/pdfblpainter.cpp:664:22: error: ‘class BLContext’ has no member named ‘fillEllipse’; did you mean ‘fill_ellipse’?
  212. 664 | m_blContext->fillEllipse(blEllipse);
  213. | ^~~~~~~~~~~
  214. | fill_ellipse
  215. /tmp/makepkg/pdf4qt/src/pdf4qt.git/Pdf4QtLibCore/sources/pdfblpainter.cpp: In member function ‘virtual void pdf::PDFBLPaintEngine::drawTiledPixmap(const QRectF&, const QPixmap&, const QPointF&)’:
  216. /tmp/makepkg/pdf4qt/src/pdf4qt.git/Pdf4QtLibCore/sources/pdfblpainter.cpp:719:13: error: ‘class BLImage’ has no member named ‘createFromData’; did you mean ‘create_from_data’?
  217. 719 | blImage.createFromData(image.width(), image.height(), BL_FORMAT_PRGB32, image.bits(), image.bytesPerLine());
  218. | ^~~~~~~~~~~~~~
  219. | create_from_data
  220. /tmp/makepkg/pdf4qt/src/pdf4qt.git/Pdf4QtLibCore/sources/pdfblpainter.cpp:722:17: error: ‘class BLImage’ has no member named ‘assignDeep’; did you mean ‘assign_deep’?
  221. 722 | blDrawImage.assignDeep(blImage);
  222. | ^~~~~~~~~~
  223. | assign_deep
  224. /tmp/makepkg/pdf4qt/src/pdf4qt.git/Pdf4QtLibCore/sources/pdfblpainter.cpp:733:30: error: ‘class BLContext’ has no member named ‘blitImage’; did you mean ‘blit_image’?
  225. 733 | m_blContext->blitImage(getBLPoint(tilePos), blDrawImage);
  226. | ^~~~~~~~~
  227. | blit_image
  228. /tmp/makepkg/pdf4qt/src/pdf4qt.git/Pdf4QtLibCore/sources/pdfblpainter.cpp: In member function ‘virtual void pdf::PDFBLPaintEngine::drawImage(const QRectF&, const QImage&, const QRectF&, Qt::ImageConversionFlags)’:
  229. /tmp/makepkg/pdf4qt/src/pdf4qt.git/Pdf4QtLibCore/sources/pdfblpainter.cpp:779:13: error: ‘class BLImage’ has no member named ‘createFromData’; did you mean ‘create_from_data’?
  230. 779 | blImage.createFromData(image.width(), image.height(), BL_FORMAT_PRGB32, image.bits(), image.bytesPerLine());
  231. | ^~~~~~~~~~~~~~
  232. | create_from_data
  233. /tmp/makepkg/pdf4qt/src/pdf4qt.git/Pdf4QtLibCore/sources/pdfblpainter.cpp:782:17: error: ‘class BLImage’ has no member named ‘assignDeep’; did you mean ‘assign_deep’?
  234. 782 | blDrawImage.assignDeep(blImage);
  235. | ^~~~~~~~~~
  236. | assign_deep
  237. /tmp/makepkg/pdf4qt/src/pdf4qt.git/Pdf4QtLibCore/sources/pdfblpainter.cpp:784:18: error: ‘class BLContext’ has no member named ‘blitImage’; did you mean ‘blit_image’?
  238. 784 | m_blContext->blitImage(BLRect(r.x(), r.y(), r.width(), r.height()),
  239. | ^~~~~~~~~
  240. | blit_image
  241. /tmp/makepkg/pdf4qt/src/pdf4qt.git/Pdf4QtLibCore/sources/pdfblpainter.cpp: In static member function ‘static BLPath pdf::PDFBLPaintEngine::getBLPath(const QPainterPath&)’:
  242. /tmp/makepkg/pdf4qt/src/pdf4qt.git/Pdf4QtLibCore/sources/pdfblpainter.cpp:841:20: error: ‘class BLPath’ has no member named ‘moveTo’; did you mean ‘MoveTo’?
  243. 841 | blPath.moveTo(element.x, element.y);
  244. | ^~~~~~
  245. | MoveTo
  246. /tmp/makepkg/pdf4qt/src/pdf4qt.git/Pdf4QtLibCore/sources/pdfblpainter.cpp:845:20: error: ‘class BLPath’ has no member named ‘lineTo’; did you mean ‘LineTo’?
  247. 845 | blPath.lineTo(element.x, element.y);
  248. | ^~~~~~
  249. | LineTo
  250. /tmp/makepkg/pdf4qt/src/pdf4qt.git/Pdf4QtLibCore/sources/pdfblpainter.cpp:854:24: error: ‘class BLPath’ has no member named ‘cubicTo’; did you mean ‘CubicTo’?
  251. 854 | blPath.cubicTo(ctrlPoint1.x, ctrlPoint1.y, ctrlPoint2.x, ctrlPoint2.y, endPoint.x, endPoint.y);
  252. | ^~~~~~~
  253. | CubicTo
  254. /tmp/makepkg/pdf4qt/src/pdf4qt.git/Pdf4QtLibCore/sources/pdfblpainter.cpp: In static member function ‘static void pdf::PDFBLPaintEngine::setBLPen(BLContext&, const QPen&)’:
  255. /tmp/makepkg/pdf4qt/src/pdf4qt.git/Pdf4QtLibCore/sources/pdfblpainter.cpp:878:13: error: ‘class BLContext’ has no member named ‘setStrokeAlpha’; did you mean ‘set_stroke_alpha’?
  256. 878 | context.setStrokeAlpha(pen.color().alphaF());
  257. | ^~~~~~~~~~~~~~
  258. | set_stroke_alpha
  259. /tmp/makepkg/pdf4qt/src/pdf4qt.git/Pdf4QtLibCore/sources/pdfblpainter.cpp:879:13: error: ‘class BLContext’ has no member named ‘setStrokeWidth’; did you mean ‘set_stroke_width’?
  260. 879 | context.setStrokeWidth(width);
  261. | ^~~~~~~~~~~~~~
  262. | set_stroke_width
  263. /tmp/makepkg/pdf4qt/src/pdf4qt.git/Pdf4QtLibCore/sources/pdfblpainter.cpp:880:13: error: ‘class BLContext’ has no member named ‘setStrokeMiterLimit’; did you mean ‘set_stroke_miter_limit’?
  264. 880 | context.setStrokeMiterLimit(miterLimit);
  265. | ^~~~~~~~~~~~~~~~~~~
  266. | set_stroke_miter_limit
  267. /tmp/makepkg/pdf4qt/src/pdf4qt.git/Pdf4QtLibCore/sources/pdfblpainter.cpp:885:17: error: ‘class BLContext’ has no member named ‘setStrokeCaps’; did you mean ‘set_stroke_caps’?
  268. 885 | context.setStrokeCaps(BL_STROKE_CAP_BUTT);
  269. | ^~~~~~~~~~~~~
  270. | set_stroke_caps
  271. /tmp/makepkg/pdf4qt/src/pdf4qt.git/Pdf4QtLibCore/sources/pdfblpainter.cpp:888:17: error: ‘class BLContext’ has no member named ‘setStrokeCaps’; did you mean ‘set_stroke_caps’?
  272. 888 | context.setStrokeCaps(BL_STROKE_CAP_SQUARE);
  273. | ^~~~~~~~~~~~~
  274. | set_stroke_caps
  275. /tmp/makepkg/pdf4qt/src/pdf4qt.git/Pdf4QtLibCore/sources/pdfblpainter.cpp:891:17: error: ‘class BLContext’ has no member named ‘setStrokeCaps’; did you mean ‘set_stroke_caps’?
  276. 891 | context.setStrokeCaps(BL_STROKE_CAP_ROUND);
  277. | ^~~~~~~~~~~~~
  278. | set_stroke_caps
  279. /tmp/makepkg/pdf4qt/src/pdf4qt.git/Pdf4QtLibCore/sources/pdfblpainter.cpp:902:13: error: ‘class BLContext’ has no member named ‘setStrokeDashOffset’; did you mean ‘set_stroke_dash_offset’?
  280. 902 | context.setStrokeDashOffset(dashOffset);
  281. | ^~~~~~~~~~~~~~~~~~~
  282. | set_stroke_dash_offset
  283. /tmp/makepkg/pdf4qt/src/pdf4qt.git/Pdf4QtLibCore/sources/pdfblpainter.cpp:903:13: error: ‘class BLContext’ has no member named ‘setStrokeDashArray’; did you mean ‘set_stroke_dash_array’?
  284. 903 | context.setStrokeDashArray(dashArray);
  285. | ^~~~~~~~~~~~~~~~~~
  286. | set_stroke_dash_array
  287. /tmp/makepkg/pdf4qt/src/pdf4qt.git/Pdf4QtLibCore/sources/pdfblpainter.cpp:908:17: error: ‘class BLContext’ has no member named ‘setStrokeJoin’; did you mean ‘set_stroke_join’?
  288. 908 | context.setStrokeJoin(BL_STROKE_JOIN_MITER_CLIP);
  289. | ^~~~~~~~~~~~~
  290. | set_stroke_join
  291. /tmp/makepkg/pdf4qt/src/pdf4qt.git/Pdf4QtLibCore/sources/pdfblpainter.cpp:911:17: error: ‘class BLContext’ has no member named ‘setStrokeJoin’; did you mean ‘set_stroke_join’?
  292. 911 | context.setStrokeJoin(BL_STROKE_JOIN_BEVEL);
  293. | ^~~~~~~~~~~~~
  294. | set_stroke_join
  295. /tmp/makepkg/pdf4qt/src/pdf4qt.git/Pdf4QtLibCore/sources/pdfblpainter.cpp:914:17: error: ‘class BLContext’ has no member named ‘setStrokeJoin’; did you mean ‘set_stroke_join’?
  296. 914 | context.setStrokeJoin(BL_STROKE_JOIN_ROUND);
  297. | ^~~~~~~~~~~~~
  298. | set_stroke_join
  299. /tmp/makepkg/pdf4qt/src/pdf4qt.git/Pdf4QtLibCore/sources/pdfblpainter.cpp:917:17: error: ‘class BLContext’ has no member named ‘setStrokeJoin’; did you mean ‘set_stroke_join’?
  300. 917 | context.setStrokeJoin(BL_STROKE_JOIN_MITER_CLIP);
  301. | ^~~~~~~~~~~~~
  302. | set_stroke_join
  303. /tmp/makepkg/pdf4qt/src/pdf4qt.git/Pdf4QtLibCore/sources/pdfblpainter.cpp:921:13: error: ‘class BLContext’ has no member named ‘setStrokeStyle’; did you mean ‘set_stroke_style’?
  304. 921 | context.setStrokeStyle(BLRgba32(color.rgba()));
  305. | ^~~~~~~~~~~~~~
  306. | set_stroke_style
  307. /tmp/makepkg/pdf4qt/src/pdf4qt.git/Pdf4QtLibCore/sources/pdfblpainter.cpp:923:45: error: ‘class BLContext’ has no member named ‘strokeOptions’; did you mean ‘stroke_options’?
  308. 923 | BLStrokeOptions strokeOptions = context.strokeOptions();
  309. | ^~~~~~~~~~~~~
  310. | stroke_options
  311. /tmp/makepkg/pdf4qt/src/pdf4qt.git/Pdf4QtLibCore/sources/pdfblpainter.cpp:928:23: error: ‘class BLStrokeOptions’ has no member named ‘dashArray’
  312. 928 | strokeOptions.dashArray.clear();
  313. | ^~~~~~~~~
  314. /tmp/makepkg/pdf4qt/src/pdf4qt.git/Pdf4QtLibCore/sources/pdfblpainter.cpp:929:23: error: ‘class BLStrokeOptions’ has no member named ‘dashOffset’; did you mean ‘dash_offset’?
  315. 929 | strokeOptions.dashOffset = 0.0;
  316. | ^~~~~~~~~~
  317. | dash_offset
  318. /tmp/makepkg/pdf4qt/src/pdf4qt.git/Pdf4QtLibCore/sources/pdfblpainter.cpp:935:23: error: ‘class BLStrokeOptions’ has no member named ‘dashArray’
  319. 935 | strokeOptions.dashArray.assignData(dashPattern, std::size(dashPattern));
  320. | ^~~~~~~~~
  321. /tmp/makepkg/pdf4qt/src/pdf4qt.git/Pdf4QtLibCore/sources/pdfblpainter.cpp:942:23: error: ‘class BLStrokeOptions’ has no member named ‘dashArray’
  322. 942 | strokeOptions.dashArray.assignData(dashPattern, std::size(dashPattern));
  323. | ^~~~~~~~~
  324. /tmp/makepkg/pdf4qt/src/pdf4qt.git/Pdf4QtLibCore/sources/pdfblpainter.cpp:949:23: error: ‘class BLStrokeOptions’ has no member named ‘dashArray’
  325. 949 | strokeOptions.dashArray.assignData(dashPattern, std::size(dashPattern));
  326. | ^~~~~~~~~
  327. /tmp/makepkg/pdf4qt/src/pdf4qt.git/Pdf4QtLibCore/sources/pdfblpainter.cpp:956:23: error: ‘class BLStrokeOptions’ has no member named ‘dashArray’
  328. 956 | strokeOptions.dashArray.assignData(dashPattern, std::size(dashPattern));
  329. | ^~~~~~~~~
  330. /tmp/makepkg/pdf4qt/src/pdf4qt.git/Pdf4QtLibCore/sources/pdfblpainter.cpp:963:23: error: ‘class BLStrokeOptions’ has no member named ‘dashArray’
  331. 963 | strokeOptions.dashArray.assignData(dashPattern.data(), dashPattern.size());
  332. | ^~~~~~~~~
  333. /tmp/makepkg/pdf4qt/src/pdf4qt.git/Pdf4QtLibCore/sources/pdfblpainter.cpp:964:23: error: ‘class BLStrokeOptions’ has no member named ‘dashOffset’; did you mean ‘dash_offset’?
  334. 964 | strokeOptions.dashOffset = pen.dashOffset();
  335. | ^~~~~~~~~~
  336. | dash_offset
  337. /tmp/makepkg/pdf4qt/src/pdf4qt.git/Pdf4QtLibCore/sources/pdfblpainter.cpp:972:13: error: ‘class BLContext’ has no member named ‘setStrokeOptions’; did you mean ‘set_stroke_options’?
  338. 972 | context.setStrokeOptions(strokeOptions);
  339. | ^~~~~~~~~~~~~~~~
  340. | set_stroke_options
  341. /tmp/makepkg/pdf4qt/src/pdf4qt.git/Pdf4QtLibCore/sources/pdfblpainter.cpp: In lambda function:
  342. /tmp/makepkg/pdf4qt/src/pdf4qt.git/Pdf4QtLibCore/sources/pdfblpainter.cpp:984:20: error: ‘class BLGradient’ has no member named ‘assignStops’; did you mean ‘assign_stops’? [-Wtemplate-body]
  343. 984 | blGradient.assignStops(stops.constData(), stops.size());
  344. | ^~~~~~~~~~~
  345. | assign_stops
  346. /tmp/makepkg/pdf4qt/src/pdf4qt.git/Pdf4QtLibCore/sources/pdfblpainter.cpp: In static member function ‘static void pdf::PDFBLPaintEngine::setBLBrush(BLContext&, const QBrush&)’:
  347. /tmp/makepkg/pdf4qt/src/pdf4qt.git/Pdf4QtLibCore/sources/pdfblpainter.cpp:994:21: error: ‘class BLContext’ has no member named ‘setFillStyle’; did you mean ‘set_fill_style’?
  348. 994 | context.setFillStyle(blColor);
  349. | ^~~~~~~~~~~~
  350. | set_fill_style
  351. /tmp/makepkg/pdf4qt/src/pdf4qt.git/Pdf4QtLibCore/sources/pdfblpainter.cpp:1010:25: error: ‘class BLContext’ has no member named ‘setFillStyle’; did you mean ‘set_fill_style’?
  352. 1010 | context.setFillStyle(blGradient);
  353. | ^~~~~~~~~~~~
  354. | set_fill_style
  355. /tmp/makepkg/pdf4qt/src/pdf4qt.git/Pdf4QtLibCore/sources/pdfblpainter.cpp:1028:25: error: ‘class BLContext’ has no member named ‘setFillStyle’; did you mean ‘set_fill_style’?
  356. 1028 | context.setFillStyle(blGradient);
  357. | ^~~~~~~~~~~~
  358. | set_fill_style
  359. /tmp/makepkg/pdf4qt/src/pdf4qt.git/Pdf4QtLibCore/sources/pdfblpainter.cpp: In static member function ‘static bool pdf::PDFBLPaintEngine::loadBLFont(BLFont&, QString, pdf::PDFReal)’:
  360. /tmp/makepkg/pdf4qt/src/pdf4qt.git/Pdf4QtLibCore/sources/pdfblpainter.cpp:1040:20: error: ‘class BLFontData’ has no member named ‘createFromData’; did you mean ‘create_from_data’?
  361. 1040 | if (blFontData.createFromData(data.data(), data.size()) == BL_SUCCESS)
  362. | ^~~~~~~~~~~~~~
  363. | create_from_data
  364. /tmp/makepkg/pdf4qt/src/pdf4qt.git/Pdf4QtLibCore/sources/pdfblpainter.cpp:1043:22: error: ‘class BLFontFace’ has no member named ‘createFromData’; did you mean ‘create_from_data’?
  365. 1043 | if (fontFace.createFromData(blFontData, 0) == BL_SUCCESS)
  366. | ^~~~~~~~~~~~~~
  367. | create_from_data
  368. /tmp/makepkg/pdf4qt/src/pdf4qt.git/Pdf4QtLibCore/sources/pdfblpainter.cpp:1045:22: error: ‘class BLFont’ has no member named ‘createFromFace’; did you mean ‘create_from_face’?
  369. 1045 | if (font.createFromFace(fontFace, fontSize) == BL_SUCCESS)
  370. | ^~~~~~~~~~~~~~
  371. | create_from_face
  372. /tmp/makepkg/pdf4qt/src/pdf4qt.git/Pdf4QtLibCore/sources/pdfblpainter.cpp: In member function ‘void pdf::PDFBLPaintEngine::updateClipping(std::optional<QRegion>, std::optional<QPainterPath>, Qt::ClipOperation)’:
  373. /tmp/makepkg/pdf4qt/src/pdf4qt.git/Pdf4QtLibCore/sources/pdfblpainter.cpp:1157:26: error: ‘class BLContext’ has no member named ‘restoreClipping’; did you mean ‘restore_clipping’?
  374. 1157 | m_blContext->restoreClipping();
  375. | ^~~~~~~~~~~~~~~
  376. | restore_clipping
  377. /tmp/makepkg/pdf4qt/src/pdf4qt.git/Pdf4QtLibCore/sources/pdfblpainter.cpp:1191:42: error: ‘class BLContext’ has no member named ‘userTransform’; did you mean ‘user_transform’?
  378. 1191 | BLMatrix2D matrix = m_blContext->userTransform();
  379. | ^~~~~~~~~~~~~
  380. | user_transform
  381. /tmp/makepkg/pdf4qt/src/pdf4qt.git/Pdf4QtLibCore/sources/pdfblpainter.cpp:1192:22: error: ‘class BLContext’ has no member named ‘resetTransform’; did you mean ‘reset_transform’?
  382. 1192 | m_blContext->resetTransform();
  383. | ^~~~~~~~~~~~~~
  384. | reset_transform
  385. /tmp/makepkg/pdf4qt/src/pdf4qt.git/Pdf4QtLibCore/sources/pdfblpainter.cpp:1193:22: error: ‘class BLContext’ has no member named ‘clipToRect’; did you mean ‘clip_to_rect’?
  386. 1193 | m_blContext->clipToRect(getBLRect(m_finalClipPath->boundingRect()));
  387. | ^~~~~~~~~~
  388. | clip_to_rect
  389. /tmp/makepkg/pdf4qt/src/pdf4qt.git/Pdf4QtLibCore/sources/pdfblpainter.cpp:1194:22: error: ‘class BLContext’ has no member named ‘setTransform’; did you mean ‘set_transform’?
  390. 1194 | m_blContext->setTransform(matrix);
  391. | ^~~~~~~~~~~~
  392. | set_transform
  393. /tmp/makepkg/pdf4qt/src/pdf4qt.git/Pdf4QtLibCore/sources/pdfblpainter.cpp:1198:22: error: ‘class BLContext’ has no member named ‘restoreClipping’; did you mean ‘restore_clipping’?
  394. 1198 | m_blContext->restoreClipping();
  395. | ^~~~~~~~~~~~~~~
  396. | restore_clipping
  397. /tmp/makepkg/pdf4qt/src/pdf4qt.git/Pdf4QtLibCore/sources/pdfblpainter.cpp: In member function ‘void pdf::PDFBLPaintEngine::setFillRule(Qt::FillRule)’:
  398. /tmp/makepkg/pdf4qt/src/pdf4qt.git/Pdf4QtLibCore/sources/pdfblpainter.cpp:1315:18: error: ‘class BLContext’ has no member named ‘setFillRule’; did you mean ‘set_fill_rule’?
  399. 1315 | m_blContext->setFillRule(blFillRule);
  400. | ^~~~~~~~~~~
  401. | set_fill_rule
  402. make[2]: *** [Pdf4QtLibCore/CMakeFiles/Pdf4QtLibCore.dir/build.make:1205: Pdf4QtLibCore/CMakeFiles/Pdf4QtLibCore.dir/sources/pdfblpainter.cpp.o] Error 1
  403. make[2]: *** Waiting for unfinished jobs....
  404. make[1]: *** [CMakeFiles/Makefile2:950: Pdf4QtLibCore/CMakeFiles/Pdf4QtLibCore.dir/all] Error 2
  405. make: *** [Makefile:136: all] Error 2
  406. ==> ERROR: A failure occurred in build().
  407. Aborting...
  408. error: failed to build 'pdf4qt-1.5.1.0-2':
Advertisement
Add Comment
Please, Sign In to add comment