Advertisement
dreamworker

Untitled

Apr 27th, 2020
1,565
Never
Not a member of Pastebin yet? Sign Up, it unlocks many cool features!
  1. [ERROR] COMPILATION ERROR :
  2. [INFO] -------------------------------------------------------------
  3. [ERROR] /home/khatuncev/Рабочий стол/folder/others/cms-backend/core/src/main/java/com/github/geekuniversity_java_215/cmsbackend/entites/Address.java:[3,14] package lombok does not exist
  4. [ERROR] /home/khatuncev/Рабочий стол/folder/others/cms-backend/core/src/main/java/com/github/geekuniversity_java_215/cmsbackend/entites/Address.java:[4,14] package lombok does not exist
  5. [ERROR] /home/khatuncev/Рабочий стол/folder/others/cms-backend/core/src/main/java/com/github/geekuniversity_java_215/cmsbackend/entites/Address.java:[5,14] package lombok does not exist
  6. [ERROR] /home/khatuncev/Рабочий стол/folder/others/cms-backend/core/src/main/java/com/github/geekuniversity_java_215/cmsbackend/entites/Address.java:[10,2] cannot find symbol
  7.   symbol: class AllArgsConstructor
  8. [ERROR] /home/khatuncev/Рабочий стол/folder/others/cms-backend/core/src/main/java/com/github/geekuniversity_java_215/cmsbackend/entites/Address.java:[11,2] cannot find symbol
  9.   symbol: class Getter
  10. [ERROR] /home/khatuncev/Рабочий стол/folder/others/cms-backend/core/src/main/java/com/github/geekuniversity_java_215/cmsbackend/entites/Address.java:[12,2] cannot find symbol
  11.   symbol: class Setter
  12. [INFO] 6 errors
  13. [INFO] -------------------------------------------------------------
  14. [INFO] ------------------------------------------------------------------------
  15. [INFO] Reactor Summary for cms-backend 0.1:
  16. [INFO]
  17. [INFO] cms-backend ........................................ SUCCESS [  0.003 s]
  18. [INFO] protocol ........................................... SUCCESS [  0.822 s]
  19. [INFO] core ............................................... FAILURE [  1.249 s]
  20. [INFO] geodata ............................................ SKIPPED
  21. [INFO] ------------------------------------------------------------------------
  22. [INFO] BUILD FAILURE
Advertisement
RAW Paste Data Copied
Advertisement