SHARE
TWEET

Untitled

a guest Mar 21st, 2016 49 Never
Not a member of Pastebin yet? Sign Up, it unlocks many cool features!
  1.  
  2. deleteSelectedAxoObjInstances()
  3. loaded : /Users/jojo/Documents/axoloti/patches/march2016/rockafella.axs
  4. instance added, type rockafella
  5. Generate code complete
  6. Start creating directory on sdcard : /rockafellatest
  7. creating dir: /rockafellatest
  8. Done creating directory
  9. Changing working directory on sdcard : /rockafellatest
  10. Change working directory: /rockafellatest
  11. Done changing working directory
  12. Start compiling patch
  13. Compiling patch... with /Applications/Axoloti.app/Contents/Java/firmware
  14. BDIR = /Users/jojo/Documents/axoloti/build
  15. FIRMWARE = .
  16. RM
  17. rm -f /Users/jojo/Documents/axoloti/build/xpatch.o /Users/jojo/Documents/axoloti/build/xpatch.elf /Users/jojo/Documents/axoloti/build/xpatch.bin /Users/jojo/Documents/axoloti/build/xpatch.d /Users/jojo/Documents/axoloti/build/xpatch.map /Users/jojo/Documents/axoloti/build/xpatch.lst
  18. APP
  19. arm-none-eabi-g++ -nostdlib -fno-exceptions -fno-rtti -mcpu=cortex-m4 -O3 -fomit-frame-pointer -falign-functions=16 -mfloat-abi=hard -mfpu=fpv4-sp-d16 -fsingle-precision-constant -Wunused-parameter -DCORTEX_USE_FPU=TRUE -DTHUMB_PRESENT -mno-thumb-interwork -DTHUMB_NO_INTERWORKING -mthumb -DTHUMB -std=c++11 -DARM_MATH_CM4 -D__FPU_PRESENT -H -I/Applications/Axoloti.app/Contents/Java/CMSIS/Include -I/Applications/Axoloti.app/Contents/Java/chibios/os/ports/common/ARMCMx/CMSIS/include -I/Applications/Axoloti.app/Contents/Java/chibios/os/ports/common/ARMCMx -I/Applications/Axoloti.app/Contents/Java/chibios/os/ports/GCC/ARMCMx -I/Applications/Axoloti.app/Contents/Java/chibios/os/ports/GCC/ARMCMx/STM32F4xx -I/Applications/Axoloti.app/Contents/Java/chibios/os/kernel/include -I/Applications/Axoloti.app/Contents/Java/chibios/os/hal/include -I/Applications/Axoloti.app/Contents/Java/chibios/os/hal/platforms/STM32F4xx -I/Applications/Axoloti.app/Contents/Java/chibios/os/hal/platforms/STM32 -I/Applications/Axoloti.app/Contents/Java/chibios/os/hal/platforms/STM32/GPIOv2 -I/Applications/Axoloti.app/Contents/Java/chibios/os/hal/platforms/STM32/I2Cv1 -I/Applications/Axoloti.app/Contents/Java/chibios/os/hal/platforms/STM32/OTGv1 -I/Applications/Axoloti.app/Contents/Java/chibios/os/hal/platforms/STM32/RTCv2 -I/Applications/Axoloti.app/Contents/Java/chibios/os/hal/platforms/STM32/SPIv1 -I/Applications/Axoloti.app/Contents/Java/chibios/os/hal/platforms/STM32/TIMv1 -I/Applications/Axoloti.app/Contents/Java/chibios/os/hal/platforms/STM32/USARTv1 -I/Applications/Axoloti.app/Contents/Java/chibios/boards/ST_STM32F4_DISCOVERY -I/Applications/Axoloti.app/Contents/Java/chibios/ext/fatfs/src -I. -I/Applications/Axoloti.app/Contents/Java/chibios -Winvalid-pch -MD -MP --include /Users/jojo/Documents/axoloti/build/xpatch.h -c /Users/jojo/Documents/axoloti/build/xpatch.cpp -o /Users/jojo/Documents/axoloti/build/xpatch.o
  20. ! /Users/jojo/Documents/axoloti/build/xpatch.h.gch
  21. /Users/jojo/Documents/axoloti/build/xpatch.cpp: In member function 'void rootc::instancerockafella__1::instanceplay__1::dsp(const int32_t*, int32_t (&)[16])':
  22. /Users/jojo/Documents/axoloti/build/xpatch.cpp:543:43: error: 'class rootc' has no member named 'instancesample_i'
  23.      int index = asat>>(27-parent->parent->instancesample_i.LENGTHPOW);
  24.                                            ^
  25. /Users/jojo/Documents/axoloti/build/xpatch.cpp:544:33: error: 'class rootc' has no member named 'instancesample_i'
  26.     int32_t y1 = parent->parent->instancesample_i.array[index]<<parent->parent->instancesample_i.GAIN;
  27.                                  ^
  28. /Users/jojo/Documents/axoloti/build/xpatch.cpp:544:80: error: 'class rootc' has no member named 'instancesample_i'
  29.     int32_t y1 = parent->parent->instancesample_i.array[index]<<parent->parent->instancesample_i.GAIN;
  30.                                                                                 ^
  31. /Users/jojo/Documents/axoloti/build/xpatch.cpp:545:33: error: 'class rootc' has no member named 'instancesample_i'
  32.     int32_t y2 = parent->parent->instancesample_i.array[(index+1)&parent->parent->instancesample_i.LENGTHMASK]<<parent->parent->instancesample_i.GAIN;
  33.                                  ^
  34. /Users/jojo/Documents/axoloti/build/xpatch.cpp:545:82: error: 'class rootc' has no member named 'instancesample_i'
  35.     int32_t y2 = parent->parent->instancesample_i.array[(index+1)&parent->parent->instancesample_i.LENGTHMASK]<<parent->parent->instancesample_i.GAIN;
  36.                                                                                   ^
  37. /Users/jojo/Documents/axoloti/build/xpatch.cpp:545:128: error: 'class rootc' has no member named 'instancesample_i'
  38.     int32_t y2 = parent->parent->instancesample_i.array[(index+1)&parent->parent->instancesample_i.LENGTHMASK]<<parent->parent->instancesample_i.GAIN;
  39.                                                                                                                                 ^
  40. /Users/jojo/Documents/axoloti/build/xpatch.cpp:546:51: error: 'class rootc' has no member named 'instancesample_i'
  41.     int frac = (asat - (index<<(27-parent->parent->instancesample_i.LENGTHPOW)))<<(parent->parent->instancesample_i.LENGTHPOW+3);
  42.                                                    ^
  43. /Users/jojo/Documents/axoloti/build/xpatch.cpp:546:99: error: 'class rootc' has no member named 'instancesample_i'
  44.     int frac = (asat - (index<<(27-parent->parent->instancesample_i.LENGTHPOW)))<<(parent->parent->instancesample_i.LENGTHPOW+3);
  45.                                                                                                    ^
  46. /Users/jojo/Documents/axoloti/build/xpatch.cpp: In member function 'void rootc::instancerockafella__1::instanceplay__2::dsp(const int32_t*, int32_t (&)[16])':
  47. /Users/jojo/Documents/axoloti/build/xpatch.cpp:782:43: error: 'class rootc' has no member named 'instancesample_i'
  48.      int index = asat>>(27-parent->parent->instancesample_i.LENGTHPOW);
  49.                                            ^
  50. /Users/jojo/Documents/axoloti/build/xpatch.cpp:783:33: error: 'class rootc' has no member named 'instancesample_i'
  51.     int32_t y1 = parent->parent->instancesample_i.array[index]<<parent->parent->instancesample_i.GAIN;
  52.                                  ^
  53. /Users/jojo/Documents/axoloti/build/xpatch.cpp:783:80: error: 'class rootc' has no member named 'instancesample_i'
  54.     int32_t y1 = parent->parent->instancesample_i.array[index]<<parent->parent->instancesample_i.GAIN;
  55.                                                                                 ^
  56. /Users/jojo/Documents/axoloti/build/xpatch.cpp:784:33: error: 'class rootc' has no member named 'instancesample_i'
  57.     int32_t y2 = parent->parent->instancesample_i.array[(index+1)&parent->parent->instancesample_i.LENGTHMASK]<<parent->parent->instancesample_i.GAIN;
  58.                                  ^
  59. /Users/jojo/Documents/axoloti/build/xpatch.cpp:784:82: error: 'class rootc' has no member named 'instancesample_i'
  60.     int32_t y2 = parent->parent->instancesample_i.array[(index+1)&parent->parent->instancesample_i.LENGTHMASK]<<parent->parent->instancesample_i.GAIN;
  61.                                                                                   ^
  62. /Users/jojo/Documents/axoloti/build/xpatch.cpp:784:128: error: 'class rootc' has no member named 'instancesample_i'
  63.     int32_t y2 = parent->parent->instancesample_i.array[(index+1)&parent->parent->instancesample_i.LENGTHMASK]<<parent->parent->instancesample_i.GAIN;
  64.                                                                                                                                 ^
  65. /Users/jojo/Documents/axoloti/build/xpatch.cpp:785:51: error: 'class rootc' has no member named 'instancesample_i'
  66.     int frac = (asat - (index<<(27-parent->parent->instancesample_i.LENGTHPOW)))<<(parent->parent->instancesample_i.LENGTHPOW+3);
  67.                                                    ^
  68. /Users/jojo/Documents/axoloti/build/xpatch.cpp:785:99: error: 'class rootc' has no member named 'instancesample_i'
  69.     int frac = (asat - (index<<(27-parent->parent->instancesample_i.LENGTHPOW)))<<(parent->parent->instancesample_i.LENGTHPOW+3);
  70.                                                                                                    ^
  71. make: *** [/Users/jojo/Documents/axoloti/build/xpatch.bin] Error 1
  72. shell task failed, exit value: 2
  73. Compiling patch failed ( /Users/jojo/Documents/axoloti/patches/march2016/rockafellatest.axp )
RAW Paste Data
We use cookies for various purposes including analytics. By continuing to use Pastebin, you agree to our use of cookies as described in the Cookies Policy. OK, I Understand
Top