SHARE
TWEET

Untitled

a guest Dec 14th, 2019 72 Never
Not a member of Pastebin yet? Sign Up, it unlocks many cool features!
  1. Scanning dependencies of target LLVMExegesisAArch64
  2. [ 95%] Building CXX object tools/llvm-exegesis/lib/AArch64/CMakeFiles/LLVMExegesisAArch64.dir/Target.cpp.o
  3. clang-9: error: unable to execute command: Killed
  4. clang-9: error: linker command failed due to signal (use -v to see invocation)
  5. tools/lli/CMakeFiles/lli.dir/build.make:139: recipe for target 'bin/lli' failed
  6. make[2]: *** [bin/lli] Error 254
  7. CMakeFiles/Makefile2:80430: recipe for target 'tools/lli/CMakeFiles/lli.dir/all' failed
  8. make[1]: *** [tools/lli/CMakeFiles/lli.dir/all] Error 2
  9. make[1]: *** Waiting for unfinished jobs....
  10. [ 95%] Linking CXX static library ../../../../lib/libLLVMExegesisAArch64.a
  11. [ 95%] Built target LLVMExegesisAArch64
  12. Makefile:151: recipe for target 'all' failed
  13. make: *** [all] Error 2
  14.  ! [Errno 29] Illegal seek
  15.  x Failed to start the command
  16.  x Exiting due to failure
  17. ===
  18.  
  19.  x Build failed
RAW Paste Data
We use cookies for various purposes including analytics. By continuing to use Pastebin, you agree to our use of cookies as described in the Cookies Policy. OK, I Understand
Not a member of Pastebin yet?
Sign Up, it unlocks many cool features!
 
Top