Not a member of Pastebin yet?
Sign Up,
it unlocks many cool features!
- Geo jr@Geo MINGW64 ~/openmrs-core (TRUNK-4986)
- $ mvn clean install
- [INFO] Scanning for projects...
- [INFO] ------------------------------------------------------------------------
- [INFO] Reactor Build Order:
- [INFO]
- [INFO] OpenMRS
- [INFO] openmrs-tools
- [INFO] openmrs-test
- [INFO] openmrs-api
- [INFO] openmrs-web
- [INFO] openmrs-webapp
- [INFO]
- [INFO] ------------------------------------------------------------------------
- [INFO] Building OpenMRS 2.3.0-SNAPSHOT
- [INFO] ------------------------------------------------------------------------
- [INFO]
- [INFO] --- maven-clean-plugin:2.5:clean (default-clean) @ openmrs ---
- [INFO] Deleting C:\Users\Admin\openmrs-core\target
- [INFO]
- [INFO] --- buildnumber-maven-plugin:1.1:create (default) @ openmrs ---
- [INFO] Checking for local modifications: skipped.
- [INFO] Updating project files from SCM: skipped.
- [INFO] ShortRevision tag detected. The value is '6'.
- [INFO] Executing: cmd.exe /X /C "git rev-parse --verify --short=6 HEAD"
- [INFO] Working directory: C:\Users\Admin\openmrs-core
- [INFO] Storing buildNumber: a346ec at timestamp: 1562278833243
- [INFO] ShortRevision tag detected. The value is '6'.
- [INFO] Executing: cmd.exe /X /C "git rev-parse --verify --short=6 HEAD"
- [INFO] Working directory: C:\Users\Admin\openmrs-core
- [INFO] Storing buildScmBranch: UNKNOWN
- [INFO]
- [INFO] --- build-helper-maven-plugin:1.5:parse-version (parse-version) @ openmrs ---
- [INFO]
- [INFO] --- maven-jar-plugin:2.3.2:test-jar (default) @ openmrs ---
- [WARNING] JAR will be empty - no content was marked for inclusion!
- [INFO] Building jar: C:\Users\Admin\openmrs-core\target\openmrs-2.3.0-SNAPSHOT-tests.jar
- [INFO]
- [INFO] --- license-maven-plugin:3.0:check (default) @ openmrs ---
- [INFO] Checking licenses...
- [INFO]
- [INFO] --- maven-install-plugin:2.4:install (default-install) @ openmrs ---
- [INFO] Installing C:\Users\Admin\openmrs-core\pom.xml to C:\Users\Admin\.m2\repository\org\openmrs\openmrs\2.3.0-SNAPSHOT\openmrs-2.3.0-SNAPSHOT.pom
- [INFO] Installing C:\Users\Admin\openmrs-core\target\openmrs-2.3.0-SNAPSHOT-tests.jar to C:\Users\Admin\.m2\repository\org\openmrs\openmrs\2.3.0-SNAPSHOT\openmrs-2.3.0-SNAPSHOT-tests.jar
- [INFO]
- [INFO] ------------------------------------------------------------------------
- [INFO] Building openmrs-tools 2.3.0-SNAPSHOT
- [INFO] ------------------------------------------------------------------------
- [INFO]
- [INFO] --- maven-clean-plugin:2.5:clean (default-clean) @ openmrs-tools ---
- [INFO] Deleting C:\Users\Admin\openmrs-core\tools\target
- [INFO]
- [INFO] --- buildnumber-maven-plugin:1.1:create (default) @ openmrs-tools ---
- [INFO]
- [INFO] --- build-helper-maven-plugin:1.5:parse-version (parse-version) @ openmrs-tools ---
- [INFO]
- [INFO] --- maven-resources-plugin:2.4:resources (default-resources) @ openmrs-tools ---
- [INFO] Using 'UTF-8' encoding to copy filtered resources.
- [INFO] Copying 4 resources
- [INFO]
- [INFO] --- maven-compiler-plugin:2.1:compile (default-compile) @ openmrs-tools ---
- [INFO] Compiling 1 source file to C:\Users\Admin\openmrs-core\tools\target\classes
- [INFO]
- [INFO] --- maven-resources-plugin:2.4:testResources (default-testResources) @openmrs-tools ---
- [INFO] Using 'UTF-8' encoding to copy filtered resources.
- [INFO] skip non existing resourceDirectory C:\Users\Admin\openmrs-core\tools\src\test\resources
- [INFO]
- [INFO] --- maven-compiler-plugin:2.1:testCompile (default-testCompile) @ openmrs-tools ---
- [INFO] No sources to compile
- [INFO]
- [INFO] --- maven-surefire-plugin:2.18.1:test (default-test) @ openmrs-tools ---
- [INFO] No tests to run.
- [INFO]
- [INFO] --- maven-jar-plugin:2.3.2:jar (default-jar) @ openmrs-tools ---
- [INFO] Building jar: C:\Users\Admin\openmrs-core\tools\target\openmrs-tools-2.3.0-SNAPSHOT.jar
- [INFO]
- [INFO] --- maven-jar-plugin:2.3.2:test-jar (default) @ openmrs-tools ---
- [WARNING] JAR will be empty - no content was marked for inclusion!
- [INFO] Building jar: C:\Users\Admin\openmrs-core\tools\target\openmrs-tools-2.3.0-SNAPSHOT-tests.jar
- [INFO]
- [INFO] --- license-maven-plugin:3.0:check (default) @ openmrs-tools ---
- [INFO] Checking licenses...
- [INFO]
- [INFO] --- maven-install-plugin:2.4:install (default-install) @ openmrs-tools---
- [INFO] Installing C:\Users\Admin\openmrs-core\tools\target\openmrs-tools-2.3.0-SNAPSHOT.jar to C:\Users\Admin\.m2\repository\org\openmrs\tools\openmrs-tools\2.3.0-SNAPSHOT\openmrs-tools-2.3.0-SNAPSHOT.jar
- [INFO] Installing C:\Users\Admin\openmrs-core\tools\pom.xml to C:\Users\Admin\.m2\repository\org\openmrs\tools\openmrs-tools\2.3.0-SNAPSHOT\openmrs-tools-2.3.0-SNAPSHOT.pom
- [INFO] Installing C:\Users\Admin\openmrs-core\tools\target\openmrs-tools-2.3.0-SNAPSHOT-tests.jar to C:\Users\Admin\.m2\repository\org\openmrs\tools\openmrs-tools\2.3.0-SNAPSHOT\openmrs-tools-2.3.0-SNAPSHOT-tests.jar
- [INFO]
- [INFO] ------------------------------------------------------------------------
- [INFO] Building openmrs-test 2.3.0-SNAPSHOT
- [INFO] ------------------------------------------------------------------------
- [INFO]
- [INFO] --- maven-clean-plugin:2.5:clean (default-clean) @ openmrs-test ---
- [INFO] Deleting C:\Users\Admin\openmrs-core\test\target
- [INFO]
- [INFO] --- buildnumber-maven-plugin:1.1:create (default) @ openmrs-test ---
- [INFO]
- [INFO] --- build-helper-maven-plugin:1.5:parse-version (parse-version) @ openmrs-test ---
- [INFO]
- [INFO] --- maven-jar-plugin:2.3.2:test-jar (default) @ openmrs-test ---
- [WARNING] JAR will be empty - no content was marked for inclusion!
- [INFO] Building jar: C:\Users\Admin\openmrs-core\test\target\openmrs-test-2.3.0-SNAPSHOT-tests.jar
- [INFO]
- [INFO] --- license-maven-plugin:3.0:check (default) @ openmrs-test ---
- [INFO] Checking licenses...
- [INFO]
- [INFO] --- maven-install-plugin:2.4:install (default-install) @ openmrs-test ---
- [INFO] Installing C:\Users\Admin\openmrs-core\test\pom.xml to C:\Users\Admin\.m2\repository\org\openmrs\test\openmrs-test\2.3.0-SNAPSHOT\openmrs-test-2.3.0-SNAPSHOT.pom
- [INFO] Installing C:\Users\Admin\openmrs-core\test\target\openmrs-test-2.3.0-SNAPSHOT-tests.jar to C:\Users\Admin\.m2\repository\org\openmrs\test\openmrs-test\2.3.0-SNAPSHOT\openmrs-test-2.3.0-SNAPSHOT-tests.jar
- [INFO]
- [INFO] ------------------------------------------------------------------------
- [INFO] Building openmrs-api 2.3.0-SNAPSHOT
- [INFO] ------------------------------------------------------------------------
- [INFO]
- [INFO] --- maven-clean-plugin:2.5:clean (default-clean) @ openmrs-api ---
- [INFO] Deleting C:\Users\Admin\openmrs-core\api\target
- [INFO]
- [INFO] --- buildnumber-maven-plugin:1.1:create (default) @ openmrs-api ---
- [INFO]
- [INFO] --- build-helper-maven-plugin:1.5:parse-version (parse-version) @ openmrs-api ---
- [INFO]
- [INFO] --- jacoco-maven-plugin:0.8.0:prepare-agent (prepare-agent) @ openmrs-api ---
- [INFO] argLine set to -javaagent:C:\\Users\\Admin\\.m2\\repository\\org\\jacoco\\org.jacoco.agent\\0.8.0\\org.jacoco.agent-0.8.0-runtime.jar=destfile=C:\\Users\\Admin\\openmrs-core\\api\\target\\jacoco.exec,includes=org/openmrs/** -Duser.language=en -Duser.region=US -Xmx2g
- [INFO]
- [INFO] --- maven-java-formatter-plugin:0.3:format (default) @ openmrs-api ---
- [INFO] Using 'UTF-8' encoding to format source files.
- [INFO] Number of files to be formatted: 1031
- [INFO] Successfully formatted: 0 file(s)
- [INFO] Fail to format : 0 file(s)
- [INFO] Skipped : 1031 file(s)
- [INFO] Approximate time taken: 8s
- [INFO]
- [INFO] --- maven-resources-plugin:2.4:resources (default-resources) @ openmrs-api ---
- [INFO] Using 'UTF-8' encoding to copy filtered resources.
- [INFO] Copying 1 resource
- [INFO] Copying 133 resources
- [INFO]
- [INFO] --- maven-compiler-plugin:2.1:compile (default-compile) @ openmrs-api ---
- [INFO] Compiling 697 source files to C:\Users\Admin\openmrs-core\api\target\classes
- [INFO] -------------------------------------------------------------
- [ERROR] COMPILATION ERROR :
- [INFO] -------------------------------------------------------------
- [ERROR] \Users\Admin\openmrs-core\api\src\main\java\org\openmrs\util\databasechange\GenerateUuid.java:[109,30] error: cannot find symbol
- [ERROR] \Users\Admin\openmrs-core\api\src\main\java\org\openmrs\util\DatabaseUpdater.java:[207,28] error: cannot find symbol
- [ERROR] \Users\Admin\openmrs-core\api\src\main\java\org\openmrs\util\DatabaseUpdater.java:[219,11] error: cannot find symbol
- [ERROR] \Users\Admin\openmrs-core\api\src\main\java\org\openmrs\util\DatabaseUpdater.java:[390,11] error: cannot find symbol
- [ERROR] \Users\Admin\openmrs-core\api\src\main\java\org\openmrs\util\DatabaseUpdater.java:[731,15] error: cannot find symbol
- [ERROR] \Users\Admin\openmrs-core\api\src\main\java\org\openmrs\util\DatabaseUpdater.java:[732,15] error: cannot find symbol
- [ERROR] \Users\Admin\openmrs-core\api\src\main\java\org\openmrs\util\DatabaseUpdater.java:[759,21] error: cannot find symbol
- [INFO] 7 errors
- [INFO] -------------------------------------------------------------
- [INFO] ------------------------------------------------------------------------
- [INFO] Reactor Summary:
- [INFO]
- [INFO] OpenMRS ............................................ SUCCESS [ 3.695 s]
- [INFO] openmrs-tools ...................................... SUCCESS [ 1.981 s]
- [INFO] openmrs-test ....................................... SUCCESS [ 0.284 s]
- [INFO] openmrs-api ........................................ FAILURE [ 26.655 s]
- [INFO] openmrs-web ........................................ SKIPPED
- [INFO] openmrs-webapp ..................................... SKIPPED
- [INFO] ------------------------------------------------------------------------
- [INFO] BUILD FAILURE
- [INFO] ------------------------------------------------------------------------
- [INFO] Total time: 32.903 s
- [INFO] Finished at: 2019-07-05T01:21:04+03:00
- [INFO] Final Memory: 47M/446M
- [INFO] ------------------------------------------------------------------------
- [ERROR] Failed to execute goal org.apache.maven.plugins:maven-compiler-plugin:2.1:compile (default-compile) on project openmrs-api: Compilation failure: Compilation failure:
- [ERROR] \Users\Admin\openmrs-core\api\src\main\java\org\openmrs\util\databasechange\GenerateUuid.java:[109,30] error: cannot find symbol
- [ERROR]
- [ERROR] \Users\Admin\openmrs-core\api\src\main\java\org\openmrs\util\DatabaseUpdater.java:[207,28] error: cannot find symbol
- [ERROR]
- [ERROR] \Users\Admin\openmrs-core\api\src\main\java\org\openmrs\util\DatabaseUpdater.java:[219,11] error: cannot find symbol
- [ERROR]
- [ERROR] \Users\Admin\openmrs-core\api\src\main\java\org\openmrs\util\DatabaseUpdater.java:[390,11] error: cannot find symbol
- [ERROR]
- [ERROR] \Users\Admin\openmrs-core\api\src\main\java\org\openmrs\util\DatabaseUpdater.java:[731,15] error: cannot find symbol
- [ERROR]
- [ERROR] \Users\Admin\openmrs-core\api\src\main\java\org\openmrs\util\DatabaseUpdater.java:[732,15] error: cannot find symbol
- [ERROR]
- [ERROR] \Users\Admin\openmrs-core\api\src\main\java\org\openmrs\util\DatabaseUpdater.java:[759,21] error: cannot find symbol
- [ERROR] -> [Help 1]
- [ERROR]
- [ERROR] To see the full stack trace of the errors, re-run Maven with the -e switch.
- [ERROR] Re-run Maven using the -X switch to enable full debug logging.
- [ERROR]
- [ERROR] For more information about the errors and possible solutions, please read the following articles:
- [ERROR] [Help 1] http://cwiki.apache.org/confluence/display/MAVEN/MojoFailureException
- [ERROR]
- [ERROR] After correcting the problems, you can resume the build with the command
- [ERROR] mvn <goals> -rf :openmrs-api
Advertisement
Add Comment
Please, Sign In to add comment