Not a member of Pastebin yet?
Sign Up,
it unlocks many cool features!
- [root@cpanel apnscp]# git reset --hard v3.2.36
- HEAD is now at ff670fedc CHG: DEBUG_PROC happens too early (Util\Process)
- [root@cpanel apnscp]# chown -R apnscp:apnscp .
- [root@cpanel apnscp]# upcp
- warning: Pulling without specifying how to reconcile divergent branches is
- discouraged. You can squelch this message by running one of the following
- commands sometime before your next pull:
- git config pull.rebase false # merge (the default strategy)
- git config pull.rebase true # rebase
- git config pull.ff only # fast-forward only
- You can replace "git config" with "git config --global" to set a default
- preference for all repositories. You can also pass --rebase, --no-rebase,
- or --ff-only on the command line to override the configured default per
- invocation.
- From https://gitlab.com/apisnetworks/apnscp
- * branch master -> FETCH_HEAD
- error: The following untracked working tree files would be overwritten by merge:
- resources/playbooks/migrations/2023_05_26_160306_haproxy-update.yml
- resources/playbooks/migrations/2023_06_02_200612-block-systemd.yml
- Please move or remove them before you merge.
- Aborting
- Updating ff670fedc..80c0c200b
- Compiled services and packages files removed!
- Nothing to migrate.
- Migrating: 2022_09_29_220249_postfix-sender-var
- PLAY [localhost] ***************************************************************
- included: /usr/local/apnscp/resources/playbooks/migrations/2022_09_29_220249_postfix-sender-var.yml for localhost
- included: /usr/local/apnscp/resources/playbooks/roles/mail/configure-postfix/tasks/set-configuration.yml for localhost
- included: /usr/local/apnscp/resources/playbooks/roles/mail/configure-postfix/tasks/setup-cyrus.yml for localhost
- included: /usr/local/apnscp/resources/playbooks/roles/mail/configure-postfix/tasks/register-password.yml for localhost
- included: /usr/local/apnscp/resources/playbooks/roles/mail/configure-postfix/tasks/install-postsrs.yml for localhost
- included: /usr/local/apnscp/resources/playbooks/roles/common/tasks/implicitly-import-overrides.yml for localhost
- included: /usr/local/apnscp/resources/playbooks/roles/mail/configure-postfix/tasks/set-configuration.yml for localhost
- included: /usr/local/apnscp/resources/playbooks/roles/mail/configure-postfix/tasks/manage-alias.yml for localhost
- included: /usr/local/apnscp/resources/playbooks/roles/mail/configure-postfix/tasks/manage-alias.yml for localhost
- included: /usr/local/apnscp/resources/playbooks/roles/software/argos/tasks/toggle-service.yml for localhost
- included: /usr/local/apnscp/resources/playbooks/roles/software/argos/tasks/toggle-service.yml for localhost
- included: /usr/local/apnscp/resources/playbooks/roles/software/argos/tasks/toggle-service.yml for localhost
- included: /usr/local/apnscp/resources/playbooks/roles/software/argos/tasks/toggle-service.yml for localhost
- included: /usr/local/apnscp/resources/playbooks/roles/software/argos/tasks/toggle-service.yml for localhost
- included: /usr/local/apnscp/resources/playbooks/roles/software/argos/tasks/toggle-service.yml for localhost
- included: /usr/local/apnscp/resources/playbooks/roles/software/argos/tasks/toggle-service.yml for localhost
- included: /usr/local/apnscp/resources/playbooks/roles/software/argos/tasks/toggle-service.yml for localhost
- included: /usr/local/apnscp/resources/playbooks/roles/software/argos/tasks/toggle-service.yml for localhost
- included: /usr/local/apnscp/resources/playbooks/roles/clamav/setup/tasks/setup-clamav.yml for localhost
- FAILED - RETRYING: Install clamav packages (2 retries left).
- FAILED - RETRYING: Install clamav packages (1 retries left).
- TASK [clamav/setup : Install clamav packages] **********************************
- fatal: [localhost]: FAILED! => {"attempts": 2, "changed": false, "failures": [], "msg": "Depsolve Error occured: \n Problem 1: conflicting requests\n - nothing provides libjson-c.so.4(JSONC_0.14)(64bit) needed by clamav-0.103.11-1.el8.x86_64\n Problem 2: conflicting requests\n - nothing provides libjson-c.so.4(JSONC_0.14)(64bit) needed by clamav-lib-0.103.11-1.el8.x86_64\n Problem 3: package clamd-0.103.11-1.el8.x86_64 requires libclamav.so.9()(64bit), but none of the providers can be installed\n - package clamd-0.103.11-1.el8.x86_64 requires libclamav.so.9(CLAMAV_PUBLIC)(64bit), but none of the providers can be installed\n - package clamd-0.103.11-1.el8.x86_64 requires libclamav.so.9(CLAMAV_PRIVATE)(64bit), but none of the providers can be installed\n - package clamd-0.103.11-1.el8.x86_64 requires clamav-lib = 0.103.11-1.el8, but none of the providers can be installed\n - conflicting requests\n - nothing provides libjson-c.so.4(JSONC_0.14)(64bit) needed by clamav-lib-0.103.11-1.el8.x86_64\n Problem 4: package clamav-update-0.103.11-1.el8.x86_64 requires libclamav.so.9()(64bit), but none of the providers can be installed\n - package clamav-update-0.103.11-1.el8.x86_64 requires libclamav.so.9(CLAMAV_PUBLIC)(64bit), but none of the providers can be installed\n - package clamav-update-0.103.11-1.el8.x86_64 requires libclamav.so.9(CLAMAV_PRIVATE)(64bit), but none of the providers can be installed\n - package clamav-update-0.103.11-1.el8.x86_64 requires clamav-lib = 0.103.11-1.el8, but none of the providers can be installed\n - conflicting requests\n - nothing provides libjson-c.so.4(JSONC_0.14)(64bit) needed by clamav-lib-0.103.11-1.el8.x86_64\n Problem 5: package clamav-devel-0.103.11-1.el8.x86_64 requires libclamav.so.9()(64bit), but none of the providers can be installed\n - package clamav-devel-0.103.11-1.el8.x86_64 requires libclammspack.so.0()(64bit), but none of the providers can be installed\n - package clamav-devel-0.103.11-1.el8.x86_64 requires clamav-lib = 0.103.11-1.el8, but none of the providers can be installed\n - conflicting requests\n - nothing provides libjson-c.so.4(JSONC_0.14)(64bit) needed by clamav-lib-0.103.11-1.el8.x86_64\n Problem 6: package clamav-unofficial-sigs-7.2.5-11.el8.noarch requires clamav, but none of the providers can be installed\n - conflicting requests\n - nothing provides libjson-c.so.4(JSONC_0.14)(64bit) needed by clamav-0.103.11-1.el8.x86_64", "rc": 1, "results": []}
- PLAY RECAP *********************************************************************
- localhost : ok=81 changed=0 unreachable=0 failed=1 skipped=29 rescued=0 ignored=0
- (RuntimeException) EXCEPTION: STDOUT:
- PLAY [localhost] ***************************************************************
- included: /usr/local/apnscp/resources/playbooks/migrations/2022_09_29_220249_postfix-sender-var.yml for localhost
- included: /usr/local/apnscp/resources/playbooks/roles/mail/configure-postfix/tasks/set-configuration.yml for localhost
- included: /usr/local/apnscp/resources/playbooks/roles/mail/configure-postfix/tasks/setup-cyrus.yml for localhost
- included: /usr/local/apnscp/resources/playbooks/roles/mail/configure-postfix/tasks/register-password.yml for localhost
- included: /usr/local/apnscp/resources/playbooks/roles/mail/configure-postfix/tasks/install-postsrs.yml for localhost
- included: /usr/local/apnscp/resources/playbooks/roles/common/tasks/implicitly-import-overrides.yml for localhost
- included: /usr/local/apnscp/resources/playbooks/roles/mail/configure-postfix/tasks/set-configuration.yml for localhost
- included: /usr/local/apnscp/resources/playbooks/roles/mail/configure-postfix/tasks/manage-alias.yml for localhost
- included: /usr/local/apnscp/resources/playbooks/roles/mail/configure-postfix/tasks/manage-alias.yml for localhost
- included: /usr/local/apnscp/resources/playbooks/roles/software/argos/tasks/toggle-service.yml for localhost
- included: /usr/local/apnscp/resources/playbooks/roles/software/argos/tasks/toggle-service.yml for localhost
- included: /usr/local/apnscp/resources/playbooks/roles/software/argos/tasks/toggle-service.yml for localhost
- included: /usr/local/apnscp/resources/playbooks/roles/software/argos/tasks/toggle-service.yml for localhost
- included: /usr/local/apnscp/resources/playbooks/roles/software/argos/tasks/toggle-service.yml for localhost
- included: /usr/local/apnscp/resources/playbooks/roles/software/argos/tasks/toggle-service.yml for localhost
- included: /usr/local/apnscp/resources/playbooks/roles/software/argos/tasks/toggle-service.yml for localhost
- included: /usr/local/apnscp/resources/playbooks/roles/software/argos/tasks/toggle-service.yml for localhost
- included: /usr/local/apnscp/resources/playbooks/roles/software/argos/tasks/toggle-service.yml for localhost
- included: /usr/local/apnscp/resources/playbooks/roles/clamav/setup/tasks/setup-clamav.yml for localhost
- FAILED - RETRYING: Install clamav packages (2 retries left).
- FAILED - RETRYING: Install clamav packages (1 retries left).
- TASK [clamav/setup : Install clamav packages] **********************************
- fatal: [localhost]: FAILED! => {"attempts": 2, "changed": false, "failures": [], "msg": "Depsolve Error occured: \n Problem 1: conflicting requests\n - nothing provides libjson-c.so.4(JSONC_0.14)(64bit) needed by clamav-0.103.11-1.el8.x86_64\n Problem 2: conflicting requests\n - nothing provides libjson-c.so.4(JSONC_0.14)(64bit) needed by clamav-lib-0.103.11-1.el8.x86_64\n Problem 3: package clamd-0.103.11-1.el8.x86_64 requires libclamav.so.9()(64bit), but none of the providers can be installed\n - package clamd-0.103.11-1.el8.x86_64 requires libclamav.so.9(CLAMAV_PUBLIC)(64bit), but none of the providers can be installed\n - package clamd-0.103.11-1.el8.x86_64 requires libclamav.so.9(CLAMAV_PRIVATE)(64bit), but none of the providers can be installed\n - package clamd-0.103.11-1.el8.x86_64 requires clamav-lib = 0.103.11-1.el8, but none of the providers can be installed\n - conflicting requests\n - nothing provides libjson-c.so.4(JSONC_0.14)(64bit) needed by clamav-lib-0.103.11-1.el8.x86_64\n Problem 4: package clamav-update-0.103.11-1.el8.x86_64 requires libclamav.so.9()(64bit), but none of the providers can be installed\n - package clamav-update-0.103.11-1.el8.x86_64 requires libclamav.so.9(CLAMAV_PUBLIC)(64bit), but none of the providers can be installed\n - package clamav-update-0.103.11-1.el8.x86_64 requires libclamav.so.9(CLAMAV_PRIVATE)(64bit), but none of the providers can be installed\n - package clamav-update-0.103.11-1.el8.x86_64 requires clamav-lib = 0.103.11-1.el8, but none of the providers can be installed\n - conflicting requests\n - nothing provides libjson-c.so.4(JSONC_0.14)(64bit) needed by clamav-lib-0.103.11-1.el8.x86_64\n Problem 5: package clamav-devel-0.103.11-1.el8.x86_64 requires libclamav.so.9()(64bit), but none of the providers can be installed\n - package clamav-devel-0.103.11-1.el8.x86_64 requires libclammspack.so.0()(64bit), but none of the providers can be installed\n - package clamav-devel-0.103.11-1.el8.x86_64 requires clamav-lib = 0.103.11-1.el8, but none of the providers can be installed\n - conflicting requests\n - nothing provides libjson-c.so.4(JSONC_0.14)(64bit) needed by clamav-lib-0.103.11-1.el8.x86_64\n Problem 6: package clamav-unofficial-sigs-7.2.5-11.el8.noarch requires clamav, but none of the providers can be installed\n - conflicting requests\n - nothing provides libjson-c.so.4(JSONC_0.14)(64bit) needed by clamav-0.103.11-1.el8.x86_64", "rc": 1, "results": []}
- PLAY RECAP *********************************************************************
- localhost : ok=81 changed=0 unreachable=0 failed=1 skipped=29 rescued=0 ignored=0
- STDERR:
- [/usr/local/apnscp/lib/Lararia/Database/Migrations/PlatformMigrator.php:204]
- EXCEPTION: STDOUT:
- PLAY [localhost] ***************************************************************
- included: /usr/local/apnscp/resources/playbooks/migrations/2022_09_29_220249_postfix-sender-var.yml for localhost
- included: /usr/local/apnscp/resources/playbooks/roles/mail/configure-postfix/tasks/set-configuration.yml for localhost
- included: /usr/local/apnscp/resources/playbooks/roles/mail/configure-postfix/tasks/setup-cyrus.yml for localhost
- included: /usr/local/apnscp/resources/playbooks/roles/mail/configure-postfix/tasks/register-password.yml for localhost
- included: /usr/local/apnscp/resources/playbooks/roles/mail/configure-postfix/tasks/install-postsrs.yml for localhost
- included: /usr/local/apnscp/resources/playbooks/roles/common/tasks/implicitly-import-overrides.yml for localhost
- included: /usr/local/apnscp/resources/playbooks/roles/mail/configure-postfix/tasks/set-configuration.yml for localhost
- included: /usr/local/apnscp/resources/playbooks/roles/mail/configure-postfix/tasks/manage-alias.yml for localhost
- included: /usr/local/apnscp/resources/playbooks/roles/mail/configure-postfix/tasks/manage-alias.yml for localhost
- included: /usr/local/apnscp/resources/playbooks/roles/software/argos/tasks/toggle-service.yml for localhost
- included: /usr/local/apnscp/resources/playbooks/roles/software/argos/tasks/toggle-service.yml for localhost
- included: /usr/local/apnscp/resources/playbooks/roles/software/argos/tasks/toggle-service.yml for localhost
- included: /usr/local/apnscp/resources/playbooks/roles/software/argos/tasks/toggle-service.yml for localhost
- included: /usr/local/apnscp/resources/playbooks/roles/software/argos/tasks/toggle-service.yml for localhost
- included: /usr/local/apnscp/resources/playbooks/roles/software/argos/tasks/toggle-service.yml for localhost
- included: /usr/local/apnscp/resources/playbooks/roles/software/argos/tasks/toggle-service.yml for localhost
- included: /usr/local/apnscp/resources/playbooks/roles/software/argos/tasks/toggle-service.yml for localhost
- included: /usr/local/apnscp/resources/playbooks/roles/software/argos/tasks/toggle-service.yml for localhost
- included: /usr/local/apnscp/resources/playbooks/roles/clamav/setup/tasks/setup-clamav.yml for localhost
- FAILED - RETRYING: Install clamav packages (2 retries left).
- FAILED - RETRYING: Install clamav packages (1 retries left).
- TASK [clamav/setup : Install clamav packages] **********************************
- fatal: [localhost]: FAILED! => {"attempts": 2, "changed": false, "failures": [], "msg": "Depsolve Error occured: \n Problem 1: conflicting requests\n - nothing provides libjson-c.so.4(JSONC_0.14)(64bit) needed by clamav-0.103.11-1.el8.x86_64\n Problem 2: conflicting requests\n - nothing provides libjson-c.so.4(JSONC_0.14)(64bit) needed by clamav-lib-0.103.11-1.el8.x86_64\n Problem 3: package clamd-0.103.11-1.el8.x86_64 requires libclamav.so.9()(64bit), but none of the providers can be installed\n - package clamd-0.103.11-1.el8.x86_64 requires libclamav.so.9(CLAMAV_PUBLIC)(64bit), but none of the providers can be installed\n - package clamd-0.103.11-1.el8.x86_64 requires libclamav.so.9(CLAMAV_PRIVATE)(64bit), but none of the providers can be installed\n - package clamd-0.103.11-1.el8.x86_64 requires clamav-lib = 0.103.11-1.el8, but none of the providers can be installed\n - conflicting requests\n - nothing provides libjson-c.so.4(JSONC_0.14)(64bit) needed by clamav-lib-0.103.11-1.el8.x86_64\n Problem 4: package clamav-update-0.103.11-1.el8.x86_64 requires libclamav.so.9()(64bit), but none of the providers can be installed\n - package clamav-update-0.103.11-1.el8.x86_64 requires libclamav.so.9(CLAMAV_PUBLIC)(64bit), but none of the providers can be installed\n - package clamav-update-0.103.11-1.el8.x86_64 requires libclamav.so.9(CLAMAV_PRIVATE)(64bit), but none of the providers can be installed\n - package clamav-update-0.103.11-1.el8.x86_64 requires clamav-lib = 0.103.11-1.el8, but none of the providers can be installed\n - conflicting requests\n - nothing provides libjson-c.so.4(JSONC_0.14)(64bit) needed by clamav-lib-0.103.11-1.el8.x86_64\n Problem 5: package clamav-devel-0.103.11-1.el8.x86_64 requires libclamav.so.9()(64bit), but none of the providers can be installed\n - package clamav-devel-0.103.11-1.el8.x86_64 requires libclammspack.so.0()(64bit), but none of the providers can be installed\n - package clamav-devel-0.103.11-1.el8.x86_64 requires clamav-lib = 0.103.11-1.el8, but none of the providers can be installed\n - conflicting requests\n - nothing provides libjson-c.so.4(JSONC_0.14)(64bit) needed by clamav-lib-0.103.11-1.el8.x86_64\n Problem 6: package clamav-unofficial-sigs-7.2.5-11.el8.noarch requires clamav, but none of the providers can be installed\n - conflicting requests\n - nothing provides libjson-c.so.4(JSONC_0.14)(64bit) needed by clamav-0.103.11-1.el8.x86_64", "rc": 1, "results": []}
- PLAY RECAP *********************************************************************
- localhost : ok=81 changed=0 unreachable=0 failed=1 skipped=29 rescued=0 ignored=0
- STDERR:
- [/usr/local/apnscp/lib/Lararia/Database/Migrations/PlatformMigrator.php:204]
- 0. Lararia\Database\Migrations\PlatformMigrator->runMigration("2022_09_29_220249_postfix-sender-var", "up", [step:true])
- [/usr/local/apnscp/lib/Lararia/Database/Migrations/PlatformMigrator.php:122]
- 1. Lararia\Database\Migrations\PlatformMigrator->runUp("/usr/local/apnscp/resources/playbooks/migrations/2022_09_29_220249_postfix-sender-var.yml", 50, false)
- [/usr/local/apnscp/vendor/laravel/framework/src/Illuminate/Database/Migrations/Migrator.php:165]
- 2. Illuminate\Database\Migrations\Migrator->runPending(["/usr/local/apnscp/resources/playbooks/migrations/2022_09_29_220249_postfix-sender-var.yml", "/usr/local/apnscp/resources/playbooks/migrations/2022_11_21_142201_dovecot-quota.yml", "/usr/local/apnscp/resources/playbooks/migrations/2023_01_11_122730_relocate-multiphp-extensions.yml", "/usr/local/apnscp/resources/playbooks/migrations/2023_01_31_101629_socket-actiation-fixup.yml", "/usr/local/apnscp/resources/playbooks/migrations/2023_05_26_160306_haproxy-update.yml", "/usr/local/apnscp/resources/playbooks/migrations/2023_06_02_200612-block-systemd.yml"], [pretend:false, step:0, rollback:false, ])
- [/usr/local/apnscp/lib/Lararia/Database/Migrations/PlatformMigrator.php:86]
- 3. Lararia\Database\Migrations\PlatformMigrator->runPending(["/usr/local/apnscp/resources/playbooks/migrations/2022_09_29_220249_postfix-sender-var.yml", "/usr/local/apnscp/resources/playbooks/migrations/2022_11_21_142201_dovecot-quota.yml", "/usr/local/apnscp/resources/playbooks/migrations/2023_01_11_122730_relocate-multiphp-extensions.yml", "/usr/local/apnscp/resources/playbooks/migrations/2023_01_31_101629_socket-actiation-fixup.yml", "/usr/local/apnscp/resources/playbooks/migrations/2023_05_26_160306_haproxy-update.yml", "/usr/local/apnscp/resources/playbooks/migrations/2023_06_02_200612-block-systemd.yml"], [pretend:false, step:0, rollback:false, ])
- [/usr/local/apnscp/vendor/laravel/framework/src/Illuminate/Database/Migrations/Migrator.php:110]
- 4. Illuminate\Database\Migrations\Migrator->run(["/usr/local/apnscp/resources/playbooks/migrations"], [pretend:false, step:0, rollback:false, ff:false])
- [/usr/local/apnscp/lib/Lararia/Database/Migrations/PlatformMigrator.php:40]
- 5. Lararia\Database\Migrations\PlatformMigrator->run(["/usr/local/apnscp/resources/playbooks/migrations"], [pretend:false, step:0, rollback:false, ff:false])
- [/usr/local/apnscp/lib/Lararia/Console/Commands/PlatformMigration.php:75]
- 6. Lararia\Console\Commands\PlatformMigration->handle()
- [/usr/local/apnscp/vendor/laravel/framework/src/Illuminate/Container/BoundMethod.php:36]
- 7. Illuminate\Container\BoundMethod::Illuminate\Container\{closure}()
- [/usr/local/apnscp/vendor/laravel/framework/src/Illuminate/Container/Util.php:37]
- 8. Illuminate\Container\Util::unwrapIfClosure()
- [/usr/local/apnscp/vendor/laravel/framework/src/Illuminate/Container/BoundMethod.php:93]
- 9. Illuminate\Container\BoundMethod::callBoundMethod(Lararia\Application, [Lararia\Console\Commands\PlatformMigration, "handle"], )
- [/usr/local/apnscp/vendor/laravel/framework/src/Illuminate/Container/BoundMethod.php:37]
- 10. Illuminate\Container\BoundMethod::call(Lararia\Application, [Lararia\Console\Commands\PlatformMigration, "handle"], null)
- [/usr/local/apnscp/vendor/laravel/framework/src/Illuminate/Container/Container.php:590]
- 11. Illuminate\Container\Container->call([Lararia\Console\Commands\PlatformMigration, "handle"])
- [/usr/local/apnscp/vendor/laravel/framework/src/Illuminate/Console/Command.php:134]
- 12. Illuminate\Console\Command->execute(Symfony\Component\Console\Input\ArrayInput, Illuminate\Console\OutputStyle)
- [/usr/local/apnscp/vendor/symfony/console/Command/Command.php:255]
- 13. Symfony\Component\Console\Command\Command->run(Symfony\Component\Console\Input\ArrayInput, Illuminate\Console\OutputStyle)
- [/usr/local/apnscp/vendor/laravel/framework/src/Illuminate/Console/Command.php:121]
- 14. Illuminate\Console\Command->run(Symfony\Component\Console\Input\ArrayInput, Illuminate\Console\OutputStyle)
- [/usr/local/apnscp/vendor/symfony/console/Application.php:1021]
- 15. Symfony\Component\Console\Application->doRunCommand(Lararia\Console\Commands\PlatformMigration, Symfony\Component\Console\Input\ArrayInput, Illuminate\Console\OutputStyle)
- [/usr/local/apnscp/vendor/symfony/console/Application.php:275]
- 16. Symfony\Component\Console\Application->doRun(Symfony\Component\Console\Input\ArrayInput, Illuminate\Console\OutputStyle)
- [/usr/local/apnscp/vendor/symfony/console/Application.php:149]
- 17. Symfony\Component\Console\Application->run(Symfony\Component\Console\Input\ArrayInput, Illuminate\Console\OutputStyle)
- [/usr/local/apnscp/vendor/laravel/framework/src/Illuminate/Console/Application.php:93]
- 18. Illuminate\Console\Application->run(Symfony\Component\Console\Input\ArrayInput, Illuminate\Console\OutputStyle)
- [/usr/local/apnscp/vendor/laravel/framework/src/Illuminate/Console/Application.php:185]
- 19. Illuminate\Console\Application->call("migrate:platform", [--force:true], Illuminate\Console\OutputStyle)
- [/usr/local/apnscp/vendor/laravel/framework/src/Illuminate/Foundation/Console/Kernel.php:273]
- 20. Illuminate\Foundation\Console\Kernel->call("migrate:platform", [--force:true], Illuminate\Console\OutputStyle)
- [/usr/local/apnscp/vendor/laravel/framework/src/Illuminate/Support/Facades/Facade.php:261]
- 21. Illuminate\Support\Facades\Facade::__callStatic("call", ["migrate:platform", [[--force:true], Illuminate\Console\OutputStyle]])
- [/usr/local/apnscp/lib/Lararia/Console/Commands/Migrate.php:52]
- 22. Lararia\Console\Commands\Migrate->handle()
- [/usr/local/apnscp/vendor/laravel/framework/src/Illuminate/Container/BoundMethod.php:36]
- 23. Illuminate\Container\BoundMethod::Illuminate\Container\{closure}()
- [/usr/local/apnscp/vendor/laravel/framework/src/Illuminate/Container/Util.php:37]
- 24. Illuminate\Container\Util::unwrapIfClosure()
- [/usr/local/apnscp/vendor/laravel/framework/src/Illuminate/Container/BoundMethod.php:93]
- 25. Illuminate\Container\BoundMethod::callBoundMethod(Lararia\Application, [Lararia\Console\Commands\Migrate, "handle"], )
- [/usr/local/apnscp/vendor/laravel/framework/src/Illuminate/Container/BoundMethod.php:37]
- 26. Illuminate\Container\BoundMethod::call(Lararia\Application, [Lararia\Console\Commands\Migrate, "handle"], null)
- [/usr/local/apnscp/vendor/laravel/framework/src/Illuminate/Container/Container.php:590]
- 27. Illuminate\Container\Container->call([Lararia\Console\Commands\Migrate, "handle"])
- [/usr/local/apnscp/vendor/laravel/framework/src/Illuminate/Console/Command.php:134]
- 28. Illuminate\Console\Command->execute(Symfony\Component\Console\Input\ArgvInput, Illuminate\Console\OutputStyle)
- [/usr/local/apnscp/vendor/symfony/console/Command/Command.php:255]
- 29. Symfony\Component\Console\Command\Command->run(Symfony\Component\Console\Input\ArgvInput, Illuminate\Console\OutputStyle)
- [/usr/local/apnscp/vendor/laravel/framework/src/Illuminate/Console/Command.php:121]
- 30. Illuminate\Console\Command->run(Symfony\Component\Console\Input\ArgvInput, Symfony\Component\Console\Output\ConsoleOutput)
- [/usr/local/apnscp/vendor/symfony/console/Application.php:1021]
- 31. Symfony\Component\Console\Application->doRunCommand(Lararia\Console\Commands\Migrate, Symfony\Component\Console\Input\ArgvInput, Symfony\Component\Console\Output\ConsoleOutput)
- [/usr/local/apnscp/vendor/symfony/console/Application.php:275]
- 32. Symfony\Component\Console\Application->doRun(Symfony\Component\Console\Input\ArgvInput, Symfony\Component\Console\Output\ConsoleOutput)
- [/usr/local/apnscp/vendor/symfony/console/Application.php:149]
- 33. Symfony\Component\Console\Application->run(Symfony\Component\Console\Input\ArgvInput, Symfony\Component\Console\Output\ConsoleOutput)
- [/usr/local/apnscp/vendor/laravel/framework/src/Illuminate/Console/Application.php:93]
- 34. Illuminate\Console\Application->run(Symfony\Component\Console\Input\ArgvInput, Symfony\Component\Console\Output\ConsoleOutput)
- [/usr/local/apnscp/vendor/laravel/framework/src/Illuminate/Foundation/Console/Kernel.php:131]
- 35. Illuminate\Foundation\Console\Kernel->handle(Symfony\Component\Console\Input\ArgvInput, Symfony\Component\Console\Output\ConsoleOutput)
- [/usr/local/apnscp/lib/Lararia/Console/Kernel.php:31]
- 36. Lararia\Console\Kernel->handle(Symfony\Component\Console\Input\ArgvInput, Symfony\Component\Console\Output\ConsoleOutput)
- [/usr/local/apnscp/artisan:69]
Advertisement
Add Comment
Please, Sign In to add comment