Guest User

Untitled

a guest
Sep 23rd, 2016
117
Never
Not a member of Pastebin yet? Sign Up, it unlocks many cool features!
  1. :compileArmv7ReleaseJava.../cordova_project/platforms/android/src/org/apache/cordova/firebase/FirebasePlugin.java:35: error: package me.leolin.shortcutbadger does not exist
  2. import me.leolin.shortcutbadger.ShortcutBadger;
  3. ^
  4. .../cordova_project/platforms/android/src/org/apache/cordova/firebase/FirebasePlugin.java:167: error: cannot find symbol
  5. ShortcutBadger.applyCount(context, number);
  6. ^
  7. symbol: variable ShortcutBadger
  8. Note: Some input files use or override a deprecated API.
  9. Note: Recompile with -Xlint:deprecation for details.
  10. 2 errors
  11. FAILED
  12.  
  13. FAILURE: Build failed with an exception.
  14.  
  15. * What went wrong:
  16. Execution failed for task ':compileArmv7ReleaseJava'.
  17. > Compilation failed; see the compiler error output for details.
  18.  
  19. * Try:
  20. Run with --stacktrace option to get the stack trace. Run with --info or --debug option to get more log output.
  21.  
  22. BUILD FAILED
  23.  
  24. Total time: 2 mins 27.582 secs
  25. ERROR building one of the platforms: Error: .../cordova_project/platforms/android/gradlew: Command failed with exit code 1
  26. You may not have the required environment or OS to build this project
  27. Error: .../cordova_project/platforms/android/gradlew: Command failed with exit code 1
  28. at ChildProcess.whenDone (.../cordova_project/platforms/android/cordova/node_modules/cordova-common/src/superspawn.js:139:23)
  29. at emitTwo (events.js:87:13)
  30. at ChildProcess.emit (events.js:172:7)
  31. at maybeClose (internal/child_process.js:821:16)
  32. at Process.ChildProcess._handle.onexit (internal/child_process.js:211:5)
RAW Paste Data