Guest User

CMakeError.log

a guest
Jan 5th, 2014
84
Never
Not a member of Pastebin yet? Sign Up, it unlocks many cool features!
  1. Determining if the include file cstdint exists failed with the following output:
  2. Change Dir: E:/Repos/Build/AnopeBuild/CMakeFiles/CMakeTmp
  3.  
  4. Run Build Command:nmake /NOLOGO "cmTryCompileExec1998166080\fast"
  5. "E:\Program Files (x86)\Microsoft Visual Studio 11.0\VC\BIN\nmake.exe" -f CMakeFiles\cmTryCompileExec1998166080.dir\build.make /nologo -L CMakeFiles\cmTryCompileExec1998166080.dir\build
  6.  
  7. "C:\Program Files (x86)\CMake 2.8\bin\cmake.exe" -E cmake_progress_report E:\Repos\Build\AnopeBuild\CMakeFiles\CMakeTmp\CMakeFiles 1
  8.  
  9. Building C object CMakeFiles/cmTryCompileExec1998166080.dir/CheckIncludeFile.c.obj
  10.  
  11. E:\PROGRA~1\MICROS~3.0\VC\bin\cl.exe @C:\Users\Chris\AppData\Local\Temp\nmC9FE.tmp
  12.  
  13. CheckIncludeFile.c
  14.  
  15. E:\Program Files (x86)\Microsoft Visual Studio 11.0\VC\INCLUDE\cstdint(18) : error C2054: expected '(' to follow 'using'
  16.  
  17. E:\Program Files (x86)\Microsoft Visual Studio 11.0\VC\INCLUDE\cstdint(18) : error C2061: syntax error : identifier 'using'
  18.  
  19. E:\Program Files (x86)\Microsoft Visual Studio 11.0\VC\INCLUDE\cstdint(19) : error C2054: expected '(' to follow 'using'
  20.  
  21. E:\Program Files (x86)\Microsoft Visual Studio 11.0\VC\INCLUDE\cstdint(19) : error C2061: syntax error : identifier 'using'
  22.  
  23. E:\Program Files (x86)\Microsoft Visual Studio 11.0\VC\INCLUDE\cstdint(20) : error C2054: expected '(' to follow 'using'
  24.  
  25. E:\Program Files (x86)\Microsoft Visual Studio 11.0\VC\INCLUDE\cstdint(20) : error C2061: syntax error : identifier 'using'
  26.  
  27. E:\Program Files (x86)\Microsoft Visual Studio 11.0\VC\INCLUDE\cstdint(21) : error C2054: expected '(' to follow 'using'
  28.  
  29. E:\Program Files (x86)\Microsoft Visual Studio 11.0\VC\INCLUDE\cstdint(21) : error C2061: syntax error : identifier 'using'
  30.  
  31. E:\Program Files (x86)\Microsoft Visual Studio 11.0\VC\INCLUDE\cstdint(23) : error C2054: expected '(' to follow 'using'
  32.  
  33. E:\Program Files (x86)\Microsoft Visual Studio 11.0\VC\INCLUDE\cstdint(23) : error C2061: syntax error : identifier 'using'
  34.  
  35. E:\Program Files (x86)\Microsoft Visual Studio 11.0\VC\INCLUDE\cstdint(24) : error C2054: expected '(' to follow 'using'
  36.  
  37. E:\Program Files (x86)\Microsoft Visual Studio 11.0\VC\INCLUDE\cstdint(24) : error C2061: syntax error : identifier 'using'
  38.  
  39. E:\Program Files (x86)\Microsoft Visual Studio 11.0\VC\INCLUDE\cstdint(25) : error C2054: expected '(' to follow 'using'
  40.  
  41. E:\Program Files (x86)\Microsoft Visual Studio 11.0\VC\INCLUDE\cstdint(25) : error C2061: syntax error : identifier 'using'
  42.  
  43. E:\Program Files (x86)\Microsoft Visual Studio 11.0\VC\INCLUDE\cstdint(26) : error C2054: expected '(' to follow 'using'
  44.  
  45. E:\Program Files (x86)\Microsoft Visual Studio 11.0\VC\INCLUDE\cstdint(26) : error C2061: syntax error : identifier 'using'
  46.  
  47. E:\Program Files (x86)\Microsoft Visual Studio 11.0\VC\INCLUDE\cstdint(28) : error C2054: expected '(' to follow 'using'
  48.  
  49. E:\Program Files (x86)\Microsoft Visual Studio 11.0\VC\INCLUDE\cstdint(28) : error C2061: syntax error : identifier 'using'
  50.  
  51. E:\Program Files (x86)\Microsoft Visual Studio 11.0\VC\INCLUDE\cstdint(29) : error C2054: expected '(' to follow 'using'
  52.  
  53. E:\Program Files (x86)\Microsoft Visual Studio 11.0\VC\INCLUDE\cstdint(29) : error C2061: syntax error : identifier 'using'
  54.  
  55. E:\Program Files (x86)\Microsoft Visual Studio 11.0\VC\INCLUDE\cstdint(30) : error C2054: expected '(' to follow 'using'
  56.  
  57. E:\Program Files (x86)\Microsoft Visual Studio 11.0\VC\INCLUDE\cstdint(30) : error C2061: syntax error : identifier 'using'
  58.  
  59. E:\Program Files (x86)\Microsoft Visual Studio 11.0\VC\INCLUDE\cstdint(31) : error C2054: expected '(' to follow 'using'
  60.  
  61. E:\Program Files (x86)\Microsoft Visual Studio 11.0\VC\INCLUDE\cstdint(31) : error C2061: syntax error : identifier 'using'
  62.  
  63. E:\Program Files (x86)\Microsoft Visual Studio 11.0\VC\INCLUDE\cstdint(33) : error C2054: expected '(' to follow 'using'
  64.  
  65. E:\Program Files (x86)\Microsoft Visual Studio 11.0\VC\INCLUDE\cstdint(33) : error C2061: syntax error : identifier 'using'
  66.  
  67. E:\Program Files (x86)\Microsoft Visual Studio 11.0\VC\INCLUDE\cstdint(34) : error C2054: expected '(' to follow 'using'
  68.  
  69. E:\Program Files (x86)\Microsoft Visual Studio 11.0\VC\INCLUDE\cstdint(34) : error C2061: syntax error : identifier 'using'
  70.  
  71. E:\Program Files (x86)\Microsoft Visual Studio 11.0\VC\INCLUDE\cstdint(36) : error C2061: syntax error : identifier 'tr1'
  72.  
  73. E:\Program Files (x86)\Microsoft Visual Studio 11.0\VC\INCLUDE\cstdint(36) : error C2059: syntax error : ';'
  74.  
  75. E:\Program Files (x86)\Microsoft Visual Studio 11.0\VC\INCLUDE\cstdint(36) : error C2449: found '{' at file scope (missing function header?)
  76.  
  77. E:\Program Files (x86)\Microsoft Visual Studio 11.0\VC\INCLUDE\cstdint(54) : error C2059: syntax error : '}'
  78.  
  79. NMAKE : fatal error U1077: 'E:\PROGRA~1\MICROS~3.0\VC\bin\cl.exe' : return code '0x2'
  80.  
  81. Stop.
  82.  
  83. NMAKE : fatal error U1077: '"E:\Program Files (x86)\Microsoft Visual Studio 11.0\VC\BIN\nmake.exe"' : return code '0x2'
  84.  
  85. Stop.
  86.  
  87.  
  88.  
  89. Determining if the include file strings.h exists failed with the following output:
  90. Change Dir: E:/Repos/Build/AnopeBuild/CMakeFiles/CMakeTmp
  91.  
  92. Run Build Command:nmake /NOLOGO "cmTryCompileExec2234056676\fast"
  93. "E:\Program Files (x86)\Microsoft Visual Studio 11.0\VC\BIN\nmake.exe" -f CMakeFiles\cmTryCompileExec2234056676.dir\build.make /nologo -L CMakeFiles\cmTryCompileExec2234056676.dir\build
  94.  
  95. "C:\Program Files (x86)\CMake 2.8\bin\cmake.exe" -E cmake_progress_report E:\Repos\Build\AnopeBuild\CMakeFiles\CMakeTmp\CMakeFiles 1
  96.  
  97. Building C object CMakeFiles/cmTryCompileExec2234056676.dir/CheckIncludeFile.c.obj
  98.  
  99. E:\PROGRA~1\MICROS~3.0\VC\bin\cl.exe @C:\Users\Chris\AppData\Local\Temp\nmCF3C.tmp
  100.  
  101. CheckIncludeFile.c
  102.  
  103. E:\Repos\Build\AnopeBuild\CMakeFiles\CMakeTmp\CheckIncludeFile.c(1) : fatal error C1083: Cannot open include file: 'strings.h': No such file or directory
  104.  
  105. NMAKE : fatal error U1077: 'E:\PROGRA~1\MICROS~3.0\VC\bin\cl.exe' : return code '0x2'
  106.  
  107. Stop.
  108.  
  109. NMAKE : fatal error U1077: '"E:\Program Files (x86)\Microsoft Visual Studio 11.0\VC\BIN\nmake.exe"' : return code '0x2'
  110.  
  111. Stop.
  112.  
  113.  
  114.  
  115. Determining if the function strcasecmp exists failed with the following output:
  116. Change Dir: E:/Repos/Build/AnopeBuild/CMakeFiles/CMakeTmp
  117.  
  118. Run Build Command:nmake /NOLOGO "cmTryCompileExec4240618417\fast"
  119. "E:\Program Files (x86)\Microsoft Visual Studio 11.0\VC\BIN\nmake.exe" -f CMakeFiles\cmTryCompileExec4240618417.dir\build.make /nologo -L CMakeFiles\cmTryCompileExec4240618417.dir\build
  120.  
  121. "C:\Program Files (x86)\CMake 2.8\bin\cmake.exe" -E cmake_progress_report E:\Repos\Build\AnopeBuild\CMakeFiles\CMakeTmp\CMakeFiles 1
  122.  
  123. Building C object CMakeFiles/cmTryCompileExec4240618417.dir/CheckFunctionExists.c.obj
  124.  
  125. E:\PROGRA~1\MICROS~3.0\VC\bin\cl.exe @C:\Users\Chris\AppData\Local\Temp\nmD026.tmp
  126.  
  127. CheckFunctionExists.c
  128.  
  129. Linking C executable cmTryCompileExec4240618417.exe
  130.  
  131. "C:\Program Files (x86)\CMake 2.8\bin\cmake.exe" -E vs_link_exe E:\PROGRA~1\MICROS~3.0\VC\bin\link.exe /nologo @CMakeFiles\cmTryCompileExec4240618417.dir\objects1.rsp @C:\Users\Chris\AppData\Local\Temp\nmD0B3.tmp
  132.  
  133. CheckFunctionExists.c.obj : error LNK2019: unresolved external symbol _strcasecmp referenced in function _main
  134.  
  135.  
  136. cmTryCompileExec4240618417.exe : fatal error LNK1120: 1 unresolved externals
  137.  
  138.  
  139. LINK Pass 1 failed. with 1120
  140.  
  141. NMAKE : fatal error U1077: '"C:\Program Files (x86)\CMake 2.8\bin\cmake.exe"' : return code '0xffffffff'
  142.  
  143. Stop.
  144.  
  145. NMAKE : fatal error U1077: '"E:\Program Files (x86)\Microsoft Visual Studio 11.0\VC\BIN\nmake.exe"' : return code '0x2'
  146.  
  147. Stop.
  148.  
  149.  
  150.  
  151. Determining if the function epoll_wait exists failed with the following output:
  152. Change Dir: E:/Repos/Build/AnopeBuild/CMakeFiles/CMakeTmp
  153.  
  154. Run Build Command:nmake /NOLOGO "cmTryCompileExec1748169722\fast"
  155. "E:\Program Files (x86)\Microsoft Visual Studio 11.0\VC\BIN\nmake.exe" -f CMakeFiles\cmTryCompileExec1748169722.dir\build.make /nologo -L CMakeFiles\cmTryCompileExec1748169722.dir\build
  156.  
  157. "C:\Program Files (x86)\CMake 2.8\bin\cmake.exe" -E cmake_progress_report E:\Repos\Build\AnopeBuild\CMakeFiles\CMakeTmp\CMakeFiles 1
  158.  
  159. Building C object CMakeFiles/cmTryCompileExec1748169722.dir/CheckFunctionExists.c.obj
  160.  
  161. E:\PROGRA~1\MICROS~3.0\VC\bin\cl.exe @C:\Users\Chris\AppData\Local\Temp\nmDA92.tmp
  162.  
  163. CheckFunctionExists.c
  164.  
  165. Linking C executable cmTryCompileExec1748169722.exe
  166.  
  167. "C:\Program Files (x86)\CMake 2.8\bin\cmake.exe" -E vs_link_exe E:\PROGRA~1\MICROS~3.0\VC\bin\link.exe /nologo @CMakeFiles\cmTryCompileExec1748169722.dir\objects1.rsp @C:\Users\Chris\AppData\Local\Temp\nmDB0F.tmp
  168.  
  169. CheckFunctionExists.c.obj : error LNK2019: unresolved external symbol _epoll_wait referenced in function _main
  170.  
  171.  
  172. cmTryCompileExec1748169722.exe : fatal error LNK1120: 1 unresolved externals
  173.  
  174.  
  175. LINK Pass 1 failed. with 1120
  176.  
  177. NMAKE : fatal error U1077: '"C:\Program Files (x86)\CMake 2.8\bin\cmake.exe"' : return code '0xffffffff'
  178.  
  179. Stop.
  180.  
  181. NMAKE : fatal error U1077: '"E:\Program Files (x86)\Microsoft Visual Studio 11.0\VC\BIN\nmake.exe"' : return code '0x2'
  182.  
  183. Stop.
  184.  
  185.  
  186.  
  187. Determining if the function poll exists failed with the following output:
  188. Change Dir: E:/Repos/Build/AnopeBuild/CMakeFiles/CMakeTmp
  189.  
  190. Run Build Command:nmake /NOLOGO "cmTryCompileExec3538594429\fast"
  191. "E:\Program Files (x86)\Microsoft Visual Studio 11.0\VC\BIN\nmake.exe" -f CMakeFiles\cmTryCompileExec3538594429.dir\build.make /nologo -L CMakeFiles\cmTryCompileExec3538594429.dir\build
  192.  
  193. "C:\Program Files (x86)\CMake 2.8\bin\cmake.exe" -E cmake_progress_report E:\Repos\Build\AnopeBuild\CMakeFiles\CMakeTmp\CMakeFiles 1
  194.  
  195. Building C object CMakeFiles/cmTryCompileExec3538594429.dir/CheckFunctionExists.c.obj
  196.  
  197. E:\PROGRA~1\MICROS~3.0\VC\bin\cl.exe @C:\Users\Chris\AppData\Local\Temp\nmDC75.tmp
  198.  
  199. CheckFunctionExists.c
  200.  
  201. Linking C executable cmTryCompileExec3538594429.exe
  202.  
  203. "C:\Program Files (x86)\CMake 2.8\bin\cmake.exe" -E vs_link_exe E:\PROGRA~1\MICROS~3.0\VC\bin\link.exe /nologo @CMakeFiles\cmTryCompileExec3538594429.dir\objects1.rsp @C:\Users\Chris\AppData\Local\Temp\nmDCF3.tmp
  204.  
  205. CheckFunctionExists.c.obj : error LNK2019: unresolved external symbol _poll referenced in function _main
  206.  
  207.  
  208. cmTryCompileExec3538594429.exe : fatal error LNK1120: 1 unresolved externals
  209.  
  210.  
  211. LINK Pass 1 failed. with 1120
  212.  
  213. NMAKE : fatal error U1077: '"C:\Program Files (x86)\CMake 2.8\bin\cmake.exe"' : return code '0xffffffff'
  214.  
  215. Stop.
  216.  
  217. NMAKE : fatal error U1077: '"E:\Program Files (x86)\Microsoft Visual Studio 11.0\VC\BIN\nmake.exe"' : return code '0x2'
  218.  
  219. Stop.
  220.  
  221.  
  222.  
  223. Determining if the function kqueue exists failed with the following output:
  224. Change Dir: E:/Repos/Build/AnopeBuild/CMakeFiles/CMakeTmp
  225.  
  226. Run Build Command:nmake /NOLOGO "cmTryCompileExec2832029070\fast"
  227. "E:\Program Files (x86)\Microsoft Visual Studio 11.0\VC\BIN\nmake.exe" -f CMakeFiles\cmTryCompileExec2832029070.dir\build.make /nologo -L CMakeFiles\cmTryCompileExec2832029070.dir\build
  228.  
  229. "C:\Program Files (x86)\CMake 2.8\bin\cmake.exe" -E cmake_progress_report E:\Repos\Build\AnopeBuild\CMakeFiles\CMakeTmp\CMakeFiles 1
  230.  
  231. Building C object CMakeFiles/cmTryCompileExec2832029070.dir/CheckFunctionExists.c.obj
  232.  
  233. E:\PROGRA~1\MICROS~3.0\VC\bin\cl.exe @C:\Users\Chris\AppData\Local\Temp\nmDE68.tmp
  234.  
  235. CheckFunctionExists.c
  236.  
  237. Linking C executable cmTryCompileExec2832029070.exe
  238.  
  239. "C:\Program Files (x86)\CMake 2.8\bin\cmake.exe" -E vs_link_exe E:\PROGRA~1\MICROS~3.0\VC\bin\link.exe /nologo @CMakeFiles\cmTryCompileExec2832029070.dir\objects1.rsp @C:\Users\Chris\AppData\Local\Temp\nmDEE6.tmp
  240.  
  241. CheckFunctionExists.c.obj : error LNK2019: unresolved external symbol _kqueue referenced in function _main
  242.  
  243.  
  244. cmTryCompileExec2832029070.exe : fatal error LNK1120: 1 unresolved externals
  245.  
  246.  
  247. LINK Pass 1 failed. with 1120
  248.  
  249. NMAKE : fatal error U1077: '"C:\Program Files (x86)\CMake 2.8\bin\cmake.exe"' : return code '0xffffffff'
  250.  
  251. Stop.
  252.  
  253. NMAKE : fatal error U1077: '"E:\Program Files (x86)\Microsoft Visual Studio 11.0\VC\BIN\nmake.exe"' : return code '0x2'
  254.  
  255. Stop.
RAW Paste Data