SHARE
TWEET

cbuser

a guest Mar 31st, 2008 255 Never
Not a member of Pastebin yet? Sign Up, it unlocks many cool features!
  1. In file included from /usr/include/wx-1.8/wx/gtk/win_gtk.h:18,
  2.                  from ../codesnippetstreectrl.cpp:52:
  3. /usr/include/gtk/gtkcontainer.h:31:21: error: gdk/gdk.h: No such file or directory
  4. In file included from /usr/include/gtk/gtkarg.h:31,
  5.                  from /usr/include/gtk/gtkobject.h:31,
  6.                  from /usr/include/gtk/gtkaccelgroup.h:35,
  7.                  from /usr/include/gtk/gtkwidget.h:31,
  8.                  from /usr/include/gtk/gtkcontainer.h:33,
  9.                  from /usr/include/wx-2.8/wx/gtk/win_gtk.h:18,
  10.                  from ../codesnippetstreectrl.cpp:52:
  11. /usr/include/gtk/gtktypeutils.h:31:18: error: glib.h: No such file or directory
  12. ../codesnippetstreectrl.cpp:53:26: error: gdk/gdkx.h: No such file or directory
  13. In file included from /usr/include/gtk/gtkarg.h:31,
  14.                  from /usr/include/gtk/gtkobject.h:31,
  15.                  from /usr/include/gtk/gtkaccelgroup.h:35,
  16.                  from /usr/include/gtk/gtkwidget.h:31,
  17.                  from /usr/include/gtk/gtkcontainer.h:33,
  18.                  from /usr/include/wx-2.8/wx/gtk/win_gtk.h:18,
  19.                  from ../codesnippetstreectrl.cpp:52:
  20. /usr/include/gtk/gtktypeutils.h:223: error: ‘guchar’ does not name a type
  21. /usr/include/gtk/gtktypeutils.h:224: error: ‘gboolean’ does not name a type
  22. /usr/include/gtk/gtktypeutils.h:227: error: ‘glong’ does not name a type
  23. /usr/include/gtk/gtktypeutils.h:229: error: ‘gfloat’ does not name a type
  24. /usr/include/gtk/gtktypeutils.h:230: error: ‘gdouble’ does not name a type
  25. /usr/include/gtk/gtktypeutils.h:349: error: expected constructor, destructor, or type conversion before ‘*’ token
  26. /usr/include/gtk/gtktypeutils.h:355: error: ‘gboolean’ has not been declared
  27. /usr/include/gtk/gtktypeutils.h:356: error: ‘gboolean’ does not name a type
  28. In file included from /usr/include/gtk/gtkobject.h:31,
  29.                  from /usr/include/gtk/gtkaccelgroup.h:35,
  30.                  from /usr/include/gtk/gtkwidget.h:31,
  31.                  from /usr/include/gtk/gtkcontainer.h:33,
  32.                  from /usr/include/wx-2.8/wx/gtk/win_gtk.h:18,
  33.                  from ../codesnippetstreectrl.cpp:52:
  34. /usr/include/gtk/gtkarg.h:65: error: ‘gboolean’ has not been declared
  35. /usr/include/gtk/gtkarg.h:67: error: ‘gboolean’ does not name a type
  36. /usr/include/gtk/gtkarg.h:70: error: ‘GHashTable’ has not been declared
  37. /usr/include/gtk/gtkarg.h:78: error: ‘GHashTable’ has not been declared
  38. /usr/include/gtk/gtkarg.h:84: error: ‘GHashTable’ has not been declared
  39. /usr/include/gtk/gtkarg.h:89: error: ‘GHashTable’ has not been declared
  40. /usr/include/gtk/gtkarg.h:90: error: ‘guint32’ has not been declared
  41. /usr/include/gtk/gtkarg.h:93: error: ‘gconstpointer’ was not declared in this scope
  42. /usr/include/gtk/gtkarg.h:94: error: ‘gconstpointer’ was not declared in this scope
  43. /usr/include/gtk/gtkarg.h:94: error: initializer expression list treated as compound expression
  44. /usr/include/gtk/gtkarg.h:95: error: ‘gconstpointer’ was not declared in this scope
  45. In file included from /usr/include/gtk/gtkaccelgroup.h:35,
  46.                  from /usr/include/gtk/gtkwidget.h:31,
  47.                  from /usr/include/gtk/gtkcontainer.h:33,
  48.                  from /usr/include/wx-2.8/wx/gtk/win_gtk.h:18,
  49.                  from ../codesnippetstreectrl.cpp:52:
  50. /usr/include/gtk/gtkobject.h:136: error: ‘guint32’ does not name a type
  51. /usr/include/gtk/gtkobject.h:146: error: expected ‘;’ before ‘*’ token
  52. /usr/include/gtk/gtkobject.h:276: error: ‘guint32’ has not been declared
  53. /usr/include/gtk/gtkobject.h:329: error: ‘GQuark’ has not been declared
  54. /usr/include/gtk/gtkobject.h:332: error: ‘GQuark’ has not been declared
  55. /usr/include/gtk/gtkobject.h:336: error: ‘GQuark’ has not been declared
  56. /usr/include/gtk/gtkobject.h:338: error: ‘GQuark’ has not been declared
  57. /usr/include/gtk/gtkobject.h:340: error: ‘GQuark’ has not been declared
  58. /usr/include/gtk/gtkobject.h:365: error: ‘gboolean’ has not been declared
  59. In file included from /usr/include/gtk/gtkwidget.h:31,
  60.                  from /usr/include/gtk/gtkcontainer.h:33,
  61.                  from /usr/include/wx-2.8/wx/gtk/win_gtk.h:18,
  62.                  from ../codesnippetstreectrl.cpp:52:
  63. /usr/include/gtk/gtkaccelgroup.h:68: error: ‘GdkModifierType’ does not name a type
  64. /usr/include/gtk/gtkaccelgroup.h:78: error: ‘GdkModifierType’ does not name a type
  65. /usr/include/gtk/gtkaccelgroup.h:88: error: ‘gboolean’ does not name a type
  66. /usr/include/gtk/gtkaccelgroup.h:92: error: ‘GdkModifierType’ has not been declared
  67. /usr/include/gtk/gtkaccelgroup.h:94: error: ‘GdkModifierType’ has not been declared
  68. /usr/include/gtk/gtkaccelgroup.h:95: error: variable or field ‘gtk_accelerator_set_default_mod_mask’ declared void
  69. /usr/include/gtk/gtkaccelgroup.h:95: error: ‘GdkModifierType’ was not declared in this scope
  70. /usr/include/gtk/gtkaccelgroup.h:107: error: ‘gboolean’ does not name a type
  71. /usr/include/gtk/gtkaccelgroup.h:113: error: ‘gboolean’ does not name a type
  72. /usr/include/gtk/gtkaccelgroup.h:125: error: ‘GdkModifierType’ has not been declared
  73. /usr/include/gtk/gtkaccelgroup.h:128: error: ‘GdkModifierType’ has not been declared
  74. /usr/include/gtk/gtkaccelgroup.h:131: error: ‘GdkModifierType’ has not been declared
  75. /usr/include/gtk/gtkaccelgroup.h:134: error: ‘GdkModifierType’ has not been declared
  76. /usr/include/gtk/gtkaccelgroup.h:140: error: ‘GdkModifierType’ has not been declared
  77. /usr/include/gtk/gtkaccelgroup.h:149: error: ‘GdkModifierType’ has not been declared
  78. /usr/include/gtk/gtkaccelgroup.h:154: error: ‘GdkModifierType’ has not been declared
  79. In file included from /usr/include/gtk/gtkwidget.h:33,
  80.                  from /usr/include/gtk/gtkcontainer.h:33,
  81.                  from /usr/include/wx-2.8/wx/gtk/win_gtk.h:18,
  82.                  from ../codesnippetstreectrl.cpp:52:
  83. /usr/include/gtk/gtkadjustment.h:54: error: ‘gfloat’ does not name a type
  84. /usr/include/gtk/gtkadjustment.h:55: error: ‘gfloat’ does not name a type
  85. /usr/include/gtk/gtkadjustment.h:56: error: ‘gfloat’ does not name a type
  86. /usr/include/gtk/gtkadjustment.h:57: error: ‘gfloat’ does not name a type
  87. /usr/include/gtk/gtkadjustment.h:58: error: ‘gfloat’ does not name a type
  88. /usr/include/gtk/gtkadjustment.h:59: error: ‘gfloat’ does not name a type
  89. /usr/include/gtk/gtkadjustment.h:72: error: ‘gfloat’ was not declared in this scope
  90. /usr/include/gtk/gtkadjustment.h:73: error: ‘gfloat’ was not declared in this scope
  91. /usr/include/gtk/gtkadjustment.h:74: error: ‘gfloat’ was not declared in this scope
  92. /usr/include/gtk/gtkadjustment.h:75: error: ‘gfloat’ was not declared in this scope
  93. /usr/include/gtk/gtkadjustment.h:76: error: ‘gfloat’ was not declared in this scope
  94. /usr/include/gtk/gtkadjustment.h:77: error: ‘gfloat’ was not declared in this scope
  95. /usr/include/gtk/gtkadjustment.h:77: error: initializer expression list treated as compound expression
  96. /usr/include/gtk/gtkadjustment.h:81: error: ‘gfloat’ has not been declared
  97. /usr/include/gtk/gtkadjustment.h:82: error: ‘gfloat’ has not been declared
  98. /usr/include/gtk/gtkadjustment.h:84: error: ‘gfloat’ has not been declared
  99. In file included from /usr/include/gtk/gtkwidget.h:34,
  100.                  from /usr/include/gtk/gtkcontainer.h:33,
  101.                  from /usr/include/wx-2.8/wx/gtk/win_gtk.h:18,
  102.                  from ../codesnippetstreectrl.cpp:52:
  103. /usr/include/gtk/gtkstyle.h:64: error: field ‘fg’ has incomplete type
  104. /usr/include/gtk/gtkstyle.h:65: error: field ‘bg’ has incomplete type
  105. /usr/include/gtk/gtkstyle.h:66: error: field ‘light’ has incomplete type
  106. /usr/include/gtk/gtkstyle.h:67: error: field ‘dark’ has incomplete type
  107. /usr/include/gtk/gtkstyle.h:68: error: field ‘mid’ has incomplete type
  108. /usr/include/gtk/gtkstyle.h:69: error: field ‘text’ has incomplete type
  109. /usr/include/gtk/gtkstyle.h:70: error: field ‘base’ has incomplete type
  110. /usr/include/gtk/gtkstyle.h:72: error: field ‘black’ has incomplete type
  111. /usr/include/gtk/gtkstyle.h:73: error: field ‘white’ has incomplete type
  112. /usr/include/gtk/gtkstyle.h:114: error: ‘GdkRectangle’ has not been declared
  113. /usr/include/gtk/gtkstyle.h:123: error: ‘GdkRectangle’ has not been declared
  114. /usr/include/gtk/gtkstyle.h:133: error: ‘GdkRectangle’ has not been declared
  115. /usr/include/gtk/gtkstyle.h:144: error: ‘GdkRectangle’ has not been declared
  116. /usr/include/gtk/gtkstyle.h:147: error: ‘GdkPoint’ has not been declared
  117. /usr/include/gtk/gtkstyle.h:149: error: ‘gboolean’ has not been declared
  118. /usr/include/gtk/gtkstyle.h:154: error: ‘GdkRectangle’ has not been declared
  119. /usr/include/gtk/gtkstyle.h:158: error: ‘gboolean’ has not been declared
  120. /usr/include/gtk/gtkstyle.h:167: error: ‘GdkRectangle’ has not been declared
  121. /usr/include/gtk/gtkstyle.h:178: error: ‘GdkRectangle’ has not been declared
  122. /usr/include/gtk/gtkstyle.h:188: error: ‘GdkRectangle’ has not been declared
  123. /usr/include/gtk/gtkstyle.h:198: error: ‘GdkRectangle’ has not been declared
  124. /usr/include/gtk/gtkstyle.h:209: error: ‘GdkRectangle’ has not been declared
  125. /usr/include/gtk/gtkstyle.h:220: error: ‘GdkRectangle’ has not been declared
  126. /usr/include/gtk/gtkstyle.h:231: error: ‘GdkRectangle’ has not been declared
  127. /usr/include/gtk/gtkstyle.h:242: error: ‘GdkRectangle’ has not been declared
  128. /usr/include/gtk/gtkstyle.h:253: error: ‘GdkRectangle’ has not been declared
  129. /usr/include/gtk/gtkstyle.h:265: error: ‘GdkRectangle’ has not been declared
  130. /usr/include/gtk/gtkstyle.h:276: error: ‘GdkRectangle’ has not been declared
  131. /usr/include/gtk/gtkstyle.h:290: error: ‘GdkRectangle’ has not been declared
  132. /usr/include/gtk/gtkstyle.h:304: error: ‘GdkRectangle’ has not been declared
  133. /usr/include/gtk/gtkstyle.h:314: error: ‘GdkRectangle’ has not been declared
  134. /usr/include/gtk/gtkstyle.h:325: error: ‘GdkRectangle’ has not been declared
  135. /usr/include/gtk/gtkstyle.h:337: error: ‘GdkRectangle’ has not been declared
  136. /usr/include/gtk/gtkstyle.h:359: error: ‘gboolean’ has not been declared
  137. /usr/include/gtk/gtkstyle.h:361: error: ‘GdkRectangle’ has not been declared
  138. /usr/include/gtk/gtkstyle.h:391: error: ‘GdkPoint’ has not been declared
  139. /usr/include/gtk/gtkstyle.h:393: error: ‘gboolean’ has not been declared
  140. /usr/include/gtk/gtkstyle.h:399: error: ‘gboolean’ has not been declared
  141. /usr/include/gtk/gtkstyle.h:542: error: ‘GdkRectangle’ has not been declared
  142. /usr/include/gtk/gtkstyle.h:551: error: ‘GdkRectangle’ has not been declared
  143. /usr/include/gtk/gtkstyle.h:561: error: ‘GdkRectangle’ has not been declared
  144. /usr/include/gtk/gtkstyle.h:572: error: ‘GdkRectangle’ has not been declared
  145. /usr/include/gtk/gtkstyle.h:575: error: ‘GdkPoint’ has not been declared
  146. /usr/include/gtk/gtkstyle.h:577: error: ‘gboolean’ has not been declared
  147. /usr/include/gtk/gtkstyle.h:582: error: ‘GdkRectangle’ has not been declared
  148. /usr/include/gtk/gtkstyle.h:586: error: ‘gboolean’ has not been declared
  149. /usr/include/gtk/gtkstyle.h:595: error: ‘GdkRectangle’ has not been declared
  150. /usr/include/gtk/gtkstyle.h:606: error: ‘GdkRectangle’ has not been declared
  151. /usr/include/gtk/gtkstyle.h:616: error: ‘GdkRectangle’ has not been declared
  152. /usr/include/gtk/gtkstyle.h:626: error: ‘GdkRectangle’ has not been declared
  153. /usr/include/gtk/gtkstyle.h:637: error: ‘GdkRectangle’ has not been declared
  154. /usr/include/gtk/gtkstyle.h:648: error: ‘GdkRectangle’ has not been declared
  155. /usr/include/gtk/gtkstyle.h:659: error: ‘GdkRectangle’ has not been declared
  156. /usr/include/gtk/gtkstyle.h:670: error: ‘GdkRectangle’ has not been declared
  157. /usr/include/gtk/gtkstyle.h:681: error: ‘GdkRectangle’ has not been declared
  158. /usr/include/gtk/gtkstyle.h:693: error: ‘GdkRectangle’ has not been declared
  159. /usr/include/gtk/gtkstyle.h:704: error: ‘GdkRectangle’ has not been declared
  160. /usr/include/gtk/gtkstyle.h:718: error: ‘GdkRectangle’ has not been declared
  161. /usr/include/gtk/gtkstyle.h:732: error: ‘GdkRectangle’ has not been declared
  162. /usr/include/gtk/gtkstyle.h:742: error: ‘GdkRectangle’ has not been declared
  163. /usr/include/gtk/gtkstyle.h:753: error: ‘GdkRectangle’ has not been declared
  164. /usr/include/gtk/gtkstyle.h:765: error: ‘GdkRectangle’ has not been declared
  165. In file included from /usr/include/gtk/gtkcontainer.h:33,
  166.                  from /usr/include/wx-2.8/wx/gtk/win_gtk.h:18,
  167.                  from ../codesnippetstreectrl.cpp:52:
  168. /usr/include/gtk/gtkwidget.h:136: error: ‘gint16’ does not name a type
  169. /usr/include/gtk/gtkwidget.h:137: error: ‘gint16’ does not name a type
  170. /usr/include/gtk/gtkwidget.h:146: error: ‘gint16’ does not name a type
  171. /usr/include/gtk/gtkwidget.h:147: error: ‘gint16’ does not name a type
  172. /usr/include/gtk/gtkwidget.h:148: error: ‘guint16’ does not name a type
  173. /usr/include/gtk/gtkwidget.h:149: error: ‘guint16’ does not name a type
  174. /usr/include/gtk/gtkwidget.h:167: error: expected ‘;’ before ‘*’ token
  175. /usr/include/gtk/gtkwidget.h:191: error: ‘guint16’ does not name a type
  176. /usr/include/gtk/gtkwidget.h:196: error: ‘guint8’ does not name a type
  177. /usr/include/gtk/gtkwidget.h:204: error: ‘guint8’ does not name a type
  178. /usr/include/gtk/gtkwidget.h:273: error: ‘GdkRectangle’ has not been declared
  179. /usr/include/gtk/gtkwidget.h:292: error: ‘GdkModifierType’ has not been declared
  180. /usr/include/gtk/gtkwidget.h:297: error: ‘GdkModifierType’ has not been declared
  181. /usr/include/gtk/gtkwidget.h:304: error: ‘GdkEvent’ has not been declared
  182. /usr/include/gtk/gtkwidget.h:306: error: ‘GdkEventButton’ has not been declared
  183. /usr/include/gtk/gtkwidget.h:308: error: ‘GdkEventButton’ has not been declared
  184. /usr/include/gtk/gtkwidget.h:310: error: ‘GdkEventMotion’ has not been declared
  185. /usr/include/gtk/gtkwidget.h:312: error: ‘GdkEventAny’ has not been declared
  186. /usr/include/gtk/gtkwidget.h:314: error: ‘GdkEventAny’ has not been declared
  187. /usr/include/gtk/gtkwidget.h:316: error: ‘GdkEventExpose’ has not been declared
  188. /usr/include/gtk/gtkwidget.h:318: error: ‘GdkEventKey’ has not been declared
  189. /usr/include/gtk/gtkwidget.h:320: error: ‘GdkEventKey’ has not been declared
  190. /usr/include/gtk/gtkwidget.h:322: error: ‘GdkEventCrossing’ has not been declared
  191. /usr/include/gtk/gtkwidget.h:324: error: ‘GdkEventCrossing’ has not been declared
  192. /usr/include/gtk/gtkwidget.h:326: error: ‘GdkEventConfigure’ has not been declared
  193. /usr/include/gtk/gtkwidget.h:328: error: ‘GdkEventFocus’ has not been declared
  194. /usr/include/gtk/gtkwidget.h:330: error: ‘GdkEventFocus’ has not been declared
  195. /usr/include/gtk/gtkwidget.h:332: error: ‘GdkEventAny’ has not been declared
  196. /usr/include/gtk/gtkwidget.h:334: error: ‘GdkEventAny’ has not been declared
  197. /usr/include/gtk/gtkwidget.h:336: error: ‘GdkEventProperty’ has not been declared
  198. /usr/include/gtk/gtkwidget.h:338: error: ‘GdkEventSelection’ has not been declared
  199. /usr/include/gtk/gtkwidget.h:340: error: ‘GdkEventSelection’ has not been declared
  200. /usr/include/gtk/gtkwidget.h:342: error: ‘GdkEventSelection’ has not been declared
  201. /usr/include/gtk/gtkwidget.h:344: error: ‘GdkEventProximity’ has not been declared
  202. /usr/include/gtk/gtkwidget.h:346: error: ‘GdkEventProximity’ has not been declared
  203. /usr/include/gtk/gtkwidget.h:348: error: ‘GdkEventVisibility’ has not been declared
  204. /usr/include/gtk/gtkwidget.h:350: error: ‘GdkEventClient’ has not been declared
  205. /usr/include/gtk/gtkwidget.h:352: error: ‘GdkEventAny’ has not been declared
  206. /usr/include/gtk/gtkwidget.h:380: error: expected identifier before ‘*’ token
  207. /usr/include/gtk/gtkwidget.h:384: error: ‘gboolean’ declared as function returning a function
  208. /usr/include/gtk/gtkwidget.h:385: error: expected identifier before ‘*’ token
  209. /usr/include/gtk/gtkwidget.h:389: error: ‘gboolean’ declared as function returning a function
  210. /usr/include/gtk/gtkwidget.h:389: error: ‘int _GtkWidgetClass::gboolean(int*)’ cannot be overloaded
  211. /usr/include/gtk/gtkwidget.h:384: error: with ‘int _GtkWidgetClass::gboolean(int*)
  212. /usr/include/gtk/gtkwidget.h:411: error: ‘gint16’ does not name a type
  213. /usr/include/gtk/gtkwidget.h:412: error: ‘gint16’ does not name a type
  214. /usr/include/gtk/gtkwidget.h:413: error: ‘gint16’ does not name a type
  215. /usr/include/gtk/gtkwidget.h:414: error: ‘gint16’ does not name a type
  216. /usr/include/gtk/gtkwidget.h:419: error: ‘gint16’ does not name a type
  217. /usr/include/gtk/gtkwidget.h:420: error: ‘gint16’ does not name a type
  218. /usr/include/gtk/gtkwidget.h:476: error: ‘GdkRectangle’ has not been declared
  219. /usr/include/gtk/gtkwidget.h:497: error: ‘gboolean’ has not been declared
  220. /usr/include/gtk/gtkwidget.h:504: error: ‘gboolean’ does not name a type
  221. /usr/include/gtk/gtkwidget.h:506: error: ‘GdkEvent’ has not been declared
  222. /usr/include/gtk/gtkwidget.h:508: error: ‘gboolean’ does not name a type
  223. /usr/include/gtk/gtkwidget.h:509: error: ‘gboolean’ does not name a type
  224. /usr/include/gtk/gtkwidget.h:519: error: ‘GdkRectangle’ has not been declared
  225. /usr/include/gtk/gtkwidget.h:520: error: ‘GdkRectangle’ has not been declared
  226. /usr/include/gtk/gtkwidget.h:531: error: ‘gboolean’ has not been declared
  227. /usr/include/gtk/gtkwidget.h:533: error: ‘gboolean’ has not been declared
  228. /usr/include/gtk/gtkwidget.h:550: error: ‘GdkExtensionMode’ has not been declared
  229. /usr/include/gtk/gtkwidget.h:552: error: ‘GdkExtensionMode’ does not name a type
  230. /usr/include/gtk/gtkwidget.h:576: error: ‘gboolean’ does not name a type
  231. In file included from /usr/include/wx-2.8/wx/gtk/win_gtk.h:18,
  232.                  from ../codesnippetstreectrl.cpp:52:
  233. /usr/include/gtk/gtkcontainer.h:82: error: ‘gboolean’ has not been declared
  234. /usr/include/gtk/gtkcontainer.h:129: error: expected constructor, destructor, or type conversion before ‘*’ token
  235. /usr/include/gtk/gtkcontainer.h:136: error: ‘gboolean’ has not been declared
  236. /usr/include/gtk/gtkcontainer.h:145: error: expected constructor, destructor, or type conversion before ‘*’ token
  237. /usr/include/gtk/gtkcontainer.h:167: error: ‘guint32’ has not been declared
  238. In file included from ../codesnippetstreectrl.cpp:52:
  239. /usr/include/wx-2.8/wx/gtk/win_gtk.h:30: error: ISO C++ forbids declaration of ‘GList’ with no type
  240. /usr/include/wx-2.8/wx/gtk/win_gtk.h:30: error: expected ‘;’ before ‘*’ token
  241. ../codesnippetstreectrl.cpp: In member function ‘void CodeSnippetsTreeCtrl::OnLeaveWindow(wxMouseEvent&)’:
  242. ../codesnippetstreectrl.cpp:990: error: ‘GDK_ROOT_PARENT’ was not declared in this scope
  243. ../codesnippetstreectrl.cpp:990: error: ‘GDK_WINDOW_XDISPLAY’ was not declared in this scope
  244. ../codesnippetstreectrl.cpp:991: error: ‘None’ was not declared in this scope
  245. ../codesnippetstreectrl.cpp:992: error: ‘GDK_WINDOW_XID’ was not declared in this scope
  246. ../codesnippetstreectrl.cpp:994: error: ‘XWarpPointer’ was not declared in this scope
  247. ../codesnippetstreectrl.cpp:997: error: ‘GdkDisplay’ was not declared in this scope
  248. ../codesnippetstreectrl.cpp:997: error: ‘display’ was not declared in this scope
  249. ../codesnippetstreectrl.cpp:997: error: ‘gdk_display_get_default’ was not declared in this scope
  250. ../codesnippetstreectrl.cpp:999: error: ‘gdk_display_get_window_at_pointer’ was not declared in this scope
  251. ../codesnippetstreectrl.cpp:1002: error: ‘GdkEventButton’ was not declared in this scope
  252. ../codesnippetstreectrl.cpp:1002: error: expected `;' before ‘evb’
  253. ../codesnippetstreectrl.cpp:1003: error: ‘evb’ was not declared in this scope
  254. ../codesnippetstreectrl.cpp:1004: error: ‘GDK_BUTTON_RELEASE’ was not declared in this scope
  255. ../codesnippetstreectrl.cpp:1008: error: ‘GDK_BUTTON1_MASK’ was not declared in this scope
  256. ../codesnippetstreectrl.cpp:1011: error: ‘GdkEvent’ was not declared in this scope
  257. ../codesnippetstreectrl.cpp:1011: error: expected primary-expression before ‘)’ token
  258. ../codesnippetstreectrl.cpp:1011: error: ‘gdk_display_put_event’ was not declared in this scope
  259. make[5]: *** [codesnippetstreectrl.o] Error 1
  260. make[5]: Leaving directory `/home/grim/codeblocks/src/codeblocks-8.02/src/plugins/contrib/codesnippets/resources'
  261. make[4]: *** [all-recursive] Error 1
  262. make[4]: Leaving directory `/home/grim/codeblocks/src/codeblocks-8.02/src/plugins/contrib/codesnippets'
  263. make[3]: *** [all-recursive] Error 1
  264. make[3]: Leaving directory `/home/grim/codeblocks/src/codeblocks-8.02/src/plugins/contrib'
  265. make[2]: *** [all-recursive] Error 1
  266. make[2]: Leaving directory `/home/grim/codeblocks/src/codeblocks-8.02/src/plugins'
  267. make[1]: *** [all-recursive] Error 1
  268. make[1]: Leaving directory `/home/grim/codeblocks/src/codeblocks-8.02/src'
  269. make: *** [all-recursive] Error 1
  270. ==> ERROR: Build Failed.
  271.     Aborting...
RAW Paste Data
We use cookies for various purposes including analytics. By continuing to use Pastebin, you agree to our use of cookies as described in the Cookies Policy. OK, I Understand
 
Top