jpcordovae

spring error boost 89.0.1-87-gce4d36e

Aug 20th, 2012
198
Never
Not a member of Pastebin yet? Sign Up, it unlocks many cool features!
  1. bash-4.1$ make
  2. [  5%] Built target assimp
  3.   Configuring Version files ...
  4. Spring engine version: 89.0.1-87-gce4d36e HEAD ()
  5. [  5%] Built target generateVersionFiles
  6. [  5%] Built target C-AIInterface
  7. [ 11%] Built target Cpp-AIWrapper
  8. [ 11%] Built target LegacyCpp-AIWrapper
  9. [ 12%] Built target LegacyCpp-Creg-AIWrapper
  10. [ 15%] Built target KAIK
  11. [ 17%] Built target E323AI
  12. [ 17%] Built target CppTestAI
  13. [ 18%] Built target RAI
  14. [ 20%] Built target Shard
  15. [ 21%] Built target AAI
  16. [ 21%] Built target NullAI
  17. [ 21%] Built target headlessStubs
  18. [ 24%] Built target streflop
  19. [ 25%] Built target lua
  20. [ 25%] Built target 7zip
  21. [ 26%] Built target minizip
  22. [ 28%] Built target unitsync
  23. [ 28%] Built target pr-md5
  24. [ 28%] Built target pr-sha1
  25. [ 28%] Built target bencode
  26. [ 28%] Built target FileSystem
  27. [ 29%] Built target xmlrpc
  28. [ 29%] Built target Http
  29. [ 29%] Built target soap
  30. [ 29%] Built target Plasma
  31. [ 30%] Built target pugixml
  32. [ 30%] Built target Widget
  33. [ 30%] Built target Rapid
  34. [ 30%] Built target pr-downloader_static
  35. [ 30%] Built target pr-downloader
  36. [ 30%] Built target pr-downloader_shared
  37. Using build directory: /home/jpcordovae/projects/spring/base/ ...
  38. Creating spring/bitmaps.sdz
  39. Creating springcontent.sdz
  40. Creating maphelper.sdz
  41. Creating cursors.sdz
  42. [ 30%] Built target gamedata
  43. [ 30%] Built target sound
  44. [ 30%] Built target luasocket
  45. [ 30%] Built target oscpack
  46. [ 30%] Built target md5
  47. [ 30%] Built target lobby
  48. Linking CXX executable ../../../spring
  49. CMakeFiles/engine-default.dir/__/__/System/Platform/CmdLineParams.cpp.o: In function `boost::program_options::validation_error::validation_error(boost::program_options::validation_error::kind_t, std::string const&, std::string const&, int)':
  50. /usr/include/boost/program_options/errors.hpp:372: undefined reference to `boost::program_options::validation_error::get_template(boost::program_options::validation_error::kind_t)'
  51. /usr/include/boost/program_options/errors.hpp:372: undefined reference to `boost::program_options::error_with_option_name::error_with_option_name(std::string const&, std::string const&, std::string const&, int)'
  52. CMakeFiles/engine-default.dir/__/__/System/Platform/CmdLineParams.cpp.o: In function `~error_with_option_name':
  53. /usr/include/boost/program_options/errors.hpp:118: undefined reference to `vtable for boost::program_options::error_with_option_name'
  54. /usr/include/boost/program_options/errors.hpp:118: undefined reference to `vtable for boost::program_options::error_with_option_name'
  55. /usr/include/boost/program_options/errors.hpp:118: undefined reference to `vtable for boost::program_options::error_with_option_name'
  56. /usr/include/boost/program_options/errors.hpp:118: undefined reference to `vtable for boost::program_options::error_with_option_name'
  57. /usr/include/boost/program_options/errors.hpp:118: undefined reference to `vtable for boost::program_options::error_with_option_name'
  58. CMakeFiles/engine-default.dir/__/__/System/Platform/CmdLineParams.cpp.o:/usr/include/boost/program_options/errors.hpp:118: more undefined references to `vtable for boost::program_options::error_with_option_name' follow
  59. CMakeFiles/engine-default.dir/__/__/System/Platform/CmdLineParams.cpp.o: In function `boost::program_options::basic_command_line_parser<char>::run()':
  60. /usr/include/boost/program_options/detail/parsers.hpp:107: undefined reference to `boost::program_options::detail::cmdline::get_canonical_option_prefix()'
  61. CMakeFiles/engine-default.dir/__/__/System/Platform/CmdLineParams.cpp.o: In function `boost::program_options::error_with_option_name::error_with_option_name(boost::program_options::error_with_option_name const&)':
  62. /usr/include/boost/program_options/errors.hpp:88: undefined reference to `vtable for boost::program_options::error_with_option_name'
  63. CMakeFiles/engine-default.dir/__/__/System/Platform/CmdLineParams.cpp.o:(.rodata._ZTVN5boost15program_options16validation_errorE[_ZTVN5boost15program_options16validation_errorE]+0x20): undefined reference to `boost::program_options::error_with_option_name::what() const'
  64. CMakeFiles/engine-default.dir/__/__/System/Platform/CmdLineParams.cpp.o:(.rodata._ZTVN5boost15program_options16validation_errorE[_ZTVN5boost15program_options16validation_errorE]+0x30): undefined reference to `boost::program_options::error_with_option_name::substitute_placeholders(std::string const&) const'
  65. CMakeFiles/engine-default.dir/__/__/System/Platform/CmdLineParams.cpp.o:(.rodata._ZTVN5boost16exception_detail19error_info_injectorINS_15program_options16validation_errorEEE[_ZTVN5boost16exception_detail19error_info_injectorINS_15program_options16validation_errorEEE]+0x20): undefined reference to `boost::program_options::error_with_option_name::what() const'
  66. CMakeFiles/engine-default.dir/__/__/System/Platform/CmdLineParams.cpp.o:(.rodata._ZTVN5boost16exception_detail19error_info_injectorINS_15program_options16validation_errorEEE[_ZTVN5boost16exception_detail19error_info_injectorINS_15program_options16validation_errorEEE]+0x30): undefined reference to `boost::program_options::error_with_option_name::substitute_placeholders(std::string const&) const'
  67. CMakeFiles/engine-default.dir/__/__/System/Platform/CmdLineParams.cpp.o:(.rodata._ZTVN5boost16exception_detail10clone_implINS0_19error_info_injectorINS_15program_options16validation_errorEEEEE[_ZTVN5boost16exception_detail10clone_implINS0_19error_info_injectorINS_15program_options16validation_errorEEEEE]+0x28): undefined reference to `boost::program_options::error_with_option_name::what() const'
  68. CMakeFiles/engine-default.dir/__/__/System/Platform/CmdLineParams.cpp.o:(.rodata._ZTVN5boost16exception_detail10clone_implINS0_19error_info_injectorINS_15program_options16validation_errorEEEEE[_ZTVN5boost16exception_detail10clone_implINS0_19error_info_injectorINS_15program_options16validation_errorEEEEE]+0x38): undefined reference to `boost::program_options::error_with_option_name::substitute_placeholders(std::string const&) const'
  69. CMakeFiles/engine-default.dir/__/__/System/Platform/CmdLineParams.cpp.o:(.rodata._ZTVN5boost15program_options20invalid_option_valueE[_ZTVN5boost15program_options20invalid_option_valueE]+0x20): undefined reference to `boost::program_options::error_with_option_name::what() const'
  70. CMakeFiles/engine-default.dir/__/__/System/Platform/CmdLineParams.cpp.o:(.rodata._ZTVN5boost15program_options20invalid_option_valueE[_ZTVN5boost15program_options20invalid_option_valueE]+0x30): undefined reference to `boost::program_options::error_with_option_name::substitute_placeholders(std::string const&) const'
  71. CMakeFiles/engine-default.dir/__/__/System/Platform/CmdLineParams.cpp.o:(.rodata._ZTVN5boost16exception_detail19error_info_injectorINS_15program_options20invalid_option_valueEEE[_ZTVN5boost16exception_detail19error_info_injectorINS_15program_options20invalid_option_valueEEE]+0x20): undefined reference to `boost::program_options::error_with_option_name::what() const'
  72. CMakeFiles/engine-default.dir/__/__/System/Platform/CmdLineParams.cpp.o:(.rodata._ZTVN5boost16exception_detail19error_info_injectorINS_15program_options20invalid_option_valueEEE[_ZTVN5boost16exception_detail19error_info_injectorINS_15program_options20invalid_option_valueEEE]+0x30): undefined reference to `boost::program_options::error_with_option_name::substitute_placeholders(std::string const&) const'
  73. CMakeFiles/engine-default.dir/__/__/System/Platform/CmdLineParams.cpp.o:(.rodata._ZTVN5boost16exception_detail10clone_implINS0_19error_info_injectorINS_15program_options20invalid_option_valueEEEEE[_ZTVN5boost16exception_detail10clone_implINS0_19error_info_injectorINS_15program_options20invalid_option_valueEEEEE]+0x28): undefined reference to `boost::program_options::error_with_option_name::what() const'
  74. CMakeFiles/engine-default.dir/__/__/System/Platform/CmdLineParams.cpp.o:(.rodata._ZTVN5boost16exception_detail10clone_implINS0_19error_info_injectorINS_15program_options20invalid_option_valueEEEEE[_ZTVN5boost16exception_detail10clone_implINS0_19error_info_injectorINS_15program_options20invalid_option_valueEEEEE]+0x38): undefined reference to `boost::program_options::error_with_option_name::substitute_placeholders(std::string const&) const'
  75. CMakeFiles/engine-default.dir/__/__/System/Platform/CmdLineParams.cpp.o:(.rodata._ZTIN5boost15program_options16validation_errorE[_ZTIN5boost15program_options16validation_errorE]+0x10): undefined reference to `typeinfo for boost::program_options::error_with_option_name'
  76. collect2: error: ld returned 1 exit status
  77. make[2]: *** [spring] Error 1
  78. make[1]: *** [rts/builds/default/CMakeFiles/engine-default.dir/all] Error 2
  79. make: *** [all] Error 2
  80. bash-4.1$
RAW Paste Data