JZTech101

Untitled

Mar 23rd, 2014
172
0
Never
Not a member of Pastebin yet? Sign Up, it unlocks many cool features!
text 1.91 KB | None | 0 0
  1. [1]jztech101@home ~/Documents/workspace/RefinedRelocation $ /opt/gradle/bin/gradle build
  2. ****************************
  3. Powered By MCP:
  4. http://mcp.ocean-labs.de/
  5. Searge, ProfMobius, Fesh0r,
  6. R4wk, ZeuX, IngisKahn
  7. MCP Data version : unknown
  8. ****************************
  9. :downloadClient SKIPPED
  10. :downloadServer SKIPPED
  11. :extractUserDev
  12. :mergeJars SKIPPED
  13. :applyBinPatches SKIPPED
  14. :downloadMcpTools UP-TO-DATE
  15. :genSrgs UP-TO-DATE
  16. :deobfBinJar UP-TO-DATE
  17. :compileApiJava UP-TO-DATE
  18. :processApiResources UP-TO-DATE
  19. :apiClasses UP-TO-DATE
  20. :sourceMainJava UP-TO-DATE
  21. :compileJava
  22. warning: [options] bootstrap class path not set in conjunction with -source 1.6
  23. /home/jztech101/Documents/workspace/RefinedRelocation/build/sources/java/com/dynious/refinedrelocation/tileentity/TileSortingBarrel.java:11: error: TileSortingBarrel is not abstract and does not override abstract method isItemValidForSlot(int,ItemStack) in IInventory
  24. public class TileSortingBarrel extends TileEntityBarrel implements ISortingInventory
  25. ^
  26. /home/jztech101/Documents/workspace/RefinedRelocation/build/sources/java/com/dynious/refinedrelocation/tileentity/TileSortingBarrel.java:35: error: cannot find symbol
  27. super.setInventorySlotContents(i, itemstack);
  28. ^
  29. symbol: method setInventorySlotContents(int,ItemStack)
  30. Note: /home/jztech101/Documents/workspace/RefinedRelocation/build/sources/java/com/dynious/refinedrelocation/gui/GuiRefinedRelocationContainer.java uses or overrides a deprecated API.
  31. Note: Recompile with -Xlint:deprecation for details.
  32. 2 errors
  33. 1 warning
  34. :compileJava FAILED
  35.  
  36. FAILURE: Build failed with an exception.
  37.  
  38. * What went wrong:
  39. Execution failed for task ':compileJava'.
  40. > Compilation failed; see the compiler error output for details.
  41.  
  42. * Try:
  43. Run with --stacktrace option to get the stack trace. Run with --info or --debug option to get more log output.
  44.  
  45. BUILD FAILED
Advertisement
Add Comment
Please, Sign In to add comment