daily pastebin goal
44%
SHARE
TWEET

Untitled

a guest Jun 13th, 2018 49 Never
Not a member of Pastebin yet? Sign Up, it unlocks many cool features!
  1. Undefined symbols:
  2.   "Last_BUS_REQ_St", referenced from:
  3.       M68K_Read_Byte_Misc_CD.z80_off in mem_m68k_cd.o
  4.       M68K_Read_Word_Misc_CD.z80_off in mem_m68k_cd.o
  5.       M68K_Write_Byte_Misc_CD.deactivated in mem_m68k_cd.o
  6.       M68K_Write_Word_Misc_CD.deactivated in mem_m68k_cd.o
  7.       M68K_Read_Byte_Misc_32X.z80_off in mem_m68k_32x.o
  8.       M68K_Read_Word_Misc_32X.z80_off in mem_m68k_32x.o
  9.       M68K_Write_Byte_Misc_32X.deactivated in mem_m68k_32x.o
  10.       M68K_Write_Word_Misc_32X.deactivated in mem_m68k_32x.o
  11.   "Last_BUS_REQ_Cnt", referenced from:
  12.       M68K_Read_Byte_Misc_CD.z80_off in mem_m68k_cd.o
  13.       M68K_Read_Word_Misc_CD.z80_off in mem_m68k_cd.o
  14.       M68K_Write_Byte_Misc_CD.deactivated in mem_m68k_cd.o
  15.       M68K_Write_Word_Misc_CD.deactivated in mem_m68k_cd.o
  16.       M68K_Read_Byte_Misc_32X.z80_off in mem_m68k_32x.o
  17.       M68K_Read_Word_Misc_32X.z80_off in mem_m68k_32x.o
  18.       M68K_Write_Byte_Misc_32X.deactivated in mem_m68k_32x.o
  19.       M68K_Write_Word_Misc_32X.deactivated in mem_m68k_32x.o
  20. ld: symbol(s) not found
  21. collect2: ld returned 1 exit status
  22. make[3]: *** [gens] Error 1
  23. make[2]: *** [all-recursive] Error 1
  24. make[1]: *** [all-recursive] Error 1
  25. make: *** [all] Error 2
RAW Paste Data
We use cookies for various purposes including analytics. By continuing to use Pastebin, you agree to our use of cookies as described in the Cookies Policy. OK, I Understand
 
Top