SHARE
TWEET

Untitled

a guest Nov 28th, 2017 81 Never
Not a member of Pastebin yet? Sign Up, it unlocks many cool features!
  1. CC firmware/target/arm/as3525/sd-as3525.c
  2. /home/ubuntu/Desktop/rockbox/firmware/target/arm/as3525/sd-as3525.c: In function ‘sd_event’:
  3. /home/ubuntu/Desktop/rockbox/firmware/target/arm/as3525/sd-as3525.c:988: warning: the address of ‘data’ will never be NULL
  4. /home/ubuntu/Desktop/rockbox/firmware/target/arm/as3525/sd-as3525.c:988: warning: statement with no effect
  5. /home/ubuntu/Desktop/rockbox/firmware/target/arm/as3525/sd-as3525.c:988: error: expected ‘;’ before ‘)’ token
  6. /home/ubuntu/Desktop/rockbox/firmware/target/arm/as3525/sd-as3525.c:988: error: expected statement before ‘)’ token
  7. /home/ubuntu/Desktop/rockbox/firmware/target/arm/as3525/sd-as3525.c:988: error: label ‘data’ used but not defined
  8. make: *** [/home/ubuntu/Desktop/rockbox/build_fuze_allBIlgus/firmware/target/arm/as3525/sd-as3525.o] Error 1
RAW Paste Data
We use cookies for various purposes including analytics. By continuing to use Pastebin, you agree to our use of cookies as described in the Cookies Policy. OK, I Understand
Top