daily pastebin goal
79%
SHARE
TWEET

error3

khermano Mar 21st, 2019 57 Never
Not a member of Pastebin yet? Sign Up, it unlocks many cool features!
  1.  at sun.reflect.NativeMethodAccessorImpl.invoke(NativeMethodAccessorImpl.java:62)
  2.         at sun.reflect.DelegatingMethodAccessorImpl.invoke(DelegatingMethodAccessorImpl.java:43)
  3.         at java.lang.reflect.Method.invoke(Method.java:498)
  4.         at org.junit.internal.runners.MethodRoadie.runBefores(MethodRoadie.java:133)
  5.         at org.junit.internal.runners.MethodRoadie.runBeforesThenTestThenAfters(MethodRoadie.java:96)
  6.         at org.powermock.modules.junit4.internal.impl.PowerMockJUnit44RunnerDelegateImpl$PowerMockJUnit44MethodRunner.executeTest(PowerMockJUnit44RunnerDelegateImpl.java:310)
  7.         at org.powermock.modules.junit4.internal.impl.PowerMockJUnit47RunnerDelegateImpl$PowerMockJUnit47MethodRunner.executeTestInSuper(PowerMockJUnit47RunnerDelegateImpl.java:131)
  8.         at org.powermock.modules.junit4.internal.impl.PowerMockJUnit47RunnerDelegateImpl$PowerMockJUnit47MethodRunner.access$100(PowerMockJUnit47RunnerDelegateImpl.java:59)
  9.         at org.powermock.modules.junit4.internal.impl.PowerMockJUnit47RunnerDelegateImpl$PowerMockJUnit47MethodRunner$TestExecutorStatement.evaluate(PowerMockJUnit47RunnerDelegateImpl.java:147)
  10.         at org.powermock.modules.junit4.internal.impl.PowerMockJUnit47RunnerDelegateImpl$PowerMockJUnit47MethodRunner.evaluateStatement(PowerMockJUnit47RunnerDelegateImpl.java:107)
  11.         at org.powermock.modules.junit4.internal.impl.PowerMockJUnit47RunnerDelegateImpl$PowerMockJUnit47MethodRunner.executeTest(PowerMockJUnit47RunnerDelegateImpl.java:82)
  12.         at org.powermock.modules.junit4.internal.impl.PowerMockJUnit44RunnerDelegateImpl$PowerMockJUnit44MethodRunner.runBeforesThenTestThenAfters(PowerMockJUnit44RunnerDelegateImpl.java:298)
  13.         at org.junit.internal.runners.MethodRoadie.runTest(MethodRoadie.java:87)
  14.         at org.junit.internal.runners.MethodRoadie.run(MethodRoadie.java:50)
  15.         at org.powermock.modules.junit4.internal.impl.PowerMockJUnit44RunnerDelegateImpl.invokeTestMethod(PowerMockJUnit44RunnerDelegateImpl.java:218)
  16.         at org.powermock.modules.junit4.internal.impl.PowerMockJUnit44RunnerDelegateImpl.runMethods(PowerMockJUnit44RunnerDelegateImpl.java:160)
  17.         at org.powermock.modules.junit4.internal.impl.PowerMockJUnit44RunnerDelegateImpl$1.run(PowerMockJUnit44RunnerDelegateImpl.java:134)
  18.         at org.junit.internal.runners.ClassRoadie.runUnprotected(ClassRoadie.java:34)
  19.         at org.junit.internal.runners.ClassRoadie.runProtected(ClassRoadie.java:44)
  20.         at org.powermock.modules.junit4.internal.impl.PowerMockJUnit44RunnerDelegateImpl.run(PowerMockJUnit44RunnerDelegateImpl.java:136)
  21.         at org.powermock.modules.junit4.common.internal.impl.JUnit4TestSuiteChunkerImpl.run(JUnit4TestSuiteChunkerImpl.java:121)
  22.         at org.powermock.modules.junit4.common.internal.impl.AbstractCommonPowerMockRunner.run(AbstractCommonPowerMockRunner.java:57)
  23.         at org.powermock.modules.junit4.PowerMockRunner.run(PowerMockRunner.java:59)
  24.         at org.apache.maven.surefire.junit4.JUnit4Provider.execute(JUnit4Provider.java:252)
  25.         at org.apache.maven.surefire.junit4.JUnit4Provider.executeTestSet(JUnit4Provider.java:141)
  26.         at org.apache.maven.surefire.junit4.JUnit4Provider.invoke(JUnit4Provider.java:112)
  27.         at sun.reflect.NativeMethodAccessorImpl.invoke0(Native Method)
  28.         at sun.reflect.NativeMethodAccessorImpl.invoke(NativeMethodAccessorImpl.java:62)
  29.         at sun.reflect.DelegatingMethodAccessorImpl.invoke(DelegatingMethodAccessorImpl.java:43)
  30.         at java.lang.reflect.Method.invoke(Method.java:498)
  31.         at org.apache.maven.surefire.util.ReflectionUtils.invokeMethodWithArray(ReflectionUtils.java:189)
  32.         at org.apache.maven.surefire.booter.ProviderFactory$ProviderProxy.invoke(ProviderFactory.java:165)
  33.         at org.apache.maven.surefire.booter.ProviderFactory.invokeProvider(ProviderFactory.java:85)
  34.         at org.apache.maven.surefire.booter.ForkedBooter.runSuitesInProcess(ForkedBooter.java:115)
  35.         at org.apache.maven.surefire.booter.ForkedBooter.main(ForkedBooter.java:75)
  36. Caused by: java.lang.RuntimeException: Cannot load file json/testPayload.json
  37.         at org.xstefank.TestUtils.loadJson(TestUtils.java:78)
  38.         at org.xstefank.TestUtils.<clinit>(TestUtils.java:24)
  39.         ... 41 more
  40.  
  41. testNullCommitParameter(org.xstefank.check.LatestCommitCheckTest)  Time elapsed: 0.001 sec  <<< ERROR!
  42. java.lang.NoClassDefFoundError: Could not initialize class org.xstefank.TestUtils
  43.         at java.lang.Class.forName0(Native Method)
  44.         at java.lang.Class.forName(Class.java:264)
  45.         at javassist.runtime.Desc.getClassObject(Desc.java:43)
  46.         at javassist.runtime.Desc.getClazz(Desc.java:52)
  47.         at org.xstefank.check.LatestCommitCheckTest.setUp(LatestCommitCheckTest.java:28)
  48.         at sun.reflect.NativeMethodAccessorImpl.invoke0(Native Method)
  49.         at sun.reflect.NativeMethodAccessorImpl.invoke(NativeMethodAccessorImpl.java:62)
  50.         at sun.reflect.DelegatingMethodAccessorImpl.invoke(DelegatingMethodAccessorImpl.java:43)
  51.         at java.lang.reflect.Method.invoke(Method.java:498)
  52.         at org.junit.internal.runners.MethodRoadie.runBefores(MethodRoadie.java:133)
  53.         at org.junit.internal.runners.MethodRoadie.runBeforesThenTestThenAfters(MethodRoadie.java:96)
  54.         at org.powermock.modules.junit4.internal.impl.PowerMockJUnit44RunnerDelegateImpl$PowerMockJUnit44MethodRunner.executeTest(PowerMockJUnit44RunnerDelegateImpl.java:310)
  55.         at org.powermock.modules.junit4.internal.impl.PowerMockJUnit47RunnerDelegateImpl$PowerMockJUnit47MethodRunner.executeTestInSuper(PowerMockJUnit47RunnerDelegateImpl.java:131)
  56.         at org.powermock.modules.junit4.internal.impl.PowerMockJUnit47RunnerDelegateImpl$PowerMockJUnit47MethodRunner.access$100(PowerMockJUnit47RunnerDelegateImpl.java:59)
  57.         at org.powermock.modules.junit4.internal.impl.PowerMockJUnit47RunnerDelegateImpl$PowerMockJUnit47MethodRunner$TestExecutorStatement.evaluate(PowerMockJUnit47RunnerDelegateImpl.java:147)
  58.         at org.powermock.modules.junit4.internal.impl.PowerMockJUnit47RunnerDelegateImpl$PowerMockJUnit47MethodRunner.evaluateStatement(PowerMockJUnit47RunnerDelegateImpl.java:107)
  59.         at org.powermock.modules.junit4.internal.impl.PowerMockJUnit47RunnerDelegateImpl$PowerMockJUnit47MethodRunner.executeTest(PowerMockJUnit47RunnerDelegateImpl.java:82)
  60.         at org.powermock.modules.junit4.internal.impl.PowerMockJUnit44RunnerDelegateImpl$PowerMockJUnit44MethodRunner.runBeforesThenTestThenAfters(PowerMockJUnit44RunnerDelegateImpl.java:298)
  61.         at org.junit.internal.runners.MethodRoadie.runTest(MethodRoadie.java:87)
  62.         at org.junit.internal.runners.MethodRoadie.run(MethodRoadie.java:50)
  63.         at org.powermock.modules.junit4.internal.impl.PowerMockJUnit44RunnerDelegateImpl.invokeTestMethod(PowerMockJUnit44RunnerDelegateImpl.java:218)
  64.         at org.powermock.modules.junit4.internal.impl.PowerMockJUnit44RunnerDelegateImpl.runMethods(PowerMockJUnit44RunnerDelegateImpl.java:160)
  65.         at org.powermock.modules.junit4.internal.impl.PowerMockJUnit44RunnerDelegateImpl$1.run(PowerMockJUnit44RunnerDelegateImpl.java:134)
  66.         at org.junit.internal.runners.ClassRoadie.runUnprotected(ClassRoadie.java:34)
  67.         at org.junit.internal.runners.ClassRoadie.runProtected(ClassRoadie.java:44)
  68.         at org.powermock.modules.junit4.internal.impl.PowerMockJUnit44RunnerDelegateImpl.run(PowerMockJUnit44RunnerDelegateImpl.java:136)
  69.         at org.powermock.modules.junit4.common.internal.impl.JUnit4TestSuiteChunkerImpl.run(JUnit4TestSuiteChunkerImpl.java:121)
  70.         at org.powermock.modules.junit4.common.internal.impl.AbstractCommonPowerMockRunner.run(AbstractCommonPowerMockRunner.java:57)
  71.         at org.powermock.modules.junit4.PowerMockRunner.run(PowerMockRunner.java:59)
  72.         at org.apache.maven.surefire.junit4.JUnit4Provider.execute(JUnit4Provider.java:252)
  73.         at org.apache.maven.surefire.junit4.JUnit4Provider.executeTestSet(JUnit4Provider.java:141)
  74.         at org.apache.maven.surefire.junit4.JUnit4Provider.invoke(JUnit4Provider.java:112)
  75.         at sun.reflect.NativeMethodAccessorImpl.invoke0(Native Method)
  76.         at sun.reflect.NativeMethodAccessorImpl.invoke(NativeMethodAccessorImpl.java:62)
  77.         at sun.reflect.DelegatingMethodAccessorImpl.invoke(DelegatingMethodAccessorImpl.java:43)
  78.         at java.lang.reflect.Method.invoke(Method.java:498)
  79.         at org.apache.maven.surefire.util.ReflectionUtils.invokeMethodWithArray(ReflectionUtils.java:189)
  80.         at org.apache.maven.surefire.booter.ProviderFactory$ProviderProxy.invoke(ProviderFactory.java:165)
  81.         at org.apache.maven.surefire.booter.ProviderFactory.invokeProvider(ProviderFactory.java:85)
  82.         at org.apache.maven.surefire.booter.ForkedBooter.runSuitesInProcess(ForkedBooter.java:115)
  83.         at org.apache.maven.surefire.booter.ForkedBooter.main(ForkedBooter.java:75)
  84.  
  85. testNullCommitPatternParameter(org.xstefank.check.LatestCommitCheckTest)  Time elapsed: 0.007 sec  <<< ERROR!
  86. java.lang.NoClassDefFoundError: Could not initialize class org.xstefank.TestUtils
  87.         at java.lang.Class.forName0(Native Method)
  88.         at java.lang.Class.forName(Class.java:264)
  89.         at javassist.runtime.Desc.getClassObject(Desc.java:43)
  90.         at javassist.runtime.Desc.getClazz(Desc.java:52)
  91.         at org.xstefank.check.LatestCommitCheckTest.setUp(LatestCommitCheckTest.java:28)
  92.         at sun.reflect.NativeMethodAccessorImpl.invoke0(Native Method)
  93.         at sun.reflect.NativeMethodAccessorImpl.invoke(NativeMethodAccessorImpl.java:62)
  94.         at sun.reflect.DelegatingMethodAccessorImpl.invoke(DelegatingMethodAccessorImpl.java:43)
  95.         at java.lang.reflect.Method.invoke(Method.java:498)
  96.         at org.junit.internal.runners.MethodRoadie.runBefores(MethodRoadie.java:133)
  97.         at org.junit.internal.runners.MethodRoadie.runBeforesThenTestThenAfters(MethodRoadie.java:96)
  98.         at org.powermock.modules.junit4.internal.impl.PowerMockJUnit44RunnerDelegateImpl$PowerMockJUnit44MethodRunner.executeTest(PowerMockJUnit44RunnerDelegateImpl.java:310)
  99.         at org.powermock.modules.junit4.internal.impl.PowerMockJUnit47RunnerDelegateImpl$PowerMockJUnit47MethodRunner.executeTestInSuper(PowerMockJUnit47RunnerDelegateImpl.java:131)
  100.         at org.powermock.modules.junit4.internal.impl.PowerMockJUnit47RunnerDelegateImpl$PowerMockJUnit47MethodRunner.access$100(PowerMockJUnit47RunnerDelegateImpl.java:59)
  101.         at org.powermock.modules.junit4.internal.impl.PowerMockJUnit47RunnerDelegateImpl$PowerMockJUnit47MethodRunner$TestExecutorStatement.evaluate(PowerMockJUnit47RunnerDelegateImpl.java:147)
  102.         at org.powermock.modules.junit4.internal.impl.PowerMockJUnit47RunnerDelegateImpl$PowerMockJUnit47MethodRunner.evaluateStatement(PowerMockJUnit47RunnerDelegateImpl.java:107)
  103.         at org.powermock.modules.junit4.internal.impl.PowerMockJUnit47RunnerDelegateImpl$PowerMockJUnit47MethodRunner.executeTest(PowerMockJUnit47RunnerDelegateImpl.java:82)
  104.         at org.powermock.modules.junit4.internal.impl.PowerMockJUnit44RunnerDelegateImpl$PowerMockJUnit44MethodRunner.runBeforesThenTestThenAfters(PowerMockJUnit44RunnerDelegateImpl.java:298)
  105.         at org.junit.internal.runners.MethodRoadie.runTest(MethodRoadie.java:87)
  106.         at org.junit.internal.runners.MethodRoadie.run(MethodRoadie.java:50)
  107.         at org.powermock.modules.junit4.internal.impl.PowerMockJUnit44RunnerDelegateImpl.invokeTestMethod(PowerMockJUnit44RunnerDelegateImpl.java:218)
  108.         at org.powermock.modules.junit4.internal.impl.PowerMockJUnit44RunnerDelegateImpl.runMethods(PowerMockJUnit44RunnerDelegateImpl.java:160)
  109.         at org.powermock.modules.junit4.internal.impl.PowerMockJUnit44RunnerDelegateImpl$1.run(PowerMockJUnit44RunnerDelegateImpl.java:134)
  110.         at org.junit.internal.runners.ClassRoadie.runUnprotected(ClassRoadie.java:34)
  111.         at org.junit.internal.runners.ClassRoadie.runProtected(ClassRoadie.java:44)
  112.         at org.powermock.modules.junit4.internal.impl.PowerMockJUnit44RunnerDelegateImpl.run(PowerMockJUnit44RunnerDelegateImpl.java:136)
  113.         at org.powermock.modules.junit4.common.internal.impl.JUnit4TestSuiteChunkerImpl.run(JUnit4TestSuiteChunkerImpl.java:121)
  114.         at org.powermock.modules.junit4.common.internal.impl.AbstractCommonPowerMockRunner.run(AbstractCommonPowerMockRunner.java:57)
  115.         at org.powermock.modules.junit4.PowerMockRunner.run(PowerMockRunner.java:59)
  116.         at org.apache.maven.surefire.junit4.JUnit4Provider.execute(JUnit4Provider.java:252)
  117.         at org.apache.maven.surefire.junit4.JUnit4Provider.executeTestSet(JUnit4Provider.java:141)
  118.         at org.apache.maven.surefire.junit4.JUnit4Provider.invoke(JUnit4Provider.java:112)
  119.         at sun.reflect.NativeMethodAccessorImpl.invoke0(Native Method)
  120.         at sun.reflect.NativeMethodAccessorImpl.invoke(NativeMethodAccessorImpl.java:62)
  121.         at sun.reflect.DelegatingMethodAccessorImpl.invoke(DelegatingMethodAccessorImpl.java:43)
  122.         at java.lang.reflect.Method.invoke(Method.java:498)
  123.         at org.apache.maven.surefire.util.ReflectionUtils.invokeMethodWithArray(ReflectionUtils.java:189)
  124.         at org.apache.maven.surefire.booter.ProviderFactory$ProviderProxy.invoke(ProviderFactory.java:165)
  125.         at org.apache.maven.surefire.booter.ProviderFactory.invokeProvider(ProviderFactory.java:85)
  126.         at org.apache.maven.surefire.booter.ForkedBooter.runSuitesInProcess(ForkedBooter.java:115)
  127.         at org.apache.maven.surefire.booter.ForkedBooter.main(ForkedBooter.java:75)
  128.  
  129. testCheckSimpleRegexMatch(org.xstefank.check.LatestCommitCheckTest)  Time elapsed: 0 sec  <<< ERROR!
  130. java.lang.NoClassDefFoundError: Could not initialize class org.xstefank.TestUtils
  131.         at java.lang.Class.forName0(Native Method)
  132.         at java.lang.Class.forName(Class.java:264)
  133.         at javassist.runtime.Desc.getClassObject(Desc.java:43)
  134.         at javassist.runtime.Desc.getClazz(Desc.java:52)
  135.         at org.xstefank.check.LatestCommitCheckTest.setUp(LatestCommitCheckTest.java:28)
  136.         at sun.reflect.NativeMethodAccessorImpl.invoke0(Native Method)
  137.         at sun.reflect.NativeMethodAccessorImpl.invoke(NativeMethodAccessorImpl.java:62)
  138.         at sun.reflect.DelegatingMethodAccessorImpl.invoke(DelegatingMethodAccessorImpl.java:43)
  139.         at java.lang.reflect.Method.invoke(Method.java:498)
  140.         at org.junit.internal.runners.MethodRoadie.runBefores(MethodRoadie.java:133)
  141.         at org.junit.internal.runners.MethodRoadie.runBeforesThenTestThenAfters(MethodRoadie.java:96)
  142.         at org.powermock.modules.junit4.internal.impl.PowerMockJUnit44RunnerDelegateImpl$PowerMockJUnit44MethodRunner.executeTest(PowerMockJUnit44RunnerDelegateImpl.java:310)
  143.         at org.powermock.modules.junit4.internal.impl.PowerMockJUnit47RunnerDelegateImpl$PowerMockJUnit47MethodRunner.executeTestInSuper(PowerMockJUnit47RunnerDelegateImpl.java:131)
  144.         at org.powermock.modules.junit4.internal.impl.PowerMockJUnit47RunnerDelegateImpl$PowerMockJUnit47MethodRunner.access$100(PowerMockJUnit47RunnerDelegateImpl.java:59)
  145.         at org.powermock.modules.junit4.internal.impl.PowerMockJUnit47RunnerDelegateImpl$PowerMockJUnit47MethodRunner$TestExecutorStatement.evaluate(PowerMockJUnit47RunnerDelegateImpl.java:147)
  146.         at org.powermock.modules.junit4.internal.impl.PowerMockJUnit47RunnerDelegateImpl$PowerMockJUnit47MethodRunner.evaluateStatement(PowerMockJUnit47RunnerDelegateImpl.java:107)
  147.         at org.powermock.modules.junit4.internal.impl.PowerMockJUnit47RunnerDelegateImpl$PowerMockJUnit47MethodRunner.executeTest(PowerMockJUnit47RunnerDelegateImpl.java:82)
  148.         at org.powermock.modules.junit4.internal.impl.PowerMockJUnit44RunnerDelegateImpl$PowerMockJUnit44MethodRunner.runBeforesThenTestThenAfters(PowerMockJUnit44RunnerDelegateImpl.java:298)
  149.         at org.junit.internal.runners.MethodRoadie.runTest(MethodRoadie.java:87)
  150.         at org.junit.internal.runners.MethodRoadie.run(MethodRoadie.java:50)
  151.         at org.powermock.modules.junit4.internal.impl.PowerMockJUnit44RunnerDelegateImpl.invokeTestMethod(PowerMockJUnit44RunnerDelegateImpl.java:218)
  152.         at org.powermock.modules.junit4.internal.impl.PowerMockJUnit44RunnerDelegateImpl.runMethods(PowerMockJUnit44RunnerDelegateImpl.java:160)
  153.         at org.powermock.modules.junit4.internal.impl.PowerMockJUnit44RunnerDelegateImpl$1.run(PowerMockJUnit44RunnerDelegateImpl.java:134)
  154.         at org.junit.internal.runners.ClassRoadie.runUnprotected(ClassRoadie.java:34)
  155.         at org.junit.internal.runners.ClassRoadie.runProtected(ClassRoadie.java:44)
  156.         at org.powermock.modules.junit4.internal.impl.PowerMockJUnit44RunnerDelegateImpl.run(PowerMockJUnit44RunnerDelegateImpl.java:136)
  157.         at org.powermock.modules.junit4.common.internal.impl.JUnit4TestSuiteChunkerImpl.run(JUnit4TestSuiteChunkerImpl.java:121)
  158.         at org.powermock.modules.junit4.common.internal.impl.AbstractCommonPowerMockRunner.run(AbstractCommonPowerMockRunner.java:57)
  159.         at org.powermock.modules.junit4.PowerMockRunner.run(PowerMockRunner.java:59)
  160.         at org.apache.maven.surefire.junit4.JUnit4Provider.execute(JUnit4Provider.java:252)
  161.         at org.apache.maven.surefire.junit4.JUnit4Provider.executeTestSet(JUnit4Provider.java:141)
  162.         at org.apache.maven.surefire.junit4.JUnit4Provider.invoke(JUnit4Provider.java:112)
  163.         at sun.reflect.NativeMethodAccessorImpl.invoke0(Native Method)
  164.         at sun.reflect.NativeMethodAccessorImpl.invoke(NativeMethodAccessorImpl.java:62)
  165.         at sun.reflect.DelegatingMethodAccessorImpl.invoke(DelegatingMethodAccessorImpl.java:43)
  166.         at java.lang.reflect.Method.invoke(Method.java:498)
  167.         at org.apache.maven.surefire.util.ReflectionUtils.invokeMethodWithArray(ReflectionUtils.java:189)
  168.         at org.apache.maven.surefire.booter.ProviderFactory$ProviderProxy.invoke(ProviderFactory.java:165)
  169.         at org.apache.maven.surefire.booter.ProviderFactory.invokeProvider(ProviderFactory.java:85)
  170.         at org.apache.maven.surefire.booter.ForkedBooter.runSuitesInProcess(ForkedBooter.java:115)
  171.         at org.apache.maven.surefire.booter.ForkedBooter.main(ForkedBooter.java:75)
  172.  
  173. testCheckSimpleRegexNonMatchReturnsDefaultMessage(org.xstefank.check.LatestCommitCheckTest)  Time elapsed: 0 sec  <<< ERROR!
  174. java.lang.NoClassDefFoundError: Could not initialize class org.xstefank.TestUtils
  175.         at java.lang.Class.forName0(Native Method)
  176.         at java.lang.Class.forName(Class.java:264)
  177.         at javassist.runtime.Desc.getClassObject(Desc.java:43)
  178.         at javassist.runtime.Desc.getClazz(Desc.java:52)
  179.         at org.xstefank.check.LatestCommitCheckTest.setUp(LatestCommitCheckTest.java:28)
  180.         at sun.reflect.NativeMethodAccessorImpl.invoke0(Native Method)
  181.         at sun.reflect.NativeMethodAccessorImpl.invoke(NativeMethodAccessorImpl.java:62)
  182.         at sun.reflect.DelegatingMethodAccessorImpl.invoke(DelegatingMethodAccessorImpl.java:43)
  183.         at java.lang.reflect.Method.invoke(Method.java:498)
  184.         at org.junit.internal.runners.MethodRoadie.runBefores(MethodRoadie.java:133)
  185.         at org.junit.internal.runners.MethodRoadie.runBeforesThenTestThenAfters(MethodRoadie.java:96)
  186.         at org.powermock.modules.junit4.internal.impl.PowerMockJUnit44RunnerDelegateImpl$PowerMockJUnit44MethodRunner.executeTest(PowerMockJUnit44RunnerDelegateImpl.java:310)
  187.         at org.powermock.modules.junit4.internal.impl.PowerMockJUnit47RunnerDelegateImpl$PowerMockJUnit47MethodRunner.executeTestInSuper(PowerMockJUnit47RunnerDelegateImpl.java:131)
  188.         at org.powermock.modules.junit4.internal.impl.PowerMockJUnit47RunnerDelegateImpl$PowerMockJUnit47MethodRunner.access$100(PowerMockJUnit47RunnerDelegateImpl.java:59)
  189.         at org.powermock.modules.junit4.internal.impl.PowerMockJUnit47RunnerDelegateImpl$PowerMockJUnit47MethodRunner$TestExecutorStatement.evaluate(PowerMockJUnit47RunnerDelegateImpl.java:147)
  190.         at org.powermock.modules.junit4.internal.impl.PowerMockJUnit47RunnerDelegateImpl$PowerMockJUnit47MethodRunner.evaluateStatement(PowerMockJUnit47RunnerDelegateImpl.java:107)
  191.         at org.powermock.modules.junit4.internal.impl.PowerMockJUnit47RunnerDelegateImpl$PowerMockJUnit47MethodRunner.executeTest(PowerMockJUnit47RunnerDelegateImpl.java:82)
  192.         at org.powermock.modules.junit4.internal.impl.PowerMockJUnit44RunnerDelegateImpl$PowerMockJUnit44MethodRunner.runBeforesThenTestThenAfters(PowerMockJUnit44RunnerDelegateImpl.java:298)
  193.         at org.junit.internal.runners.MethodRoadie.runTest(MethodRoadie.java:87)
  194.         at org.junit.internal.runners.MethodRoadie.run(MethodRoadie.java:50)
  195.         at org.powermock.modules.junit4.internal.impl.PowerMockJUnit44RunnerDelegateImpl.invokeTestMethod(PowerMockJUnit44RunnerDelegateImpl.java:218)
  196.         at org.powermock.modules.junit4.internal.impl.PowerMockJUnit44RunnerDelegateImpl.runMethods(PowerMockJUnit44RunnerDelegateImpl.java:160)
  197.         at org.powermock.modules.junit4.internal.impl.PowerMockJUnit44RunnerDelegateImpl$1.run(PowerMockJUnit44RunnerDelegateImpl.java:134)
  198.         at org.junit.internal.runners.ClassRoadie.runUnprotected(ClassRoadie.java:34)
  199.         at org.junit.internal.runners.ClassRoadie.runProtected(ClassRoadie.java:44)
  200.         at org.powermock.modules.junit4.internal.impl.PowerMockJUnit44RunnerDelegateImpl.run(PowerMockJUnit44RunnerDelegateImpl.java:136)
  201.         at org.powermock.modules.junit4.common.internal.impl.JUnit4TestSuiteChunkerImpl.run(JUnit4TestSuiteChunkerImpl.java:121)
  202.         at org.powermock.modules.junit4.common.internal.impl.AbstractCommonPowerMockRunner.run(AbstractCommonPowerMockRunner.java:57)
  203.         at org.powermock.modules.junit4.PowerMockRunner.run(PowerMockRunner.java:59)
  204.         at org.apache.maven.surefire.junit4.JUnit4Provider.execute(JUnit4Provider.java:252)
  205.         at org.apache.maven.surefire.junit4.JUnit4Provider.executeTestSet(JUnit4Provider.java:141)
  206.         at org.apache.maven.surefire.junit4.JUnit4Provider.invoke(JUnit4Provider.java:112)
  207.         at sun.reflect.NativeMethodAccessorImpl.invoke0(Native Method)
  208.         at sun.reflect.NativeMethodAccessorImpl.invoke(NativeMethodAccessorImpl.java:62)
  209.         at sun.reflect.DelegatingMethodAccessorImpl.invoke(DelegatingMethodAccessorImpl.java:43)
  210.         at java.lang.reflect.Method.invoke(Method.java:498)
  211.         at org.apache.maven.surefire.util.ReflectionUtils.invokeMethodWithArray(ReflectionUtils.java:189)
  212.         at org.apache.maven.surefire.booter.ProviderFactory$ProviderProxy.invoke(ProviderFactory.java:165)
  213.         at org.apache.maven.surefire.booter.ProviderFactory.invokeProvider(ProviderFactory.java:85)
  214.         at org.apache.maven.surefire.booter.ForkedBooter.runSuitesInProcess(ForkedBooter.java:115)
  215.         at org.apache.maven.surefire.booter.ForkedBooter.main(ForkedBooter.java:75)
  216.  
  217. Running org.xstefank.check.additional.OneCommitOnlyCheckTest
  218. Tests run: 4, Failures: 0, Errors: 3, Skipped: 0, Time elapsed: 0.055 sec <<< FAILURE!
  219. testCheckEmptyPayload(org.xstefank.check.additional.OneCommitOnlyCheckTest)  Time elapsed: 0.024 sec  <<< ERROR!
  220. java.lang.Exception: Unexpected exception, expected<java.lang.NullPointerException> but was<java.lang.ExceptionInInitializerError>
  221.         at org.junit.internal.runners.statements.ExpectException.evaluate(ExpectException.java:28)
  222.         at org.junit.internal.runners.statements.RunBefores.evaluate(RunBefores.java:26)
  223.         at org.junit.runners.ParentRunner.runLeaf(ParentRunner.java:325)
  224.         at org.junit.runners.BlockJUnit4ClassRunner.runChild(BlockJUnit4ClassRunner.java:78)
  225.         at org.junit.runners.BlockJUnit4ClassRunner.runChild(BlockJUnit4ClassRunner.java:57)
  226.         at org.junit.runners.ParentRunner$3.run(ParentRunner.java:290)
  227.         at org.junit.runners.ParentRunner$1.schedule(ParentRunner.java:71)
  228.         at org.junit.runners.ParentRunner.runChildren(ParentRunner.java:288)
  229.         at org.junit.runners.ParentRunner.access$000(ParentRunner.java:58)
  230.         at org.junit.runners.ParentRunner$2.evaluate(ParentRunner.java:268)
  231.         at org.junit.runners.ParentRunner.run(ParentRunner.java:363)
  232.         at org.apache.maven.surefire.junit4.JUnit4Provider.execute(JUnit4Provider.java:252)
  233.         at org.apache.maven.surefire.junit4.JUnit4Provider.executeTestSet(JUnit4Provider.java:141)
  234.         at org.apache.maven.surefire.junit4.JUnit4Provider.invoke(JUnit4Provider.java:112)
  235.         at sun.reflect.NativeMethodAccessorImpl.invoke0(Native Method)
  236.         at sun.reflect.NativeMethodAccessorImpl.invoke(NativeMethodAccessorImpl.java:62)
  237.         at sun.reflect.DelegatingMethodAccessorImpl.invoke(DelegatingMethodAccessorImpl.java:43)
  238.         at java.lang.reflect.Method.invoke(Method.java:498)
  239.         at org.apache.maven.surefire.util.ReflectionUtils.invokeMethodWithArray(ReflectionUtils.java:189)
  240.         at org.apache.maven.surefire.booter.ProviderFactory$ProviderProxy.invoke(ProviderFactory.java:165)
  241.         at org.apache.maven.surefire.booter.ProviderFactory.invokeProvider(ProviderFactory.java:85)
  242.         at org.apache.maven.surefire.booter.ForkedBooter.runSuitesInProcess(ForkedBooter.java:115)
  243.         at org.apache.maven.surefire.booter.ForkedBooter.main(ForkedBooter.java:75)
  244. Caused by: java.lang.ExceptionInInitializerError
  245.         at org.xstefank.check.additional.OneCommitOnlyCheckTest.testCheckEmptyPayload(OneCommitOnlyCheckTest.java:34)
  246.         at sun.reflect.NativeMethodAccessorImpl.invoke0(Native Method)
  247.         at sun.reflect.NativeMethodAccessorImpl.invoke(NativeMethodAccessorImpl.java:62)
  248.         at sun.reflect.DelegatingMethodAccessorImpl.invoke(DelegatingMethodAccessorImpl.java:43)
  249.         at java.lang.reflect.Method.invoke(Method.java:498)
  250.         at org.junit.runners.model.FrameworkMethod$1.runReflectiveCall(FrameworkMethod.java:50)
  251.         at org.junit.internal.runners.model.ReflectiveCallable.run(ReflectiveCallable.java:12)
  252.         at org.junit.runners.model.FrameworkMethod.invokeExplosively(FrameworkMethod.java:47)
  253.         at org.junit.internal.runners.statements.InvokeMethod.evaluate(InvokeMethod.java:17)
  254.         at org.junit.internal.runners.statements.ExpectException.evaluate(ExpectException.java:19)
  255.         ... 22 more
  256. Caused by: java.lang.RuntimeException: Cannot load file json/testPayload.json
  257.         at org.xstefank.TestUtils.loadJson(TestUtils.java:78)
  258.         at org.xstefank.TestUtils.<clinit>(TestUtils.java:24)
  259.         ... 32 more
  260.  
  261. testIfPayloadHasMoreCommits(org.xstefank.check.additional.OneCommitOnlyCheckTest)  Time elapsed: 0 sec  <<< ERROR!
  262. java.lang.NoClassDefFoundError: Could not initialize class org.xstefank.TestUtils
  263.         at org.xstefank.check.additional.OneCommitOnlyCheckTest.testIfPayloadHasMoreCommits(OneCommitOnlyCheckTest.java:24)
  264.         at sun.reflect.NativeMethodAccessorImpl.invoke0(Native Method)
  265.         at sun.reflect.NativeMethodAccessorImpl.invoke(NativeMethodAccessorImpl.java:62)
  266.         at sun.reflect.DelegatingMethodAccessorImpl.invoke(DelegatingMethodAccessorImpl.java:43)
  267.         at java.lang.reflect.Method.invoke(Method.java:498)
  268.         at org.junit.runners.model.FrameworkMethod$1.runReflectiveCall(FrameworkMethod.java:50)
  269.         at org.junit.internal.runners.model.ReflectiveCallable.run(ReflectiveCallable.java:12)
  270.         at org.junit.runners.model.FrameworkMethod.invokeExplosively(FrameworkMethod.java:47)
  271.         at org.junit.internal.runners.statements.InvokeMethod.evaluate(InvokeMethod.java:17)
  272.         at org.junit.internal.runners.statements.RunBefores.evaluate(RunBefores.java:26)
  273.         at org.junit.runners.ParentRunner.runLeaf(ParentRunner.java:325)
  274.         at org.junit.runners.BlockJUnit4ClassRunner.runChild(BlockJUnit4ClassRunner.java:78)
  275.         at org.junit.runners.BlockJUnit4ClassRunner.runChild(BlockJUnit4ClassRunner.java:57)
  276.         at org.junit.runners.ParentRunner$3.run(ParentRunner.java:290)
  277.         at org.junit.runners.ParentRunner$1.schedule(ParentRunner.java:71)
  278.         at org.junit.runners.ParentRunner.runChildren(ParentRunner.java:288)
  279.         at org.junit.runners.ParentRunner.access$000(ParentRunner.java:58)
  280.         at org.junit.runners.ParentRunner$2.evaluate(ParentRunner.java:268)
  281.         at org.junit.runners.ParentRunner.run(ParentRunner.java:363)
  282.         at org.apache.maven.surefire.junit4.JUnit4Provider.execute(JUnit4Provider.java:252)
  283.         at org.apache.maven.surefire.junit4.JUnit4Provider.executeTestSet(JUnit4Provider.java:141)
  284.         at org.apache.maven.surefire.junit4.JUnit4Provider.invoke(JUnit4Provider.java:112)
  285.         at sun.reflect.NativeMethodAccessorImpl.invoke0(Native Method)
  286.         at sun.reflect.NativeMethodAccessorImpl.invoke(NativeMethodAccessorImpl.java:62)
  287.         at sun.reflect.DelegatingMethodAccessorImpl.invoke(DelegatingMethodAccessorImpl.java:43)
  288.         at java.lang.reflect.Method.invoke(Method.java:498)
  289.         at org.apache.maven.surefire.util.ReflectionUtils.invokeMethodWithArray(ReflectionUtils.java:189)
  290.         at org.apache.maven.surefire.booter.ProviderFactory$ProviderProxy.invoke(ProviderFactory.java:165)
  291.         at org.apache.maven.surefire.booter.ProviderFactory.invokeProvider(ProviderFactory.java:85)
  292.         at org.apache.maven.surefire.booter.ForkedBooter.runSuitesInProcess(ForkedBooter.java:115)
  293.         at org.apache.maven.surefire.booter.ForkedBooter.main(ForkedBooter.java:75)
  294.  
  295. testIfPayloadHasOnlyOneCommit(org.xstefank.check.additional.OneCommitOnlyCheckTest)  Time elapsed: 0.001 sec  <<< ERROR!
  296. java.lang.NoClassDefFoundError: Could not initialize class org.xstefank.TestUtils
  297.         at org.xstefank.check.additional.OneCommitOnlyCheckTest.testIfPayloadHasOnlyOneCommit(OneCommitOnlyCheckTest.java:19)
  298.         at sun.reflect.NativeMethodAccessorImpl.invoke0(Native Method)
  299.         at sun.reflect.NativeMethodAccessorImpl.invoke(NativeMethodAccessorImpl.java:62)
  300.         at sun.reflect.DelegatingMethodAccessorImpl.invoke(DelegatingMethodAccessorImpl.java:43)
  301.         at java.lang.reflect.Method.invoke(Method.java:498)
  302.         at org.junit.runners.model.FrameworkMethod$1.runReflectiveCall(FrameworkMethod.java:50)
  303.         at org.junit.internal.runners.model.ReflectiveCallable.run(ReflectiveCallable.java:12)
  304.         at org.junit.runners.model.FrameworkMethod.invokeExplosively(FrameworkMethod.java:47)
  305.         at org.junit.internal.runners.statements.InvokeMethod.evaluate(InvokeMethod.java:17)
  306.         at org.junit.internal.runners.statements.RunBefores.evaluate(RunBefores.java:26)
  307.         at org.junit.runners.ParentRunner.runLeaf(ParentRunner.java:325)
  308.         at org.junit.runners.BlockJUnit4ClassRunner.runChild(BlockJUnit4ClassRunner.java:78)
  309.         at org.junit.runners.BlockJUnit4ClassRunner.runChild(BlockJUnit4ClassRunner.java:57)
  310.         at org.junit.runners.ParentRunner$3.run(ParentRunner.java:290)
  311.         at org.junit.runners.ParentRunner$1.schedule(ParentRunner.java:71)
  312.         at org.junit.runners.ParentRunner.runChildren(ParentRunner.java:288)
  313.         at org.junit.runners.ParentRunner.access$000(ParentRunner.java:58)
  314.         at org.junit.runners.ParentRunner$2.evaluate(ParentRunner.java:268)
  315.         at org.junit.runners.ParentRunner.run(ParentRunner.java:363)
  316.         at org.apache.maven.surefire.junit4.JUnit4Provider.execute(JUnit4Provider.java:252)
  317.         at org.apache.maven.surefire.junit4.JUnit4Provider.executeTestSet(JUnit4Provider.java:141)
  318.         at org.apache.maven.surefire.junit4.JUnit4Provider.invoke(JUnit4Provider.java:112)
  319.         at sun.reflect.NativeMethodAccessorImpl.invoke0(Native Method)
  320.         at sun.reflect.NativeMethodAccessorImpl.invoke(NativeMethodAccessorImpl.java:62)
  321.         at sun.reflect.DelegatingMethodAccessorImpl.invoke(DelegatingMethodAccessorImpl.java:43)
  322.         at java.lang.reflect.Method.invoke(Method.java:498)
  323.         at org.apache.maven.surefire.util.ReflectionUtils.invokeMethodWithArray(ReflectionUtils.java:189)
  324.         at org.apache.maven.surefire.booter.ProviderFactory$ProviderProxy.invoke(ProviderFactory.java:165)
  325.         at org.apache.maven.surefire.booter.ProviderFactory.invokeProvider(ProviderFactory.java:85)
  326.         at org.apache.maven.surefire.booter.ForkedBooter.runSuitesInProcess(ForkedBooter.java:115)
  327.         at org.apache.maven.surefire.booter.ForkedBooter.main(ForkedBooter.java:75)
  328.  
  329. Running org.xstefank.check.additional.TitleIssueLinkIncludedCheckTest
  330. Tests run: 4, Failures: 0, Errors: 3, Skipped: 0, Time elapsed: 0.001 sec <<< FAILURE!
  331. testIfEmptyPayloadThrowsException(org.xstefank.check.additional.TitleIssueLinkIncludedCheckTest)  Time elapsed: 0 sec  <<< ERROR!
  332. java.lang.Exception: Unexpected exception, expected<java.lang.NullPointerException> but was<java.lang.NoClassDefFoundError>
  333.         at org.junit.internal.runners.statements.ExpectException.evaluate(ExpectException.java:28)
  334.         at org.junit.internal.runners.statements.RunBefores.evaluate(RunBefores.java:26)
  335.         at org.junit.runners.ParentRunner.runLeaf(ParentRunner.java:325)
  336.         at org.junit.runners.BlockJUnit4ClassRunner.runChild(BlockJUnit4ClassRunner.java:78)
  337.         at org.junit.runners.BlockJUnit4ClassRunner.runChild(BlockJUnit4ClassRunner.java:57)
  338.         at org.junit.runners.ParentRunner$3.run(ParentRunner.java:290)
  339.         at org.junit.runners.ParentRunner$1.schedule(ParentRunner.java:71)
  340.         at org.junit.runners.ParentRunner.runChildren(ParentRunner.java:288)
  341.         at org.junit.runners.ParentRunner.access$000(ParentRunner.java:58)
  342.         at org.junit.runners.ParentRunner$2.evaluate(ParentRunner.java:268)
  343.         at org.junit.runners.ParentRunner.run(ParentRunner.java:363)
  344.         at org.apache.maven.surefire.junit4.JUnit4Provider.execute(JUnit4Provider.java:252)
  345.         at org.apache.maven.surefire.junit4.JUnit4Provider.executeTestSet(JUnit4Provider.java:141)
  346.         at org.apache.maven.surefire.junit4.JUnit4Provider.invoke(JUnit4Provider.java:112)
  347.         at sun.reflect.NativeMethodAccessorImpl.invoke0(Native Method)
  348.         at sun.reflect.NativeMethodAccessorImpl.invoke(NativeMethodAccessorImpl.java:62)
  349.         at sun.reflect.DelegatingMethodAccessorImpl.invoke(DelegatingMethodAccessorImpl.java:43)
  350.         at java.lang.reflect.Method.invoke(Method.java:498)
  351.         at org.apache.maven.surefire.util.ReflectionUtils.invokeMethodWithArray(ReflectionUtils.java:189)
  352.         at org.apache.maven.surefire.booter.ProviderFactory$ProviderProxy.invoke(ProviderFactory.java:165)
  353.         at org.apache.maven.surefire.booter.ProviderFactory.invokeProvider(ProviderFactory.java:85)
  354.         at org.apache.maven.surefire.booter.ForkedBooter.runSuitesInProcess(ForkedBooter.java:115)
  355.         at org.apache.maven.surefire.booter.ForkedBooter.main(ForkedBooter.java:75)
  356. Caused by: java.lang.NoClassDefFoundError: Could not initialize class org.xstefank.TestUtils
  357.         at org.xstefank.check.additional.TitleIssueLinkIncludedCheckTest.testIfEmptyPayloadThrowsException(TitleIssueLinkIncludedCheckTest.java:36)
  358.         at sun.reflect.NativeMethodAccessorImpl.invoke0(Native Method)
  359.         at sun.reflect.NativeMethodAccessorImpl.invoke(NativeMethodAccessorImpl.java:62)
  360.         at sun.reflect.DelegatingMethodAccessorImpl.invoke(DelegatingMethodAccessorImpl.java:43)
  361.         at java.lang.reflect.Method.invoke(Method.java:498)
  362.         at org.junit.runners.model.FrameworkMethod$1.runReflectiveCall(FrameworkMethod.java:50)
  363.         at org.junit.internal.runners.model.ReflectiveCallable.run(ReflectiveCallable.java:12)
  364.         at org.junit.runners.model.FrameworkMethod.invokeExplosively(FrameworkMethod.java:47)
  365.         at org.junit.internal.runners.statements.InvokeMethod.evaluate(InvokeMethod.java:17)
  366.         at org.junit.internal.runners.statements.ExpectException.evaluate(ExpectException.java:19)
  367.         ... 22 more
  368.  
  369. testIfTitleHasRightFormat(org.xstefank.check.additional.TitleIssueLinkIncludedCheckTest)  Time elapsed: 0 sec  <<< ERROR!
  370. java.lang.NoClassDefFoundError: Could not initialize class org.xstefank.TestUtils
  371.         at org.xstefank.check.additional.TitleIssueLinkIncludedCheckTest.testIfTitleHasRightFormat(TitleIssueLinkIncludedCheckTest.java:21)
  372.         at sun.reflect.NativeMethodAccessorImpl.invoke0(Native Method)
  373.         at sun.reflect.NativeMethodAccessorImpl.invoke(NativeMethodAccessorImpl.java:62)
  374.         at sun.reflect.DelegatingMethodAccessorImpl.invoke(DelegatingMethodAccessorImpl.java:43)
  375.         at java.lang.reflect.Method.invoke(Method.java:498)
  376.         at org.junit.runners.model.FrameworkMethod$1.runReflectiveCall(FrameworkMethod.java:50)
  377.         at org.junit.internal.runners.model.ReflectiveCallable.run(ReflectiveCallable.java:12)
  378.         at org.junit.runners.model.FrameworkMethod.invokeExplosively(FrameworkMethod.java:47)
  379.         at org.junit.internal.runners.statements.InvokeMethod.evaluate(InvokeMethod.java:17)
  380.         at org.junit.internal.runners.statements.RunBefores.evaluate(RunBefores.java:26)
  381.         at org.junit.runners.ParentRunner.runLeaf(ParentRunner.java:325)
  382.         at org.junit.runners.BlockJUnit4ClassRunner.runChild(BlockJUnit4ClassRunner.java:78)
  383.         at org.junit.runners.BlockJUnit4ClassRunner.runChild(BlockJUnit4ClassRunner.java:57)
  384.         at org.junit.runners.ParentRunner$3.run(ParentRunner.java:290)
  385.         at org.junit.runners.ParentRunner$1.schedule(ParentRunner.java:71)
  386.         at org.junit.runners.ParentRunner.runChildren(ParentRunner.java:288)
  387.         at org.junit.runners.ParentRunner.access$000(ParentRunner.java:58)
  388.         at org.junit.runners.ParentRunner$2.evaluate(ParentRunner.java:268)
  389.         at org.junit.runners.ParentRunner.run(ParentRunner.java:363)
  390.         at org.apache.maven.surefire.junit4.JUnit4Provider.execute(JUnit4Provider.java:252)
  391.         at org.apache.maven.surefire.junit4.JUnit4Provider.executeTestSet(JUnit4Provider.java:141)
  392.         at org.apache.maven.surefire.junit4.JUnit4Provider.invoke(JUnit4Provider.java:112)
  393.         at sun.reflect.NativeMethodAccessorImpl.invoke0(Native Method)
  394.         at sun.reflect.NativeMethodAccessorImpl.invoke(NativeMethodAccessorImpl.java:62)
  395.         at sun.reflect.DelegatingMethodAccessorImpl.invoke(DelegatingMethodAccessorImpl.java:43)
  396.         at java.lang.reflect.Method.invoke(Method.java:498)
  397.         at org.apache.maven.surefire.util.ReflectionUtils.invokeMethodWithArray(ReflectionUtils.java:189)
  398.         at org.apache.maven.surefire.booter.ProviderFactory$ProviderProxy.invoke(ProviderFactory.java:165)
  399.         at org.apache.maven.surefire.booter.ProviderFactory.invokeProvider(ProviderFactory.java:85)
  400.         at org.apache.maven.surefire.booter.ForkedBooter.runSuitesInProcess(ForkedBooter.java:115)
  401.         at org.apache.maven.surefire.booter.ForkedBooter.main(ForkedBooter.java:75)
  402.  
  403. testIfTitleHasBadFormat(org.xstefank.check.additional.TitleIssueLinkIncludedCheckTest)  Time elapsed: 0.001 sec  <<< ERROR!
  404. java.lang.NoClassDefFoundError: Could not initialize class org.xstefank.TestUtils
  405.         at org.xstefank.check.additional.TitleIssueLinkIncludedCheckTest.testIfTitleHasBadFormat(TitleIssueLinkIncludedCheckTest.java:26)
  406.         at sun.reflect.NativeMethodAccessorImpl.invoke0(Native Method)
  407.         at sun.reflect.NativeMethodAccessorImpl.invoke(NativeMethodAccessorImpl.java:62)
  408.         at sun.reflect.DelegatingMethodAccessorImpl.invoke(DelegatingMethodAccessorImpl.java:43)
  409.         at java.lang.reflect.Method.invoke(Method.java:498)
  410.         at org.junit.runners.model.FrameworkMethod$1.runReflectiveCall(FrameworkMethod.java:50)
  411.         at org.junit.internal.runners.model.ReflectiveCallable.run(ReflectiveCallable.java:12)
  412.         at org.junit.runners.model.FrameworkMethod.invokeExplosively(FrameworkMethod.java:47)
  413.         at org.junit.internal.runners.statements.InvokeMethod.evaluate(InvokeMethod.java:17)
  414.         at org.junit.internal.runners.statements.RunBefores.evaluate(RunBefores.java:26)
  415.         at org.junit.runners.ParentRunner.runLeaf(ParentRunner.java:325)
  416.         at org.junit.runners.BlockJUnit4ClassRunner.runChild(BlockJUnit4ClassRunner.java:78)
  417.         at org.junit.runners.BlockJUnit4ClassRunner.runChild(BlockJUnit4ClassRunner.java:57)
  418.         at org.junit.runners.ParentRunner$3.run(ParentRunner.java:290)
  419.         at org.junit.runners.ParentRunner$1.schedule(ParentRunner.java:71)
  420.         at org.junit.runners.ParentRunner.runChildren(ParentRunner.java:288)
  421.         at org.junit.runners.ParentRunner.access$000(ParentRunner.java:58)
  422.         at org.junit.runners.ParentRunner$2.evaluate(ParentRunner.java:268)
  423.         at org.junit.runners.ParentRunner.run(ParentRunner.java:363)
  424.         at org.apache.maven.surefire.junit4.JUnit4Provider.execute(JUnit4Provider.java:252)
  425.         at org.apache.maven.surefire.junit4.JUnit4Provider.executeTestSet(JUnit4Provider.java:141)
  426.         at org.apache.maven.surefire.junit4.JUnit4Provider.invoke(JUnit4Provider.java:112)
  427.         at sun.reflect.NativeMethodAccessorImpl.invoke0(Native Method)
  428.         at sun.reflect.NativeMethodAccessorImpl.invoke(NativeMethodAccessorImpl.java:62)
  429.         at sun.reflect.DelegatingMethodAccessorImpl.invoke(DelegatingMethodAccessorImpl.java:43)
  430.         at java.lang.reflect.Method.invoke(Method.java:498)
  431.         at org.apache.maven.surefire.util.ReflectionUtils.invokeMethodWithArray(ReflectionUtils.java:189)
  432.         at org.apache.maven.surefire.booter.ProviderFactory$ProviderProxy.invoke(ProviderFactory.java:165)
  433.         at org.apache.maven.surefire.booter.ProviderFactory.invokeProvider(ProviderFactory.java:85)
  434.         at org.apache.maven.surefire.booter.ForkedBooter.runSuitesInProcess(ForkedBooter.java:115)
  435.         at org.apache.maven.surefire.booter.ForkedBooter.main(ForkedBooter.java:75)
  436.  
  437. Running org.xstefank.check.RequiredRowsCheckTest
  438. Tests run: 4, Failures: 0, Errors: 4, Skipped: 0, Time elapsed: 0.001 sec <<< FAILURE!
  439. checkSimpleRegexMatch(org.xstefank.check.RequiredRowsCheckTest)  Time elapsed: 0.001 sec  <<< ERROR!
  440. java.lang.NoClassDefFoundError: Could not initialize class org.xstefank.TestUtils
  441.         at org.xstefank.check.RequiredRowsCheckTest.checkSimpleRegexMatch(RequiredRowsCheckTest.java:34)
  442.         at sun.reflect.NativeMethodAccessorImpl.invoke0(Native Method)
  443.         at sun.reflect.NativeMethodAccessorImpl.invoke(NativeMethodAccessorImpl.java:62)
  444.         at sun.reflect.DelegatingMethodAccessorImpl.invoke(DelegatingMethodAccessorImpl.java:43)
  445.         at java.lang.reflect.Method.invoke(Method.java:498)
  446.         at org.junit.runners.model.FrameworkMethod$1.runReflectiveCall(FrameworkMethod.java:50)
  447.         at org.junit.internal.runners.model.ReflectiveCallable.run(ReflectiveCallable.java:12)
  448.         at org.junit.runners.model.FrameworkMethod.invokeExplosively(FrameworkMethod.java:47)
  449.         at org.junit.internal.runners.statements.InvokeMethod.evaluate(InvokeMethod.java:17)
  450.         at org.junit.internal.runners.statements.RunBefores.evaluate(RunBefores.java:26)
  451.         at org.junit.runners.ParentRunner.runLeaf(ParentRunner.java:325)
  452.         at org.junit.runners.BlockJUnit4ClassRunner.runChild(BlockJUnit4ClassRunner.java:78)
  453.         at org.junit.runners.BlockJUnit4ClassRunner.runChild(BlockJUnit4ClassRunner.java:57)
  454.         at org.junit.runners.ParentRunner$3.run(ParentRunner.java:290)
  455.         at org.junit.runners.ParentRunner$1.schedule(ParentRunner.java:71)
  456.         at org.junit.runners.ParentRunner.runChildren(ParentRunner.java:288)
  457.         at org.junit.runners.ParentRunner.access$000(ParentRunner.java:58)
  458.         at org.junit.runners.ParentRunner$2.evaluate(ParentRunner.java:268)
  459.         at org.junit.internal.runners.statements.RunBefores.evaluate(RunBefores.java:26)
  460.         at org.junit.runners.ParentRunner.run(ParentRunner.java:363)
  461.         at org.apache.maven.surefire.junit4.JUnit4Provider.execute(JUnit4Provider.java:252)
  462.         at org.apache.maven.surefire.junit4.JUnit4Provider.executeTestSet(JUnit4Provider.java:141)
  463.         at org.apache.maven.surefire.junit4.JUnit4Provider.invoke(JUnit4Provider.java:112)
  464.         at sun.reflect.NativeMethodAccessorImpl.invoke0(Native Method)
  465.         at sun.reflect.NativeMethodAccessorImpl.invoke(NativeMethodAccessorImpl.java:62)
  466.         at sun.reflect.DelegatingMethodAccessorImpl.invoke(DelegatingMethodAccessorImpl.java:43)
  467.         at java.lang.reflect.Method.invoke(Method.java:498)
  468.         at org.apache.maven.surefire.util.ReflectionUtils.invokeMethodWithArray(ReflectionUtils.java:189)
  469.         at org.apache.maven.surefire.booter.ProviderFactory$ProviderProxy.invoke(ProviderFactory.java:165)
  470.         at org.apache.maven.surefire.booter.ProviderFactory.invokeProvider(ProviderFactory.java:85)
  471.         at org.apache.maven.surefire.booter.ForkedBooter.runSuitesInProcess(ForkedBooter.java:115)
  472.         at org.apache.maven.surefire.booter.ForkedBooter.main(ForkedBooter.java:75)
  473.  
  474. testIfNullParameterThrowsException(org.xstefank.check.RequiredRowsCheckTest)  Time elapsed: 0 sec  <<< ERROR!
  475. java.lang.Exception: Unexpected exception, expected<java.lang.NullPointerException> but was<java.lang.NoClassDefFoundError>
  476.         at org.junit.internal.runners.statements.ExpectException.evaluate(ExpectException.java:28)
  477.         at org.junit.internal.runners.statements.RunBefores.evaluate(RunBefores.java:26)
  478.         at org.junit.runners.ParentRunner.runLeaf(ParentRunner.java:325)
  479.         at org.junit.runners.BlockJUnit4ClassRunner.runChild(BlockJUnit4ClassRunner.java:78)
  480.         at org.junit.runners.BlockJUnit4ClassRunner.runChild(BlockJUnit4ClassRunner.java:57)
  481.         at org.junit.runners.ParentRunner$3.run(ParentRunner.java:290)
  482.         at org.junit.runners.ParentRunner$1.schedule(ParentRunner.java:71)
  483.         at org.junit.runners.ParentRunner.runChildren(ParentRunner.java:288)
  484.         at org.junit.runners.ParentRunner.access$000(ParentRunner.java:58)
  485.         at org.junit.runners.ParentRunner$2.evaluate(ParentRunner.java:268)
  486.         at org.junit.internal.runners.statements.RunBefores.evaluate(RunBefores.java:26)
  487.         at org.junit.runners.ParentRunner.run(ParentRunner.java:363)
  488.         at org.apache.maven.surefire.junit4.JUnit4Provider.execute(JUnit4Provider.java:252)
  489.         at org.apache.maven.surefire.junit4.JUnit4Provider.executeTestSet(JUnit4Provider.java:141)
  490.         at org.apache.maven.surefire.junit4.JUnit4Provider.invoke(JUnit4Provider.java:112)
  491.         at sun.reflect.NativeMethodAccessorImpl.invoke0(Native Method)
  492.         at sun.reflect.NativeMethodAccessorImpl.invoke(NativeMethodAccessorImpl.java:62)
  493.         at sun.reflect.DelegatingMethodAccessorImpl.invoke(DelegatingMethodAccessorImpl.java:43)
  494.         at java.lang.reflect.Method.invoke(Method.java:498)
  495.         at org.apache.maven.surefire.util.ReflectionUtils.invokeMethodWithArray(ReflectionUtils.java:189)
  496.         at org.apache.maven.surefire.booter.ProviderFactory$ProviderProxy.invoke(ProviderFactory.java:165)
  497.         at org.apache.maven.surefire.booter.ProviderFactory.invokeProvider(ProviderFactory.java:85)
  498.         at org.apache.maven.surefire.booter.ForkedBooter.runSuitesInProcess(ForkedBooter.java:115)
  499.         at org.apache.maven.surefire.booter.ForkedBooter.main(ForkedBooter.java:75)
  500. Caused by: java.lang.NoClassDefFoundError: Could not initialize class org.xstefank.TestUtils
  501.         at org.xstefank.check.RequiredRowsCheckTest.testIfNullParameterThrowsException(RequiredRowsCheckTest.java:46)
  502.         at sun.reflect.NativeMethodAccessorImpl.invoke0(Native Method)
  503.         at sun.reflect.NativeMethodAccessorImpl.invoke(NativeMethodAccessorImpl.java:62)
  504.         at sun.reflect.DelegatingMethodAccessorImpl.invoke(DelegatingMethodAccessorImpl.java:43)
  505.         at java.lang.reflect.Method.invoke(Method.java:498)
  506.         at org.junit.runners.model.FrameworkMethod$1.runReflectiveCall(FrameworkMethod.java:50)
  507.         at org.junit.internal.runners.model.ReflectiveCallable.run(ReflectiveCallable.java:12)
  508.         at org.junit.runners.model.FrameworkMethod.invokeExplosively(FrameworkMethod.java:47)
  509.         at org.junit.internal.runners.statements.InvokeMethod.evaluate(InvokeMethod.java:17)
  510.         at org.junit.internal.runners.statements.ExpectException.evaluate(ExpectException.java:19)
  511.         ... 23 more
  512.  
  513. testIfEmptyPayloadThrowsException(org.xstefank.check.RequiredRowsCheckTest)  Time elapsed: 0 sec  <<< ERROR!
  514. java.lang.Exception: Unexpected exception, expected<java.lang.NullPointerException> but was<java.lang.NoClassDefFoundError>
  515.         at org.junit.internal.runners.statements.ExpectException.evaluate(ExpectException.java:28)
  516.         at org.junit.internal.runners.statements.RunBefores.evaluate(RunBefores.java:26)
  517.         at org.junit.runners.ParentRunner.runLeaf(ParentRunner.java:325)
  518.         at org.junit.runners.BlockJUnit4ClassRunner.runChild(BlockJUnit4ClassRunner.java:78)
  519.         at org.junit.runners.BlockJUnit4ClassRunner.runChild(BlockJUnit4ClassRunner.java:57)
  520.         at org.junit.runners.ParentRunner$3.run(ParentRunner.java:290)
  521.         at org.junit.runners.ParentRunner$1.schedule(ParentRunner.java:71)
  522.         at org.junit.runners.ParentRunner.runChildren(ParentRunner.java:288)
  523.         at org.junit.runners.ParentRunner.access$000(ParentRunner.java:58)
  524.         at org.junit.runners.ParentRunner$2.evaluate(ParentRunner.java:268)
  525.         at org.junit.internal.runners.statements.RunBefores.evaluate(RunBefores.java:26)
  526.         at org.junit.runners.ParentRunner.run(ParentRunner.java:363)
  527.         at org.apache.maven.surefire.junit4.JUnit4Provider.execute(JUnit4Provider.java:252)
  528.         at org.apache.maven.surefire.junit4.JUnit4Provider.executeTestSet(JUnit4Provider.java:141)
  529.         at org.apache.maven.surefire.junit4.JUnit4Provider.invoke(JUnit4Provider.java:112)
  530.         at sun.reflect.NativeMethodAccessorImpl.invoke0(Native Method)
  531.         at sun.reflect.NativeMethodAccessorImpl.invoke(NativeMethodAccessorImpl.java:62)
  532.         at sun.reflect.DelegatingMethodAccessorImpl.invoke(DelegatingMethodAccessorImpl.java:43)
  533.         at java.lang.reflect.Method.invoke(Method.java:498)
  534.         at org.apache.maven.surefire.util.ReflectionUtils.invokeMethodWithArray(ReflectionUtils.java:189)
  535.         at org.apache.maven.surefire.booter.ProviderFactory$ProviderProxy.invoke(ProviderFactory.java:165)
  536.         at org.apache.maven.surefire.booter.ProviderFactory.invokeProvider(ProviderFactory.java:85)
  537.         at org.apache.maven.surefire.booter.ForkedBooter.runSuitesInProcess(ForkedBooter.java:115)
  538.         at org.apache.maven.surefire.booter.ForkedBooter.main(ForkedBooter.java:75)
  539. Caused by: java.lang.NoClassDefFoundError: Could not initialize class org.xstefank.TestUtils
  540.         at org.xstefank.check.RequiredRowsCheckTest.testIfEmptyPayloadThrowsException(RequiredRowsCheckTest.java:51)
  541.         at sun.reflect.NativeMethodAccessorImpl.invoke0(Native Method)
  542.         at sun.reflect.NativeMethodAccessorImpl.invoke(NativeMethodAccessorImpl.java:62)
  543.         at sun.reflect.DelegatingMethodAccessorImpl.invoke(DelegatingMethodAccessorImpl.java:43)
  544.         at java.lang.reflect.Method.invoke(Method.java:498)
  545.         at org.junit.runners.model.FrameworkMethod$1.runReflectiveCall(FrameworkMethod.java:50)
  546.         at org.junit.internal.runners.model.ReflectiveCallable.run(ReflectiveCallable.java:12)
  547.         at org.junit.runners.model.FrameworkMethod.invokeExplosively(FrameworkMethod.java:47)
  548.         at org.junit.internal.runners.statements.InvokeMethod.evaluate(InvokeMethod.java:17)
  549.         at org.junit.internal.runners.statements.ExpectException.evaluate(ExpectException.java:19)
  550.         ... 23 more
  551.  
  552. checkSimpleRegexNonMatch(org.xstefank.check.RequiredRowsCheckTest)  Time elapsed: 0 sec  <<< ERROR!
  553. java.lang.NoClassDefFoundError: Could not initialize class org.xstefank.TestUtils
  554.         at org.xstefank.check.RequiredRowsCheckTest.checkSimpleRegexNonMatch(RequiredRowsCheckTest.java:40)
  555.         at sun.reflect.NativeMethodAccessorImpl.invoke0(Native Method)
  556.         at sun.reflect.NativeMethodAccessorImpl.invoke(NativeMethodAccessorImpl.java:62)
  557.         at sun.reflect.DelegatingMethodAccessorImpl.invoke(DelegatingMethodAccessorImpl.java:43)
  558.         at java.lang.reflect.Method.invoke(Method.java:498)
  559.         at org.junit.runners.model.FrameworkMethod$1.runReflectiveCall(FrameworkMethod.java:50)
  560.         at org.junit.internal.runners.model.ReflectiveCallable.run(ReflectiveCallable.java:12)
  561.         at org.junit.runners.model.FrameworkMethod.invokeExplosively(FrameworkMethod.java:47)
  562.         at org.junit.internal.runners.statements.InvokeMethod.evaluate(InvokeMethod.java:17)
  563.         at org.junit.internal.runners.statements.RunBefores.evaluate(RunBefores.java:26)
  564.         at org.junit.runners.ParentRunner.runLeaf(ParentRunner.java:325)
  565.         at org.junit.runners.BlockJUnit4ClassRunner.runChild(BlockJUnit4ClassRunner.java:78)
  566.         at org.junit.runners.BlockJUnit4ClassRunner.runChild(BlockJUnit4ClassRunner.java:57)
  567.         at org.junit.runners.ParentRunner$3.run(ParentRunner.java:290)
  568.         at org.junit.runners.ParentRunner$1.schedule(ParentRunner.java:71)
  569.         at org.junit.runners.ParentRunner.runChildren(ParentRunner.java:288)
  570.         at org.junit.runners.ParentRunner.access$000(ParentRunner.java:58)
  571.         at org.junit.runners.ParentRunner$2.evaluate(ParentRunner.java:268)
  572.         at org.junit.internal.runners.statements.RunBefores.evaluate(RunBefores.java:26)
  573.         at org.junit.runners.ParentRunner.run(ParentRunner.java:363)
  574.         at org.apache.maven.surefire.junit4.JUnit4Provider.execute(JUnit4Provider.java:252)
  575.         at org.apache.maven.surefire.junit4.JUnit4Provider.executeTestSet(JUnit4Provider.java:141)
  576.         at org.apache.maven.surefire.junit4.JUnit4Provider.invoke(JUnit4Provider.java:112)
  577.         at sun.reflect.NativeMethodAccessorImpl.invoke0(Native Method)
  578.         at sun.reflect.NativeMethodAccessorImpl.invoke(NativeMethodAccessorImpl.java:62)
  579.         at sun.reflect.DelegatingMethodAccessorImpl.invoke(DelegatingMethodAccessorImpl.java:43)
  580.         at java.lang.reflect.Method.invoke(Method.java:498)
  581.         at org.apache.maven.surefire.util.ReflectionUtils.invokeMethodWithArray(ReflectionUtils.java:189)
  582.         at org.apache.maven.surefire.booter.ProviderFactory$ProviderProxy.invoke(ProviderFactory.java:165)
  583.         at org.apache.maven.surefire.booter.ProviderFactory.invokeProvider(ProviderFactory.java:85)
  584.         at org.apache.maven.surefire.booter.ForkedBooter.runSuitesInProcess(ForkedBooter.java:115)
  585.         at org.apache.maven.surefire.booter.ForkedBooter.main(ForkedBooter.java:75)
  586.  
  587. Running org.xstefank.check.TemplateCheckerTest
  588. Tests run: 2, Failures: 0, Errors: 0, Skipped: 0, Time elapsed: 0.008 sec
  589. Running org.xstefank.check.TitleCheckTest
  590. Tests run: 5, Failures: 0, Errors: 3, Skipped: 0, Time elapsed: 0.02 sec <<< FAILURE!
  591. testCheckSimpleRegexMatch(org.xstefank.check.TitleCheckTest)  Time elapsed: 0.001 sec  <<< ERROR!
  592. java.lang.NoClassDefFoundError: Could not initialize class org.xstefank.TestUtils
  593.         at org.xstefank.check.TitleCheckTest.testCheckSimpleRegexMatch(TitleCheckTest.java:36)
  594.         at sun.reflect.NativeMethodAccessorImpl.invoke0(Native Method)
  595.         at sun.reflect.NativeMethodAccessorImpl.invoke(NativeMethodAccessorImpl.java:62)
  596.         at sun.reflect.DelegatingMethodAccessorImpl.invoke(DelegatingMethodAccessorImpl.java:43)
  597.         at java.lang.reflect.Method.invoke(Method.java:498)
  598.         at org.junit.runners.model.FrameworkMethod$1.runReflectiveCall(FrameworkMethod.java:50)
  599.         at org.junit.internal.runners.model.ReflectiveCallable.run(ReflectiveCallable.java:12)
  600.         at org.junit.runners.model.FrameworkMethod.invokeExplosively(FrameworkMethod.java:47)
  601.         at org.junit.internal.runners.statements.InvokeMethod.evaluate(InvokeMethod.java:17)
  602.         at org.junit.internal.runners.statements.RunBefores.evaluate(RunBefores.java:26)
  603.         at org.junit.runners.ParentRunner.runLeaf(ParentRunner.java:325)
  604.         at org.junit.runners.BlockJUnit4ClassRunner.runChild(BlockJUnit4ClassRunner.java:78)
  605.         at org.junit.runners.BlockJUnit4ClassRunner.runChild(BlockJUnit4ClassRunner.java:57)
  606.         at org.junit.runners.ParentRunner$3.run(ParentRunner.java:290)
  607.         at org.junit.runners.ParentRunner$1.schedule(ParentRunner.java:71)
  608.         at org.junit.runners.ParentRunner.runChildren(ParentRunner.java:288)
  609.         at org.junit.runners.ParentRunner.access$000(ParentRunner.java:58)
  610.         at org.junit.runners.ParentRunner$2.evaluate(ParentRunner.java:268)
  611.         at org.junit.runners.ParentRunner.run(ParentRunner.java:363)
  612.         at org.apache.maven.surefire.junit4.JUnit4Provider.execute(JUnit4Provider.java:252)
  613.         at org.apache.maven.surefire.junit4.JUnit4Provider.executeTestSet(JUnit4Provider.java:141)
  614.         at org.apache.maven.surefire.junit4.JUnit4Provider.invoke(JUnit4Provider.java:112)
  615.         at sun.reflect.NativeMethodAccessorImpl.invoke0(Native Method)
  616.         at sun.reflect.NativeMethodAccessorImpl.invoke(NativeMethodAccessorImpl.java:62)
  617.         at sun.reflect.DelegatingMethodAccessorImpl.invoke(DelegatingMethodAccessorImpl.java:43)
  618.         at java.lang.reflect.Method.invoke(Method.java:498)
  619.         at org.apache.maven.surefire.util.ReflectionUtils.invokeMethodWithArray(ReflectionUtils.java:189)
  620.         at org.apache.maven.surefire.booter.ProviderFactory$ProviderProxy.invoke(ProviderFactory.java:165)
  621.         at org.apache.maven.surefire.booter.ProviderFactory.invokeProvider(ProviderFactory.java:85)
  622.         at org.apache.maven.surefire.booter.ForkedBooter.runSuitesInProcess(ForkedBooter.java:115)
  623.         at org.apache.maven.surefire.booter.ForkedBooter.main(ForkedBooter.java:75)
  624.  
  625. testCheckSimpleRegexNonMatchReturnsDefaultMessage(org.xstefank.check.TitleCheckTest)  Time elapsed: 0.003 sec  <<< ERROR!
  626. java.lang.NoClassDefFoundError: Could not initialize class org.xstefank.TestUtils
  627.         at org.xstefank.check.TitleCheckTest.testCheckSimpleRegexNonMatchReturnsDefaultMessage(TitleCheckTest.java:54)
  628.         at sun.reflect.NativeMethodAccessorImpl.invoke0(Native Method)
  629.         at sun.reflect.NativeMethodAccessorImpl.invoke(NativeMethodAccessorImpl.java:62)
  630.         at sun.reflect.DelegatingMethodAccessorImpl.invoke(DelegatingMethodAccessorImpl.java:43)
  631.         at java.lang.reflect.Method.invoke(Method.java:498)
  632.         at org.junit.runners.model.FrameworkMethod$1.runReflectiveCall(FrameworkMethod.java:50)
  633.         at org.junit.internal.runners.model.ReflectiveCallable.run(ReflectiveCallable.java:12)
  634.         at org.junit.runners.model.FrameworkMethod.invokeExplosively(FrameworkMethod.java:47)
  635.         at org.junit.internal.runners.statements.InvokeMethod.evaluate(InvokeMethod.java:17)
  636.         at org.junit.internal.runners.statements.RunBefores.evaluate(RunBefores.java:26)
  637.         at org.junit.runners.ParentRunner.runLeaf(ParentRunner.java:325)
  638.         at org.junit.runners.BlockJUnit4ClassRunner.runChild(BlockJUnit4ClassRunner.java:78)
  639.         at org.junit.runners.BlockJUnit4ClassRunner.runChild(BlockJUnit4ClassRunner.java:57)
  640.         at org.junit.runners.ParentRunner$3.run(ParentRunner.java:290)
  641.         at org.junit.runners.ParentRunner$1.schedule(ParentRunner.java:71)
  642.         at org.junit.runners.ParentRunner.runChildren(ParentRunner.java:288)
  643.         at org.junit.runners.ParentRunner.access$000(ParentRunner.java:58)
  644.         at org.junit.runners.ParentRunner$2.evaluate(ParentRunner.java:268)
  645.         at org.junit.runners.ParentRunner.run(ParentRunner.java:363)
  646.         at org.apache.maven.surefire.junit4.JUnit4Provider.execute(JUnit4Provider.java:252)
  647.         at org.apache.maven.surefire.junit4.JUnit4Provider.executeTestSet(JUnit4Provider.java:141)
  648.         at org.apache.maven.surefire.junit4.JUnit4Provider.invoke(JUnit4Provider.java:112)
  649.         at sun.reflect.NativeMethodAccessorImpl.invoke0(Native Method)
  650.         at sun.reflect.NativeMethodAccessorImpl.invoke(NativeMethodAccessorImpl.java:62)
  651.         at sun.reflect.DelegatingMethodAccessorImpl.invoke(DelegatingMethodAccessorImpl.java:43)
  652.         at java.lang.reflect.Method.invoke(Method.java:498)
  653.         at org.apache.maven.surefire.util.ReflectionUtils.invokeMethodWithArray(ReflectionUtils.java:189)
  654.         at org.apache.maven.surefire.booter.ProviderFactory$ProviderProxy.invoke(ProviderFactory.java:165)
  655.         at org.apache.maven.surefire.booter.ProviderFactory.invokeProvider(ProviderFactory.java:85)
  656.         at org.apache.maven.surefire.booter.ForkedBooter.runSuitesInProcess(ForkedBooter.java:115)
  657.         at org.apache.maven.surefire.booter.ForkedBooter.main(ForkedBooter.java:75)
  658.  
  659. testCheckSimpleRegexNonMatchReturnsExpectedMessage(org.xstefank.check.TitleCheckTest)  Time elapsed: 0 sec  <<< ERROR!
  660. java.lang.NoClassDefFoundError: Could not initialize class org.xstefank.TestUtils
  661.         at org.xstefank.check.TitleCheckTest.testCheckSimpleRegexNonMatchReturnsExpectedMessage(TitleCheckTest.java:45)
  662.         at sun.reflect.NativeMethodAccessorImpl.invoke0(Native Method)
  663.         at sun.reflect.NativeMethodAccessorImpl.invoke(NativeMethodAccessorImpl.java:62)
  664.         at sun.reflect.DelegatingMethodAccessorImpl.invoke(DelegatingMethodAccessorImpl.java:43)
  665.         at java.lang.reflect.Method.invoke(Method.java:498)
  666.         at org.junit.runners.model.FrameworkMethod$1.runReflectiveCall(FrameworkMethod.java:50)
  667.         at org.junit.internal.runners.model.ReflectiveCallable.run(ReflectiveCallable.java:12)
  668.         at org.junit.runners.model.FrameworkMethod.invokeExplosively(FrameworkMethod.java:47)
  669.         at org.junit.internal.runners.statements.InvokeMethod.evaluate(InvokeMethod.java:17)
  670.         at org.junit.internal.runners.statements.RunBefores.evaluate(RunBefores.java:26)
  671.         at org.junit.runners.ParentRunner.runLeaf(ParentRunner.java:325)
  672.         at org.junit.runners.BlockJUnit4ClassRunner.runChild(BlockJUnit4ClassRunner.java:78)
  673.         at org.junit.runners.BlockJUnit4ClassRunner.runChild(BlockJUnit4ClassRunner.java:57)
  674.         at org.junit.runners.ParentRunner$3.run(ParentRunner.java:290)
  675.         at org.junit.runners.ParentRunner$1.schedule(ParentRunner.java:71)
  676.         at org.junit.runners.ParentRunner.runChildren(ParentRunner.java:288)
  677.         at org.junit.runners.ParentRunner.access$000(ParentRunner.java:58)
  678.         at org.junit.runners.ParentRunner$2.evaluate(ParentRunner.java:268)
  679.         at org.junit.runners.ParentRunner.run(ParentRunner.java:363)
  680.         at org.apache.maven.surefire.junit4.JUnit4Provider.execute(JUnit4Provider.java:252)
  681.         at org.apache.maven.surefire.junit4.JUnit4Provider.executeTestSet(JUnit4Provider.java:141)
  682.         at org.apache.maven.surefire.junit4.JUnit4Provider.invoke(JUnit4Provider.java:112)
  683.         at sun.reflect.NativeMethodAccessorImpl.invoke0(Native Method)
  684.         at sun.reflect.NativeMethodAccessorImpl.invoke(NativeMethodAccessorImpl.java:62)
  685.         at sun.reflect.DelegatingMethodAccessorImpl.invoke(DelegatingMethodAccessorImpl.java:43)
  686.         at java.lang.reflect.Method.invoke(Method.java:498)
  687.         at org.apache.maven.surefire.util.ReflectionUtils.invokeMethodWithArray(ReflectionUtils.java:189)
  688.         at org.apache.maven.surefire.booter.ProviderFactory$ProviderProxy.invoke(ProviderFactory.java:165)
  689.         at org.apache.maven.surefire.booter.ProviderFactory.invokeProvider(ProviderFactory.java:85)
  690.         at org.apache.maven.surefire.booter.ForkedBooter.runSuitesInProcess(ForkedBooter.java:115)
  691.         at org.apache.maven.surefire.booter.ForkedBooter.main(ForkedBooter.java:75)
  692.  
  693. Running org.xstefank.model.ConfigTest
  694. Tests run: 3, Failures: 0, Errors: 3, Skipped: 0, Time elapsed: 0.009 sec <<< FAILURE!
  695. readTokenTest(org.xstefank.model.ConfigTest)  Time elapsed: 0.004 sec  <<< ERROR!
  696. java.lang.NoClassDefFoundError: Could not initialize class org.xstefank.TestUtils
  697.         at org.xstefank.model.ConfigTest.<init>(ConfigTest.java:13)
  698.         at sun.reflect.NativeConstructorAccessorImpl.newInstance0(Native Method)
  699.         at sun.reflect.NativeConstructorAccessorImpl.newInstance(NativeConstructorAccessorImpl.java:62)
  700.         at sun.reflect.DelegatingConstructorAccessorImpl.newInstance(DelegatingConstructorAccessorImpl.java:45)
  701.         at java.lang.reflect.Constructor.newInstance(Constructor.java:423)
  702.         at org.junit.runners.BlockJUnit4ClassRunner.createTest(BlockJUnit4ClassRunner.java:217)
  703.         at org.junit.runners.BlockJUnit4ClassRunner$1.runReflectiveCall(BlockJUnit4ClassRunner.java:266)
  704.         at org.junit.internal.runners.model.ReflectiveCallable.run(ReflectiveCallable.java:12)
  705.         at org.junit.runners.BlockJUnit4ClassRunner.methodBlock(BlockJUnit4ClassRunner.java:263)
  706.         at org.junit.runners.BlockJUnit4ClassRunner.runChild(BlockJUnit4ClassRunner.java:78)
  707.         at org.junit.runners.BlockJUnit4ClassRunner.runChild(BlockJUnit4ClassRunner.java:57)
  708.         at org.junit.runners.ParentRunner$3.run(ParentRunner.java:290)
  709.         at org.junit.runners.ParentRunner$1.schedule(ParentRunner.java:71)
  710.         at org.junit.runners.ParentRunner.runChildren(ParentRunner.java:288)
  711.         at org.junit.runners.ParentRunner.access$000(ParentRunner.java:58)
  712.         at org.junit.runners.ParentRunner$2.evaluate(ParentRunner.java:268)
  713.         at org.junit.runners.ParentRunner.run(ParentRunner.java:363)
  714.         at org.apache.maven.surefire.junit4.JUnit4Provider.execute(JUnit4Provider.java:252)
  715.         at org.apache.maven.surefire.junit4.JUnit4Provider.executeTestSet(JUnit4Provider.java:141)
  716.         at org.apache.maven.surefire.junit4.JUnit4Provider.invoke(JUnit4Provider.java:112)
  717.         at sun.reflect.NativeMethodAccessorImpl.invoke0(Native Method)
  718.         at sun.reflect.NativeMethodAccessorImpl.invoke(NativeMethodAccessorImpl.java:62)
  719.         at sun.reflect.DelegatingMethodAccessorImpl.invoke(DelegatingMethodAccessorImpl.java:43)
  720.         at java.lang.reflect.Method.invoke(Method.java:498)
  721.         at org.apache.maven.surefire.util.ReflectionUtils.invokeMethodWithArray(ReflectionUtils.java:189)
  722.         at org.apache.maven.surefire.booter.ProviderFactory$ProviderProxy.invoke(ProviderFactory.java:165)
  723.         at org.apache.maven.surefire.booter.ProviderFactory.invokeProvider(ProviderFactory.java:85)
  724.         at org.apache.maven.surefire.booter.ForkedBooter.runSuitesInProcess(ForkedBooter.java:115)
  725.         at org.apache.maven.surefire.booter.ForkedBooter.main(ForkedBooter.java:75)
  726.  
  727. readUrlTest(org.xstefank.model.ConfigTest)  Time elapsed: 0 sec  <<< ERROR!
  728. java.lang.NoClassDefFoundError: Could not initialize class org.xstefank.TestUtils
  729.         at org.xstefank.model.ConfigTest.<init>(ConfigTest.java:13)
  730.         at sun.reflect.NativeConstructorAccessorImpl.newInstance0(Native Method)
  731.         at sun.reflect.NativeConstructorAccessorImpl.newInstance(NativeConstructorAccessorImpl.java:62)
  732.         at sun.reflect.DelegatingConstructorAccessorImpl.newInstance(DelegatingConstructorAccessorImpl.java:45)
  733.         at java.lang.reflect.Constructor.newInstance(Constructor.java:423)
  734.         at org.junit.runners.BlockJUnit4ClassRunner.createTest(BlockJUnit4ClassRunner.java:217)
  735.         at org.junit.runners.BlockJUnit4ClassRunner$1.runReflectiveCall(BlockJUnit4ClassRunner.java:266)
  736.         at org.junit.internal.runners.model.ReflectiveCallable.run(ReflectiveCallable.java:12)
  737.         at org.junit.runners.BlockJUnit4ClassRunner.methodBlock(BlockJUnit4ClassRunner.java:263)
  738.         at org.junit.runners.BlockJUnit4ClassRunner.runChild(BlockJUnit4ClassRunner.java:78)
  739.         at org.junit.runners.BlockJUnit4ClassRunner.runChild(BlockJUnit4ClassRunner.java:57)
  740.         at org.junit.runners.ParentRunner$3.run(ParentRunner.java:290)
  741.         at org.junit.runners.ParentRunner$1.schedule(ParentRunner.java:71)
  742.         at org.junit.runners.ParentRunner.runChildren(ParentRunner.java:288)
  743.         at org.junit.runners.ParentRunner.access$000(ParentRunner.java:58)
  744.         at org.junit.runners.ParentRunner$2.evaluate(ParentRunner.java:268)
  745.         at org.junit.runners.ParentRunner.run(ParentRunner.java:363)
  746.         at org.apache.maven.surefire.junit4.JUnit4Provider.execute(JUnit4Provider.java:252)
  747.         at org.apache.maven.surefire.junit4.JUnit4Provider.executeTestSet(JUnit4Provider.java:141)
  748.         at org.apache.maven.surefire.junit4.JUnit4Provider.invoke(JUnit4Provider.java:112)
  749.         at sun.reflect.NativeMethodAccessorImpl.invoke0(Native Method)
  750.         at sun.reflect.NativeMethodAccessorImpl.invoke(NativeMethodAccessorImpl.java:62)
  751.         at sun.reflect.DelegatingMethodAccessorImpl.invoke(DelegatingMethodAccessorImpl.java:43)
  752.         at java.lang.reflect.Method.invoke(Method.java:498)
  753.         at org.apache.maven.surefire.util.ReflectionUtils.invokeMethodWithArray(ReflectionUtils.java:189)
  754.         at org.apache.maven.surefire.booter.ProviderFactory$ProviderProxy.invoke(ProviderFactory.java:165)
  755.         at org.apache.maven.surefire.booter.ProviderFactory.invokeProvider(ProviderFactory.java:85)
  756.         at org.apache.maven.surefire.booter.ForkedBooter.runSuitesInProcess(ForkedBooter.java:115)
  757.         at org.apache.maven.surefire.booter.ForkedBooter.main(ForkedBooter.java:75)
  758.  
  759. testValidTemplateConfig(org.xstefank.model.ConfigTest)  Time elapsed: 0 sec  <<< ERROR!
  760. java.lang.NoClassDefFoundError: Could not initialize class org.xstefank.TestUtils
  761.         at org.xstefank.model.ConfigTest.<init>(ConfigTest.java:13)
  762.         at sun.reflect.NativeConstructorAccessorImpl.newInstance0(Native Method)
  763.         at sun.reflect.NativeConstructorAccessorImpl.newInstance(NativeConstructorAccessorImpl.java:62)
  764.         at sun.reflect.DelegatingConstructorAccessorImpl.newInstance(DelegatingConstructorAccessorImpl.java:45)
  765.         at java.lang.reflect.Constructor.newInstance(Constructor.java:423)
  766.         at org.junit.runners.BlockJUnit4ClassRunner.createTest(BlockJUnit4ClassRunner.java:217)
  767.         at org.junit.runners.BlockJUnit4ClassRunner$1.runReflectiveCall(BlockJUnit4ClassRunner.java:266)
  768.         at org.junit.internal.runners.model.ReflectiveCallable.run(ReflectiveCallable.java:12)
  769.         at org.junit.runners.BlockJUnit4ClassRunner.methodBlock(BlockJUnit4ClassRunner.java:263)
  770.         at org.junit.runners.BlockJUnit4ClassRunner.runChild(BlockJUnit4ClassRunner.java:78)
  771.         at org.junit.runners.BlockJUnit4ClassRunner.runChild(BlockJUnit4ClassRunner.java:57)
  772.         at org.junit.runners.ParentRunner$3.run(ParentRunner.java:290)
  773.         at org.junit.runners.ParentRunner$1.schedule(ParentRunner.java:71)
  774.         at org.junit.runners.ParentRunner.runChildren(ParentRunner.java:288)
  775.         at org.junit.runners.ParentRunner.access$000(ParentRunner.java:58)
  776.         at org.junit.runners.ParentRunner$2.evaluate(ParentRunner.java:268)
  777.         at org.junit.runners.ParentRunner.run(ParentRunner.java:363)
  778.         at org.apache.maven.surefire.junit4.JUnit4Provider.execute(JUnit4Provider.java:252)
  779.         at org.apache.maven.surefire.junit4.JUnit4Provider.executeTestSet(JUnit4Provider.java:141)
  780.         at org.apache.maven.surefire.junit4.JUnit4Provider.invoke(JUnit4Provider.java:112)
  781.         at sun.reflect.NativeMethodAccessorImpl.invoke0(Native Method)
  782.         at sun.reflect.NativeMethodAccessorImpl.invoke(NativeMethodAccessorImpl.java:62)
  783.         at sun.reflect.DelegatingMethodAccessorImpl.invoke(DelegatingMethodAccessorImpl.java:43)
  784.         at java.lang.reflect.Method.invoke(Method.java:498)
  785.         at org.apache.maven.surefire.util.ReflectionUtils.invokeMethodWithArray(ReflectionUtils.java:189)
  786.         at org.apache.maven.surefire.booter.ProviderFactory$ProviderProxy.invoke(ProviderFactory.java:165)
  787.         at org.apache.maven.surefire.booter.ProviderFactory.invokeProvider(ProviderFactory.java:85)
  788.         at org.apache.maven.surefire.booter.ForkedBooter.runSuitesInProcess(ForkedBooter.java:115)
  789.         at org.apache.maven.surefire.booter.ForkedBooter.main(ForkedBooter.java:75)
  790.  
  791. Running org.xstefank.model.PersistentListTest
  792. Tests run: 1, Failures: 0, Errors: 1, Skipped: 0, Time elapsed: 0 sec <<< FAILURE!
  793. org.xstefank.model.PersistentListTest  Time elapsed: 0 sec  <<< ERROR!
  794. java.lang.NoClassDefFoundError: Could not initialize class org.xstefank.TestUtils
  795.         at org.xstefank.model.PersistentListTest.beforeClass(PersistentListTest.java:23)
  796.         at sun.reflect.NativeMethodAccessorImpl.invoke0(Native Method)
  797.         at sun.reflect.NativeMethodAccessorImpl.invoke(NativeMethodAccessorImpl.java:62)
  798.         at sun.reflect.DelegatingMethodAccessorImpl.invoke(DelegatingMethodAccessorImpl.java:43)
  799.         at java.lang.reflect.Method.invoke(Method.java:498)
  800.         at org.junit.runners.model.FrameworkMethod$1.runReflectiveCall(FrameworkMethod.java:50)
  801.         at org.junit.internal.runners.model.ReflectiveCallable.run(ReflectiveCallable.java:12)
  802.         at org.junit.runners.model.FrameworkMethod.invokeExplosively(FrameworkMethod.java:47)
  803.         at org.junit.internal.runners.statements.RunBefores.evaluate(RunBefores.java:24)
  804.         at org.junit.runners.ParentRunner.run(ParentRunner.java:363)
  805.         at org.apache.maven.surefire.junit4.JUnit4Provider.execute(JUnit4Provider.java:252)
  806.         at org.apache.maven.surefire.junit4.JUnit4Provider.executeTestSet(JUnit4Provider.java:141)
  807.         at org.apache.maven.surefire.junit4.JUnit4Provider.invoke(JUnit4Provider.java:112)
  808.         at sun.reflect.NativeMethodAccessorImpl.invoke0(Native Method)
  809.         at sun.reflect.NativeMethodAccessorImpl.invoke(NativeMethodAccessorImpl.java:62)
  810.         at sun.reflect.DelegatingMethodAccessorImpl.invoke(DelegatingMethodAccessorImpl.java:43)
  811.         at java.lang.reflect.Method.invoke(Method.java:498)
  812.         at org.apache.maven.surefire.util.ReflectionUtils.invokeMethodWithArray(ReflectionUtils.java:189)
  813.         at org.apache.maven.surefire.booter.ProviderFactory$ProviderProxy.invoke(ProviderFactory.java:165)
  814.         at org.apache.maven.surefire.booter.ProviderFactory.invokeProvider(ProviderFactory.java:85)
  815.         at org.apache.maven.surefire.booter.ForkedBooter.runSuitesInProcess(ForkedBooter.java:115)
  816.         at org.apache.maven.surefire.booter.ForkedBooter.main(ForkedBooter.java:75)
  817.  
  818. Running org.xstefank.ci.TeamCityCITest
  819. Tests run: 1, Failures: 0, Errors: 0, Skipped: 0, Time elapsed: 0 sec
  820. Running org.xstefank.api.GitHubAPITest
  821. Tests run: 2, Failures: 0, Errors: 0, Skipped: 0, Time elapsed: 0.51 sec
  822. Running org.xstefank.verification.VerificationsTest
  823. Tests run: 1, Failures: 0, Errors: 1, Skipped: 0, Time elapsed: 0 sec <<< FAILURE!
  824. org.xstefank.verification.VerificationsTest  Time elapsed: 0 sec  <<< ERROR!
  825. java.lang.NoClassDefFoundError: Could not initialize class org.xstefank.TestUtils
  826.         at org.xstefank.verification.VerificationsTest.beforeClass(VerificationsTest.java:17)
  827.         at sun.reflect.NativeMethodAccessorImpl.invoke0(Native Method)
  828.         at sun.reflect.NativeMethodAccessorImpl.invoke(NativeMethodAccessorImpl.java:62)
  829.         at sun.reflect.DelegatingMethodAccessorImpl.invoke(DelegatingMethodAccessorImpl.java:43)
  830.         at java.lang.reflect.Method.invoke(Method.java:498)
  831.         at org.junit.runners.model.FrameworkMethod$1.runReflectiveCall(FrameworkMethod.java:50)
  832.         at org.junit.internal.runners.model.ReflectiveCallable.run(ReflectiveCallable.java:12)
  833.         at org.junit.runners.model.FrameworkMethod.invokeExplosively(FrameworkMethod.java:47)
  834.         at org.junit.internal.runners.statements.RunBefores.evaluate(RunBefores.java:24)
  835.         at org.junit.runners.ParentRunner.run(ParentRunner.java:363)
  836.         at org.apache.maven.surefire.junit4.JUnit4Provider.execute(JUnit4Provider.java:252)
  837.         at org.apache.maven.surefire.junit4.JUnit4Provider.executeTestSet(JUnit4Provider.java:141)
  838.         at org.apache.maven.surefire.junit4.JUnit4Provider.invoke(JUnit4Provider.java:112)
  839.         at sun.reflect.NativeMethodAccessorImpl.invoke0(Native Method)
  840.         at sun.reflect.NativeMethodAccessorImpl.invoke(NativeMethodAccessorImpl.java:62)
  841.         at sun.reflect.DelegatingMethodAccessorImpl.invoke(DelegatingMethodAccessorImpl.java:43)
  842.         at java.lang.reflect.Method.invoke(Method.java:498)
  843.         at org.apache.maven.surefire.util.ReflectionUtils.invokeMethodWithArray(ReflectionUtils.java:189)
  844.         at org.apache.maven.surefire.booter.ProviderFactory$ProviderProxy.invoke(ProviderFactory.java:165)
  845.         at org.apache.maven.surefire.booter.ProviderFactory.invokeProvider(ProviderFactory.java:85)
  846.         at org.apache.maven.surefire.booter.ForkedBooter.runSuitesInProcess(ForkedBooter.java:115)
  847.         at org.apache.maven.surefire.booter.ForkedBooter.main(ForkedBooter.java:75)
  848.  
  849. Running org.xstefank.whitelist.RetestCommandTest
  850. Tests run: 2, Failures: 0, Errors: 2, Skipped: 0, Time elapsed: 0.228 sec <<< FAILURE!
  851. org.xstefank.whitelist.RetestCommandTest  Time elapsed: 0.228 sec  <<< ERROR!
  852. java.lang.ExceptionInInitializerError
  853.         at org.xstefank.whitelist.CommandTest.beforeClass(CommandTest.java:40)
  854.         at sun.reflect.NativeMethodAccessorImpl.invoke0(Native Method)
  855.         at sun.reflect.NativeMethodAccessorImpl.invoke(NativeMethodAccessorImpl.java:62)
  856.         at sun.reflect.DelegatingMethodAccessorImpl.invoke(DelegatingMethodAccessorImpl.java:43)
  857.         at java.lang.reflect.Method.invoke(Method.java:498)
  858.         at org.junit.internal.runners.ClassRoadie.runBefores(ClassRoadie.java:56)
  859.         at org.junit.internal.runners.ClassRoadie.runProtected(ClassRoadie.java:43)
  860.         at org.powermock.modules.junit4.internal.impl.PowerMockJUnit44RunnerDelegateImpl.run(PowerMockJUnit44RunnerDelegateImpl.java:136)
  861.         at org.powermock.modules.junit4.common.internal.impl.JUnit4TestSuiteChunkerImpl.run(JUnit4TestSuiteChunkerImpl.java:121)
  862.         at org.powermock.modules.junit4.common.internal.impl.AbstractCommonPowerMockRunner.run(AbstractCommonPowerMockRunner.java:57)
  863.         at org.powermock.modules.junit4.PowerMockRunner.run(PowerMockRunner.java:59)
  864.         at org.apache.maven.surefire.junit4.JUnit4Provider.execute(JUnit4Provider.java:252)
  865.         at org.apache.maven.surefire.junit4.JUnit4Provider.executeTestSet(JUnit4Provider.java:141)
  866.         at org.apache.maven.surefire.junit4.JUnit4Provider.invoke(JUnit4Provider.java:112)
  867.         at sun.reflect.NativeMethodAccessorImpl.invoke0(Native Method)
  868.         at sun.reflect.NativeMethodAccessorImpl.invoke(NativeMethodAccessorImpl.java:62)
  869.         at sun.reflect.DelegatingMethodAccessorImpl.invoke(DelegatingMethodAccessorImpl.java:43)
  870.         at java.lang.reflect.Method.invoke(Method.java:498)
  871.         at org.apache.maven.surefire.util.ReflectionUtils.invokeMethodWithArray(ReflectionUtils.java:189)
  872.         at org.apache.maven.surefire.booter.ProviderFactory$ProviderProxy.invoke(ProviderFactory.java:165)
  873.         at org.apache.maven.surefire.booter.ProviderFactory.invokeProvider(ProviderFactory.java:85)
  874.         at org.apache.maven.surefire.booter.ForkedBooter.runSuitesInProcess(ForkedBooter.java:115)
  875.         at org.apache.maven.surefire.booter.ForkedBooter.main(ForkedBooter.java:75)
  876. Caused by: java.lang.RuntimeException: Cannot load file json/testPayload.json
  877.         at org.xstefank.TestUtils.loadJson(TestUtils.java:78)
  878.         at org.xstefank.TestUtils.<clinit>(TestUtils.java:24)
  879.         ... 23 more
  880.  
  881. org.xstefank.whitelist.RetestCommandTest  Time elapsed: 0.228 sec  <<< ERROR!
  882. java.lang.NoClassDefFoundError: Could not initialize class org.xstefank.TestUtils
  883.         at org.xstefank.whitelist.CommandTest.afterClass(CommandTest.java:65)
  884.         at sun.reflect.NativeMethodAccessorImpl.invoke0(Native Method)
  885.         at sun.reflect.NativeMethodAccessorImpl.invoke(NativeMethodAccessorImpl.java:62)
  886.         at sun.reflect.DelegatingMethodAccessorImpl.invoke(DelegatingMethodAccessorImpl.java:43)
  887.         at java.lang.reflect.Method.invoke(Method.java:498)
  888.         at org.junit.internal.runners.ClassRoadie.runAfters(ClassRoadie.java:73)
  889.         at org.junit.internal.runners.ClassRoadie.runProtected(ClassRoadie.java:47)
  890.         at org.powermock.modules.junit4.internal.impl.PowerMockJUnit44RunnerDelegateImpl.run(PowerMockJUnit44RunnerDelegateImpl.java:136)
  891.         at org.powermock.modules.junit4.common.internal.impl.JUnit4TestSuiteChunkerImpl.run(JUnit4TestSuiteChunkerImpl.java:121)
  892.         at org.powermock.modules.junit4.common.internal.impl.AbstractCommonPowerMockRunner.run(AbstractCommonPowerMockRunner.java:57)
  893.         at org.powermock.modules.junit4.PowerMockRunner.run(PowerMockRunner.java:59)
  894.         at org.apache.maven.surefire.junit4.JUnit4Provider.execute(JUnit4Provider.java:252)
  895.         at org.apache.maven.surefire.junit4.JUnit4Provider.executeTestSet(JUnit4Provider.java:141)
  896.         at org.apache.maven.surefire.junit4.JUnit4Provider.invoke(JUnit4Provider.java:112)
  897.         at sun.reflect.NativeMethodAccessorImpl.invoke0(Native Method)
  898.         at sun.reflect.NativeMethodAccessorImpl.invoke(NativeMethodAccessorImpl.java:62)
  899.         at sun.reflect.DelegatingMethodAccessorImpl.invoke(DelegatingMethodAccessorImpl.java:43)
  900.         at java.lang.reflect.Method.invoke(Method.java:498)
  901.         at org.apache.maven.surefire.util.ReflectionUtils.invokeMethodWithArray(ReflectionUtils.java:189)
  902.         at org.apache.maven.surefire.booter.ProviderFactory$ProviderProxy.invoke(ProviderFactory.java:165)
  903.         at org.apache.maven.surefire.booter.ProviderFactory.invokeProvider(ProviderFactory.java:85)
  904.         at org.apache.maven.surefire.booter.ForkedBooter.runSuitesInProcess(ForkedBooter.java:115)
  905.         at org.apache.maven.surefire.booter.ForkedBooter.main(ForkedBooter.java:75)
  906.  
  907. Running org.xstefank.whitelist.AddUserCommandTest
  908. Tests run: 2, Failures: 0, Errors: 2, Skipped: 0, Time elapsed: 0.209 sec <<< FAILURE!
  909. org.xstefank.whitelist.AddUserCommandTest  Time elapsed: 0.208 sec  <<< ERROR!
  910. java.lang.ExceptionInInitializerError
  911.         at org.xstefank.whitelist.CommandTest.beforeClass(CommandTest.java:40)
  912.         at sun.reflect.NativeMethodAccessorImpl.invoke0(Native Method)
  913.         at sun.reflect.NativeMethodAccessorImpl.invoke(NativeMethodAccessorImpl.java:62)
  914.         at sun.reflect.DelegatingMethodAccessorImpl.invoke(DelegatingMethodAccessorImpl.java:43)
  915.         at java.lang.reflect.Method.invoke(Method.java:498)
  916.         at org.junit.internal.runners.ClassRoadie.runBefores(ClassRoadie.java:56)
  917.         at org.junit.internal.runners.ClassRoadie.runProtected(ClassRoadie.java:43)
  918.         at org.powermock.modules.junit4.internal.impl.PowerMockJUnit44RunnerDelegateImpl.run(PowerMockJUnit44RunnerDelegateImpl.java:136)
  919.         at org.powermock.modules.junit4.common.internal.impl.JUnit4TestSuiteChunkerImpl.run(JUnit4TestSuiteChunkerImpl.java:121)
  920.         at org.powermock.modules.junit4.common.internal.impl.AbstractCommonPowerMockRunner.run(AbstractCommonPowerMockRunner.java:57)
  921.         at org.powermock.modules.junit4.PowerMockRunner.run(PowerMockRunner.java:59)
  922.         at org.apache.maven.surefire.junit4.JUnit4Provider.execute(JUnit4Provider.java:252)
  923.         at org.apache.maven.surefire.junit4.JUnit4Provider.executeTestSet(JUnit4Provider.java:141)
  924.         at org.apache.maven.surefire.junit4.JUnit4Provider.invoke(JUnit4Provider.java:112)
  925.         at sun.reflect.NativeMethodAccessorImpl.invoke0(Native Method)
  926.         at sun.reflect.NativeMethodAccessorImpl.invoke(NativeMethodAccessorImpl.java:62)
  927.         at sun.reflect.DelegatingMethodAccessorImpl.invoke(DelegatingMethodAccessorImpl.java:43)
  928.         at java.lang.reflect.Method.invoke(Method.java:498)
  929.         at org.apache.maven.surefire.util.ReflectionUtils.invokeMethodWithArray(ReflectionUtils.java:189)
  930.         at org.apache.maven.surefire.booter.ProviderFactory$ProviderProxy.invoke(ProviderFactory.java:165)
  931.         at org.apache.maven.surefire.booter.ProviderFactory.invokeProvider(ProviderFactory.java:85)
  932.         at org.apache.maven.surefire.booter.ForkedBooter.runSuitesInProcess(ForkedBooter.java:115)
  933.         at org.apache.maven.surefire.booter.ForkedBooter.main(ForkedBooter.java:75)
  934. Caused by: java.lang.RuntimeException: Cannot load file json/testPayload.json
  935.         at org.xstefank.TestUtils.loadJson(TestUtils.java:78)
  936.         at org.xstefank.TestUtils.<clinit>(TestUtils.java:24)
  937.         ... 23 more
  938.  
  939. org.xstefank.whitelist.AddUserCommandTest  Time elapsed: 0.209 sec  <<< ERROR!
  940. java.lang.NoClassDefFoundError: Could not initialize class org.xstefank.TestUtils
  941.         at org.xstefank.whitelist.CommandTest.afterClass(CommandTest.java:65)
  942.         at sun.reflect.NativeMethodAccessorImpl.invoke0(Native Method)
  943.         at sun.reflect.NativeMethodAccessorImpl.invoke(NativeMethodAccessorImpl.java:62)
  944.         at sun.reflect.DelegatingMethodAccessorImpl.invoke(DelegatingMethodAccessorImpl.java:43)
  945.         at java.lang.reflect.Method.invoke(Method.java:498)
  946.         at org.junit.internal.runners.ClassRoadie.runAfters(ClassRoadie.java:73)
  947.         at org.junit.internal.runners.ClassRoadie.runProtected(ClassRoadie.java:47)
  948.         at org.powermock.modules.junit4.internal.impl.PowerMockJUnit44RunnerDelegateImpl.run(PowerMockJUnit44RunnerDelegateImpl.java:136)
  949.         at org.powermock.modules.junit4.common.internal.impl.JUnit4TestSuiteChunkerImpl.run(JUnit4TestSuiteChunkerImpl.java:121)
  950.         at org.powermock.modules.junit4.common.internal.impl.AbstractCommonPowerMockRunner.run(AbstractCommonPowerMockRunner.java:57)
  951.         at org.powermock.modules.junit4.PowerMockRunner.run(PowerMockRunner.java:59)
  952.         at org.apache.maven.surefire.junit4.JUnit4Provider.execute(JUnit4Provider.java:252)
  953.         at org.apache.maven.surefire.junit4.JUnit4Provider.executeTestSet(JUnit4Provider.java:141)
  954.         at org.apache.maven.surefire.junit4.JUnit4Provider.invoke(JUnit4Provider.java:112)
  955.         at sun.reflect.NativeMethodAccessorImpl.invoke0(Native Method)
  956.         at sun.reflect.NativeMethodAccessorImpl.invoke(NativeMethodAccessorImpl.java:62)
  957.         at sun.reflect.DelegatingMethodAccessorImpl.invoke(DelegatingMethodAccessorImpl.java:43)
  958.         at java.lang.reflect.Method.invoke(Method.java:498)
  959.         at org.apache.maven.surefire.util.ReflectionUtils.invokeMethodWithArray(ReflectionUtils.java:189)
  960.         at org.apache.maven.surefire.booter.ProviderFactory$ProviderProxy.invoke(ProviderFactory.java:165)
  961.         at org.apache.maven.surefire.booter.ProviderFactory.invokeProvider(ProviderFactory.java:85)
  962.         at org.apache.maven.surefire.booter.ForkedBooter.runSuitesInProcess(ForkedBooter.java:115)
  963.         at org.apache.maven.surefire.booter.ForkedBooter.main(ForkedBooter.java:75)
  964.  
  965.  
  966. Results :
  967.  
  968. Tests in error:
  969.   testNullConfigParameter(org.xstefank.check.SkipCheckTest)
  970.   testNullPayloadParameter(org.xstefank.check.SkipCheckTest): Could not initialize class org.xstefank.TestUtils
  971.   testSkipByTitleRegexMatch(org.xstefank.check.SkipCheckTest): Could not initialize class org.xstefank.TestUtils
  972.   testSkipByTitleRegexNonMatch(org.xstefank.check.SkipCheckTest): Could not initialize class org.xstefank.TestUtils
  973.   testSkipByCommitRegexMatch(org.xstefank.check.SkipCheckTest): Could not initialize class org.xstefank.TestUtils
  974.   testSkipByCommitRegexNonMatch(org.xstefank.check.SkipCheckTest): Could not initialize class org.xstefank.TestUtils
  975.   testSkipByPullRequestDescriptionRegexMatch(org.xstefank.check.SkipCheckTest): Could not initialize class org.xstefank.TestUtils
  976.   testSkipByPullRequestDescriptionRegexNonMatch(org.xstefank.check.SkipCheckTest): Could not initialize class org.xstefank.TestUtils
  977.   testShouldSkipEmptySkipPatterns(org.xstefank.check.SkipCheckTest): Could not initialize class org.xstefank.TestUtils
  978.   testCheckSimpleRegexNonMatchReturnsExpectedMessage(org.xstefank.check.LatestCommitCheckTest)
  979.   testNullCommitParameter(org.xstefank.check.LatestCommitCheckTest): Could not initialize class org.xstefank.TestUtils
  980.   testNullCommitPatternParameter(org.xstefank.check.LatestCommitCheckTest): Could not initialize class org.xstefank.TestUtils
  981.   testCheckSimpleRegexMatch(org.xstefank.check.LatestCommitCheckTest): Could not initialize class org.xstefank.TestUtils
  982.   testCheckSimpleRegexNonMatchReturnsDefaultMessage(org.xstefank.check.LatestCommitCheckTest): Could not initialize class org.xstefank.TestUtils
  983.   testCheckEmptyPayload(org.xstefank.check.additional.OneCommitOnlyCheckTest): Unexpected exception, expected<java.lang.NullPointerException> but was<java.lang.ExceptionInInitializerError>
  984.   testIfPayloadHasMoreCommits(org.xstefank.check.additional.OneCommitOnlyCheckTest): Could not initialize class org.xstefank.TestUtils
  985.   testIfPayloadHasOnlyOneCommit(org.xstefank.check.additional.OneCommitOnlyCheckTest): Could not initialize class org.xstefank.TestUtils
  986.   testIfEmptyPayloadThrowsException(org.xstefank.check.additional.TitleIssueLinkIncludedCheckTest): Unexpected exception, expected<java.lang.NullPointerException> but was<java.lang.NoClassDefFoundError>
  987.   testIfTitleHasRightFormat(org.xstefank.check.additional.TitleIssueLinkIncludedCheckTest): Could not initialize class org.xstefank.TestUtils
  988.   testIfTitleHasBadFormat(org.xstefank.check.additional.TitleIssueLinkIncludedCheckTest): Could not initialize class org.xstefank.TestUtils
  989.   checkSimpleRegexMatch(org.xstefank.check.RequiredRowsCheckTest): Could not initialize class org.xstefank.TestUtils
  990.   testIfNullParameterThrowsException(org.xstefank.check.RequiredRowsCheckTest): Unexpected exception, expected<java.lang.NullPointerException> but was<java.lang.NoClassDefFoundError>
  991.   testIfEmptyPayloadThrowsException(org.xstefank.check.RequiredRowsCheckTest): Unexpected exception, expected<java.lang.NullPointerException> but was<java.lang.NoClassDefFoundError>
  992.   checkSimpleRegexNonMatch(org.xstefank.check.RequiredRowsCheckTest): Could not initialize class org.xstefank.TestUtils
  993.   testCheckSimpleRegexMatch(org.xstefank.check.TitleCheckTest): Could not initialize class org.xstefank.TestUtils
  994.   testCheckSimpleRegexNonMatchReturnsDefaultMessage(org.xstefank.check.TitleCheckTest): Could not initialize class org.xstefank.TestUtils
  995.   testCheckSimpleRegexNonMatchReturnsExpectedMessage(org.xstefank.check.TitleCheckTest): Could not initialize class org.xstefank.TestUtils
  996.   readTokenTest(org.xstefank.model.ConfigTest): Could not initialize class org.xstefank.TestUtils
  997.   readUrlTest(org.xstefank.model.ConfigTest): Could not initialize class org.xstefank.TestUtils
  998.   testValidTemplateConfig(org.xstefank.model.ConfigTest): Could not initialize class org.xstefank.TestUtils
  999.   org.xstefank.model.PersistentListTest: Could not initialize class org.xstefank.TestUtils
  1000.   org.xstefank.verification.VerificationsTest: Could not initialize class org.xstefank.TestUtils
  1001.   org.xstefank.whitelist.RetestCommandTest
  1002.   org.xstefank.whitelist.RetestCommandTest: Could not initialize class org.xstefank.TestUtils
  1003.   org.xstefank.whitelist.AddUserCommandTest
  1004.   org.xstefank.whitelist.AddUserCommandTest: Could not initialize class org.xstefank.TestUtils
  1005.  
  1006. Tests run: 45, Failures: 0, Errors: 36, Skipped: 0
  1007.  
  1008. [INFO] ------------------------------------------------------------------------
  1009. [INFO] BUILD FAILURE
  1010. [INFO] ------------------------------------------------------------------------
  1011. [INFO] Total time: 5.144 s
  1012. [INFO] Finished at: 2019-03-21T10:04:08+01:00
  1013. [INFO] Final Memory: 31M/308M
  1014. [INFO] ------------------------------------------------------------------------
  1015. [ERROR] Failed to execute goal org.apache.maven.plugins:maven-surefire-plugin:2.12.4:test (default-test) on project tyr: There are test failures.
  1016. [ERROR]
  1017. [ERROR] Please refer to /home/khermano/Devel/new tyr/tyr/target/surefire-reports for the individual test results.
  1018. [ERROR] -> [Help 1]
  1019. [ERROR]
  1020. [ERROR] To see the full stack trace of the errors, re-run Maven with the -e switch.
  1021. [ERROR] Re-run Maven using the -X switch to enable full debug logging.
  1022. [ERROR]
  1023. [ERROR] For more information about the errors and possible solutions, please read the following articles:
  1024. [ERROR] [Help 1] http://cwiki.apache.org/confluence/display/MAVEN/MojoFailureException
RAW Paste Data
We use cookies for various purposes including analytics. By continuing to use Pastebin, you agree to our use of cookies as described in the Cookies Policy. OK, I Understand
 
Top